hadoop-yarn-dev mailing list archives

Site index · List index
Message view « Date » · « Thread »
Top « Date » · « Thread »
From Apache Jenkins Server <jenk...@builds.apache.org>
Subject Build failed in Jenkins: Hadoop-Yarn-trunk-Java8 #936
Date Wed, 20 Jan 2016 20:05:11 GMT
See <https://builds.apache.org/job/Hadoop-Yarn-trunk-Java8/936/changes>

Changes:

[cmccabe] HDFS-9576: HTrace: collect position/length information on read

------------------------------------------
[...truncated 4388 lines...]
Tests run: 8, Failures: 0, Errors: 0, Skipped: 0, Time elapsed: 1.042 sec - in org.apache.hadoop.yarn.server.nodemanager.TestLinuxContainerExecutorWithMocks
Java HotSpot(TM) 64-Bit Server VM warning: ignoring option MaxPermSize=768m; support was removed
in 8.0
Running org.apache.hadoop.yarn.server.nodemanager.TestDockerContainerExecutorWithMocks
Tests run: 4, Failures: 0, Errors: 0, Skipped: 0, Time elapsed: 1.034 sec - in org.apache.hadoop.yarn.server.nodemanager.TestDockerContainerExecutorWithMocks
Java HotSpot(TM) 64-Bit Server VM warning: ignoring option MaxPermSize=768m; support was removed
in 8.0
Running org.apache.hadoop.yarn.server.nodemanager.TestContainerExecutor
Tests run: 5, Failures: 0, Errors: 0, Skipped: 3, Time elapsed: 0.682 sec - in org.apache.hadoop.yarn.server.nodemanager.TestContainerExecutor
Java HotSpot(TM) 64-Bit Server VM warning: ignoring option MaxPermSize=768m; support was removed
in 8.0
Running org.apache.hadoop.yarn.server.nodemanager.TestNodeManagerResync
Tests run: 6, Failures: 0, Errors: 0, Skipped: 0, Time elapsed: 29.842 sec - in org.apache.hadoop.yarn.server.nodemanager.TestNodeManagerResync
Java HotSpot(TM) 64-Bit Server VM warning: ignoring option MaxPermSize=768m; support was removed
in 8.0
Running org.apache.hadoop.yarn.server.nodemanager.TestNodeStatusUpdater
Tests run: 17, Failures: 0, Errors: 0, Skipped: 0, Time elapsed: 74.012 sec - in org.apache.hadoop.yarn.server.nodemanager.TestNodeStatusUpdater
Java HotSpot(TM) 64-Bit Server VM warning: ignoring option MaxPermSize=768m; support was removed
in 8.0
Running org.apache.hadoop.yarn.server.nodemanager.metrics.TestNodeManagerMetrics
Tests run: 1, Failures: 0, Errors: 0, Skipped: 0, Time elapsed: 0.746 sec - in org.apache.hadoop.yarn.server.nodemanager.metrics.TestNodeManagerMetrics
Java HotSpot(TM) 64-Bit Server VM warning: ignoring option MaxPermSize=768m; support was removed
in 8.0
Running org.apache.hadoop.yarn.server.nodemanager.TestNodeHealthService
Tests run: 1, Failures: 0, Errors: 0, Skipped: 0, Time elapsed: 0.943 sec - in org.apache.hadoop.yarn.server.nodemanager.TestNodeHealthService
Java HotSpot(TM) 64-Bit Server VM warning: ignoring option MaxPermSize=768m; support was removed
in 8.0
Running org.apache.hadoop.yarn.server.nodemanager.TestDockerContainerExecutor
Tests run: 1, Failures: 0, Errors: 0, Skipped: 0, Time elapsed: 3.154 sec - in org.apache.hadoop.yarn.server.nodemanager.TestDockerContainerExecutor
Java HotSpot(TM) 64-Bit Server VM warning: ignoring option MaxPermSize=768m; support was removed
in 8.0
Running org.apache.hadoop.yarn.server.nodemanager.security.TestNMContainerTokenSecretManager
Tests run: 1, Failures: 0, Errors: 0, Skipped: 0, Time elapsed: 0.963 sec - in org.apache.hadoop.yarn.server.nodemanager.security.TestNMContainerTokenSecretManager
Java HotSpot(TM) 64-Bit Server VM warning: ignoring option MaxPermSize=768m; support was removed
in 8.0
Running org.apache.hadoop.yarn.server.nodemanager.security.TestNMTokenSecretManagerInNM
Tests run: 1, Failures: 0, Errors: 0, Skipped: 0, Time elapsed: 0.906 sec - in org.apache.hadoop.yarn.server.nodemanager.security.TestNMTokenSecretManagerInNM
Java HotSpot(TM) 64-Bit Server VM warning: ignoring option MaxPermSize=768m; support was removed
in 8.0
Running org.apache.hadoop.yarn.server.nodemanager.TestDeletionService
Tests run: 6, Failures: 0, Errors: 0, Skipped: 0, Time elapsed: 22.898 sec - in org.apache.hadoop.yarn.server.nodemanager.TestDeletionService
Java HotSpot(TM) 64-Bit Server VM warning: ignoring option MaxPermSize=768m; support was removed
in 8.0
Running org.apache.hadoop.yarn.server.nodemanager.TestNodeStatusUpdaterForLabels
Tests run: 2, Failures: 0, Errors: 0, Skipped: 0, Time elapsed: 9.041 sec - in org.apache.hadoop.yarn.server.nodemanager.TestNodeStatusUpdaterForLabels
Java HotSpot(TM) 64-Bit Server VM warning: ignoring option MaxPermSize=768m; support was removed
in 8.0
Running org.apache.hadoop.yarn.server.nodemanager.nodelabels.TestConfigurationNodeLabelsProvider
Tests run: 3, Failures: 0, Errors: 0, Skipped: 0, Time elapsed: 2.622 sec - in org.apache.hadoop.yarn.server.nodemanager.nodelabels.TestConfigurationNodeLabelsProvider
Java HotSpot(TM) 64-Bit Server VM warning: ignoring option MaxPermSize=768m; support was removed
in 8.0
Running org.apache.hadoop.yarn.server.nodemanager.nodelabels.TestScriptBasedNodeLabelsProvider
Tests run: 3, Failures: 0, Errors: 0, Skipped: 0, Time elapsed: 5.393 sec - in org.apache.hadoop.yarn.server.nodemanager.nodelabels.TestScriptBasedNodeLabelsProvider
Java HotSpot(TM) 64-Bit Server VM warning: ignoring option MaxPermSize=768m; support was removed
in 8.0
Running org.apache.hadoop.yarn.server.nodemanager.api.protocolrecords.impl.pb.TestPBLocalizerRPC
Tests run: 1, Failures: 0, Errors: 0, Skipped: 0, Time elapsed: 0.865 sec - in org.apache.hadoop.yarn.server.nodemanager.api.protocolrecords.impl.pb.TestPBLocalizerRPC
Java HotSpot(TM) 64-Bit Server VM warning: ignoring option MaxPermSize=768m; support was removed
in 8.0
Running org.apache.hadoop.yarn.server.nodemanager.api.protocolrecords.impl.pb.TestPBRecordImpl
Tests run: 4, Failures: 0, Errors: 0, Skipped: 0, Time elapsed: 0.516 sec - in org.apache.hadoop.yarn.server.nodemanager.api.protocolrecords.impl.pb.TestPBRecordImpl
Java HotSpot(TM) 64-Bit Server VM warning: ignoring option MaxPermSize=768m; support was removed
in 8.0
Running org.apache.hadoop.yarn.server.nodemanager.containermanager.monitor.TestContainerMetrics
Tests run: 3, Failures: 0, Errors: 0, Skipped: 0, Time elapsed: 1.307 sec - in org.apache.hadoop.yarn.server.nodemanager.containermanager.monitor.TestContainerMetrics
Java HotSpot(TM) 64-Bit Server VM warning: ignoring option MaxPermSize=768m; support was removed
in 8.0
Running org.apache.hadoop.yarn.server.nodemanager.containermanager.monitor.TestContainersMonitor
Tests run: 3, Failures: 0, Errors: 0, Skipped: 0, Time elapsed: 7.12 sec - in org.apache.hadoop.yarn.server.nodemanager.containermanager.monitor.TestContainersMonitor
Java HotSpot(TM) 64-Bit Server VM warning: ignoring option MaxPermSize=768m; support was removed
in 8.0
Running org.apache.hadoop.yarn.server.nodemanager.containermanager.monitor.TestContainersMonitorResourceChange
Tests run: 2, Failures: 0, Errors: 0, Skipped: 0, Time elapsed: 2.499 sec - in org.apache.hadoop.yarn.server.nodemanager.containermanager.monitor.TestContainersMonitorResourceChange
Java HotSpot(TM) 64-Bit Server VM warning: ignoring option MaxPermSize=768m; support was removed
in 8.0
Running org.apache.hadoop.yarn.server.nodemanager.containermanager.application.TestApplication
Tests run: 8, Failures: 0, Errors: 0, Skipped: 0, Time elapsed: 5.286 sec - in org.apache.hadoop.yarn.server.nodemanager.containermanager.application.TestApplication
Java HotSpot(TM) 64-Bit Server VM warning: ignoring option MaxPermSize=768m; support was removed
in 8.0
Running org.apache.hadoop.yarn.server.nodemanager.containermanager.TestContainerManager
Tests run: 16, Failures: 0, Errors: 0, Skipped: 0, Time elapsed: 38.717 sec - in org.apache.hadoop.yarn.server.nodemanager.containermanager.TestContainerManager
Java HotSpot(TM) 64-Bit Server VM warning: ignoring option MaxPermSize=768m; support was removed
in 8.0
Running org.apache.hadoop.yarn.server.nodemanager.containermanager.linux.privileged.TestPrivilegedOperationExecutor
Tests run: 4, Failures: 0, Errors: 0, Skipped: 0, Time elapsed: 0.507 sec - in org.apache.hadoop.yarn.server.nodemanager.containermanager.linux.privileged.TestPrivilegedOperationExecutor
Java HotSpot(TM) 64-Bit Server VM warning: ignoring option MaxPermSize=768m; support was removed
in 8.0
Running org.apache.hadoop.yarn.server.nodemanager.containermanager.linux.resources.TestTrafficControlBandwidthHandlerImpl
Tests run: 2, Failures: 0, Errors: 0, Skipped: 0, Time elapsed: 0.707 sec - in org.apache.hadoop.yarn.server.nodemanager.containermanager.linux.resources.TestTrafficControlBandwidthHandlerImpl
Java HotSpot(TM) 64-Bit Server VM warning: ignoring option MaxPermSize=768m; support was removed
in 8.0
Running org.apache.hadoop.yarn.server.nodemanager.containermanager.linux.resources.TestResourceHandlerModule
Tests run: 2, Failures: 0, Errors: 0, Skipped: 0, Time elapsed: 0.574 sec - in org.apache.hadoop.yarn.server.nodemanager.containermanager.linux.resources.TestResourceHandlerModule
Java HotSpot(TM) 64-Bit Server VM warning: ignoring option MaxPermSize=768m; support was removed
in 8.0
Running org.apache.hadoop.yarn.server.nodemanager.containermanager.linux.resources.TestCGroupsHandlerImpl
Tests run: 4, Failures: 0, Errors: 0, Skipped: 0, Time elapsed: 0.719 sec - in org.apache.hadoop.yarn.server.nodemanager.containermanager.linux.resources.TestCGroupsHandlerImpl
Java HotSpot(TM) 64-Bit Server VM warning: ignoring option MaxPermSize=768m; support was removed
in 8.0
Running org.apache.hadoop.yarn.server.nodemanager.containermanager.linux.resources.TestTrafficController
Tests run: 5, Failures: 0, Errors: 0, Skipped: 0, Time elapsed: 0.75 sec - in org.apache.hadoop.yarn.server.nodemanager.containermanager.linux.resources.TestTrafficController
Java HotSpot(TM) 64-Bit Server VM warning: ignoring option MaxPermSize=768m; support was removed
in 8.0
Running org.apache.hadoop.yarn.server.nodemanager.containermanager.linux.resources.TestCGroupsBlkioResourceHandlerImpl
Tests run: 5, Failures: 0, Errors: 0, Skipped: 0, Time elapsed: 0.459 sec - in org.apache.hadoop.yarn.server.nodemanager.containermanager.linux.resources.TestCGroupsBlkioResourceHandlerImpl
Java HotSpot(TM) 64-Bit Server VM warning: ignoring option MaxPermSize=768m; support was removed
in 8.0
Running org.apache.hadoop.yarn.server.nodemanager.containermanager.linux.resources.TestCGroupsMemoryResourceHandlerImpl
Tests run: 6, Failures: 0, Errors: 0, Skipped: 0, Time elapsed: 0.685 sec - in org.apache.hadoop.yarn.server.nodemanager.containermanager.linux.resources.TestCGroupsMemoryResourceHandlerImpl
Java HotSpot(TM) 64-Bit Server VM warning: ignoring option MaxPermSize=768m; support was removed
in 8.0
Running org.apache.hadoop.yarn.server.nodemanager.containermanager.linux.runtime.TestDockerContainerRuntime
Tests run: 8, Failures: 0, Errors: 0, Skipped: 0, Time elapsed: 0.966 sec - in org.apache.hadoop.yarn.server.nodemanager.containermanager.linux.runtime.TestDockerContainerRuntime
Java HotSpot(TM) 64-Bit Server VM warning: ignoring option MaxPermSize=768m; support was removed
in 8.0
Running org.apache.hadoop.yarn.server.nodemanager.containermanager.TestAuxServices
Tests run: 6, Failures: 0, Errors: 0, Skipped: 0, Time elapsed: 0.871 sec - in org.apache.hadoop.yarn.server.nodemanager.containermanager.TestAuxServices
Java HotSpot(TM) 64-Bit Server VM warning: ignoring option MaxPermSize=768m; support was removed
in 8.0
Running org.apache.hadoop.yarn.server.nodemanager.containermanager.TestNMProxy
Tests run: 3, Failures: 0, Errors: 0, Skipped: 0, Time elapsed: 4.122 sec - in org.apache.hadoop.yarn.server.nodemanager.containermanager.TestNMProxy
Java HotSpot(TM) 64-Bit Server VM warning: ignoring option MaxPermSize=768m; support was removed
in 8.0
Running org.apache.hadoop.yarn.server.nodemanager.containermanager.loghandler.TestNonAggregatingLogHandler
Tests run: 6, Failures: 0, Errors: 0, Skipped: 0, Time elapsed: 1.318 sec - in org.apache.hadoop.yarn.server.nodemanager.containermanager.loghandler.TestNonAggregatingLogHandler
Java HotSpot(TM) 64-Bit Server VM warning: ignoring option MaxPermSize=768m; support was removed
in 8.0
Running org.apache.hadoop.yarn.server.nodemanager.containermanager.localizer.TestContainerLocalizer
Tests run: 3, Failures: 0, Errors: 0, Skipped: 0, Time elapsed: 1.218 sec - in org.apache.hadoop.yarn.server.nodemanager.containermanager.localizer.TestContainerLocalizer
Java HotSpot(TM) 64-Bit Server VM warning: ignoring option MaxPermSize=768m; support was removed
in 8.0
Running org.apache.hadoop.yarn.server.nodemanager.containermanager.localizer.TestLocalResource
Tests run: 2, Failures: 0, Errors: 0, Skipped: 0, Time elapsed: 0.348 sec - in org.apache.hadoop.yarn.server.nodemanager.containermanager.localizer.TestLocalResource
Java HotSpot(TM) 64-Bit Server VM warning: ignoring option MaxPermSize=768m; support was removed
in 8.0
Running org.apache.hadoop.yarn.server.nodemanager.containermanager.localizer.TestLocalResourcesTrackerImpl
Tests run: 11, Failures: 0, Errors: 0, Skipped: 0, Time elapsed: 1.187 sec - in org.apache.hadoop.yarn.server.nodemanager.containermanager.localizer.TestLocalResourcesTrackerImpl
Java HotSpot(TM) 64-Bit Server VM warning: ignoring option MaxPermSize=768m; support was removed
in 8.0
Running org.apache.hadoop.yarn.server.nodemanager.containermanager.localizer.TestLocalizedResource
Tests run: 1, Failures: 0, Errors: 0, Skipped: 0, Time elapsed: 0.58 sec - in org.apache.hadoop.yarn.server.nodemanager.containermanager.localizer.TestLocalizedResource
Java HotSpot(TM) 64-Bit Server VM warning: ignoring option MaxPermSize=768m; support was removed
in 8.0
Running org.apache.hadoop.yarn.server.nodemanager.containermanager.localizer.sharedcache.TestSharedCacheUploadService
Tests run: 2, Failures: 0, Errors: 0, Skipped: 0, Time elapsed: 0.681 sec - in org.apache.hadoop.yarn.server.nodemanager.containermanager.localizer.sharedcache.TestSharedCacheUploadService
Java HotSpot(TM) 64-Bit Server VM warning: ignoring option MaxPermSize=768m; support was removed
in 8.0
Running org.apache.hadoop.yarn.server.nodemanager.containermanager.localizer.sharedcache.TestSharedCacheUploader
Tests run: 6, Failures: 0, Errors: 0, Skipped: 0, Time elapsed: 1.022 sec - in org.apache.hadoop.yarn.server.nodemanager.containermanager.localizer.sharedcache.TestSharedCacheUploader
Java HotSpot(TM) 64-Bit Server VM warning: ignoring option MaxPermSize=768m; support was removed
in 8.0
Running org.apache.hadoop.yarn.server.nodemanager.containermanager.localizer.TestResourceLocalizationService
Tests run: 14, Failures: 0, Errors: 0, Skipped: 0, Time elapsed: 5.892 sec - in org.apache.hadoop.yarn.server.nodemanager.containermanager.localizer.TestResourceLocalizationService
Java HotSpot(TM) 64-Bit Server VM warning: ignoring option MaxPermSize=768m; support was removed
in 8.0
Running org.apache.hadoop.yarn.server.nodemanager.containermanager.localizer.TestResourceRetention
Tests run: 1, Failures: 0, Errors: 0, Skipped: 0, Time elapsed: 0.845 sec - in org.apache.hadoop.yarn.server.nodemanager.containermanager.localizer.TestResourceRetention
Java HotSpot(TM) 64-Bit Server VM warning: ignoring option MaxPermSize=768m; support was removed
in 8.0
Running org.apache.hadoop.yarn.server.nodemanager.containermanager.localizer.TestLocalCacheDirectoryManager
Tests run: 5, Failures: 0, Errors: 0, Skipped: 0, Time elapsed: 1.14 sec - in org.apache.hadoop.yarn.server.nodemanager.containermanager.localizer.TestLocalCacheDirectoryManager
Java HotSpot(TM) 64-Bit Server VM warning: ignoring option MaxPermSize=768m; support was removed
in 8.0
Running org.apache.hadoop.yarn.server.nodemanager.containermanager.TestContainerManagerRecovery
Tests run: 3, Failures: 0, Errors: 0, Skipped: 0, Time elapsed: 31.476 sec - in org.apache.hadoop.yarn.server.nodemanager.containermanager.TestContainerManagerRecovery
Java HotSpot(TM) 64-Bit Server VM warning: ignoring option MaxPermSize=768m; support was removed
in 8.0
Running org.apache.hadoop.yarn.server.nodemanager.containermanager.launcher.TestContainerLaunch
Tests run: 23, Failures: 0, Errors: 0, Skipped: 5, Time elapsed: 21.44 sec - in org.apache.hadoop.yarn.server.nodemanager.containermanager.launcher.TestContainerLaunch
Java HotSpot(TM) 64-Bit Server VM warning: ignoring option MaxPermSize=768m; support was removed
in 8.0
Running org.apache.hadoop.yarn.server.nodemanager.containermanager.logaggregation.TestLogAggregationService
Tests run: 35, Failures: 0, Errors: 0, Skipped: 0, Time elapsed: 111.758 sec - in org.apache.hadoop.yarn.server.nodemanager.containermanager.logaggregation.TestLogAggregationService
Java HotSpot(TM) 64-Bit Server VM warning: ignoring option MaxPermSize=768m; support was removed
in 8.0
Running org.apache.hadoop.yarn.server.nodemanager.containermanager.container.TestContainer
Tests run: 20, Failures: 0, Errors: 0, Skipped: 0, Time elapsed: 2.002 sec - in org.apache.hadoop.yarn.server.nodemanager.containermanager.container.TestContainer
Java HotSpot(TM) 64-Bit Server VM warning: ignoring option MaxPermSize=768m; support was removed
in 8.0
Running org.apache.hadoop.yarn.server.nodemanager.TestNodeManager
Tests run: 2, Failures: 0, Errors: 0, Skipped: 0, Time elapsed: 1.008 sec - in org.apache.hadoop.yarn.server.nodemanager.TestNodeManager
Java HotSpot(TM) 64-Bit Server VM warning: ignoring option MaxPermSize=768m; support was removed
in 8.0
Running org.apache.hadoop.yarn.server.nodemanager.util.TestCgroupsLCEResourcesHandler
Tests run: 5, Failures: 0, Errors: 0, Skipped: 0, Time elapsed: 1.054 sec - in org.apache.hadoop.yarn.server.nodemanager.util.TestCgroupsLCEResourcesHandler
Java HotSpot(TM) 64-Bit Server VM warning: ignoring option MaxPermSize=768m; support was removed
in 8.0
Running org.apache.hadoop.yarn.server.nodemanager.util.TestNodeManagerHardwareUtils
Tests run: 3, Failures: 0, Errors: 0, Skipped: 0, Time elapsed: 0.661 sec - in org.apache.hadoop.yarn.server.nodemanager.util.TestNodeManagerHardwareUtils
Java HotSpot(TM) 64-Bit Server VM warning: ignoring option MaxPermSize=768m; support was removed
in 8.0
Running org.apache.hadoop.yarn.server.nodemanager.util.TestProcessIdFileReader
Tests run: 3, Failures: 0, Errors: 0, Skipped: 0, Time elapsed: 0.196 sec - in org.apache.hadoop.yarn.server.nodemanager.util.TestProcessIdFileReader
Java HotSpot(TM) 64-Bit Server VM warning: ignoring option MaxPermSize=768m; support was removed
in 8.0
Running org.apache.hadoop.yarn.server.nodemanager.amrmproxy.TestAMRMProxyService
Tests run: 16, Failures: 0, Errors: 0, Skipped: 0, Time elapsed: 1.728 sec - in org.apache.hadoop.yarn.server.nodemanager.amrmproxy.TestAMRMProxyService
Java HotSpot(TM) 64-Bit Server VM warning: ignoring option MaxPermSize=768m; support was removed
in 8.0
Running org.apache.hadoop.yarn.server.nodemanager.TestDirectoryCollection
Tests run: 7, Failures: 0, Errors: 0, Skipped: 0, Time elapsed: 0.729 sec - in org.apache.hadoop.yarn.server.nodemanager.TestDirectoryCollection
Java HotSpot(TM) 64-Bit Server VM warning: ignoring option MaxPermSize=768m; support was removed
in 8.0
Running org.apache.hadoop.yarn.server.nodemanager.TestLocalDirsHandlerService
Tests run: 3, Failures: 0, Errors: 0, Skipped: 0, Time elapsed: 0.818 sec - in org.apache.hadoop.yarn.server.nodemanager.TestLocalDirsHandlerService
Java HotSpot(TM) 64-Bit Server VM warning: ignoring option MaxPermSize=768m; support was removed
in 8.0
Running org.apache.hadoop.yarn.server.nodemanager.TestEventFlow
Tests run: 1, Failures: 0, Errors: 0, Skipped: 0, Time elapsed: 5.629 sec - in org.apache.hadoop.yarn.server.nodemanager.TestEventFlow
Java HotSpot(TM) 64-Bit Server VM warning: ignoring option MaxPermSize=768m; support was removed
in 8.0
Running org.apache.hadoop.yarn.server.nodemanager.recovery.TestNMLeveldbStateStoreService
Tests run: 12, Failures: 0, Errors: 0, Skipped: 0, Time elapsed: 1.74 sec - in org.apache.hadoop.yarn.server.nodemanager.recovery.TestNMLeveldbStateStoreService
Java HotSpot(TM) 64-Bit Server VM warning: ignoring option MaxPermSize=768m; support was removed
in 8.0
Running org.apache.hadoop.yarn.server.nodemanager.TestContainerManagerWithLCE
Tests run: 16, Failures: 0, Errors: 0, Skipped: 0, Time elapsed: 1.567 sec - in org.apache.hadoop.yarn.server.nodemanager.TestContainerManagerWithLCE
Java HotSpot(TM) 64-Bit Server VM warning: ignoring option MaxPermSize=768m; support was removed
in 8.0
Running org.apache.hadoop.yarn.server.nodemanager.TestRPCFactories
Tests run: 1, Failures: 0, Errors: 0, Skipped: 0, Time elapsed: 0.716 sec - in org.apache.hadoop.yarn.server.nodemanager.TestRPCFactories
Java HotSpot(TM) 64-Bit Server VM warning: ignoring option MaxPermSize=768m; support was removed
in 8.0
Running org.apache.hadoop.yarn.server.nodemanager.TestNodeManagerReboot
Tests run: 1, Failures: 0, Errors: 0, Skipped: 0, Time elapsed: 7.304 sec - in org.apache.hadoop.yarn.server.nodemanager.TestNodeManagerReboot
Java HotSpot(TM) 64-Bit Server VM warning: ignoring option MaxPermSize=768m; support was removed
in 8.0
Running org.apache.hadoop.yarn.server.nodemanager.TestLinuxContainerExecutor
Tests run: 8, Failures: 0, Errors: 0, Skipped: 8, Time elapsed: 0.888 sec - in org.apache.hadoop.yarn.server.nodemanager.TestLinuxContainerExecutor
Java HotSpot(TM) 64-Bit Server VM warning: ignoring option MaxPermSize=768m; support was removed
in 8.0
Running org.apache.hadoop.yarn.server.nodemanager.TestRecordFactory
Tests run: 1, Failures: 0, Errors: 0, Skipped: 0, Time elapsed: 0.216 sec - in org.apache.hadoop.yarn.server.nodemanager.TestRecordFactory
Java HotSpot(TM) 64-Bit Server VM warning: ignoring option MaxPermSize=768m; support was removed
in 8.0
Running org.apache.hadoop.yarn.server.nodemanager.webapp.TestNMWebServer
Tests run: 3, Failures: 0, Errors: 0, Skipped: 0, Time elapsed: 3.687 sec - in org.apache.hadoop.yarn.server.nodemanager.webapp.TestNMWebServer
Java HotSpot(TM) 64-Bit Server VM warning: ignoring option MaxPermSize=768m; support was removed
in 8.0
Running org.apache.hadoop.yarn.server.nodemanager.webapp.TestContainerLogsPage
Tests run: 5, Failures: 0, Errors: 0, Skipped: 1, Time elapsed: 1.268 sec - in org.apache.hadoop.yarn.server.nodemanager.webapp.TestContainerLogsPage
Java HotSpot(TM) 64-Bit Server VM warning: ignoring option MaxPermSize=768m; support was removed
in 8.0
Running org.apache.hadoop.yarn.server.nodemanager.webapp.TestNMWebServices
Tests run: 11, Failures: 0, Errors: 0, Skipped: 0, Time elapsed: 5.547 sec - in org.apache.hadoop.yarn.server.nodemanager.webapp.TestNMWebServices
Java HotSpot(TM) 64-Bit Server VM warning: ignoring option MaxPermSize=768m; support was removed
in 8.0
Running org.apache.hadoop.yarn.server.nodemanager.webapp.TestNMWebServicesApps
Tests run: 19, Failures: 0, Errors: 0, Skipped: 0, Time elapsed: 7.124 sec - in org.apache.hadoop.yarn.server.nodemanager.webapp.TestNMWebServicesApps
Java HotSpot(TM) 64-Bit Server VM warning: ignoring option MaxPermSize=768m; support was removed
in 8.0
Running org.apache.hadoop.yarn.server.nodemanager.webapp.TestNMWebServicesContainers
Tests run: 12, Failures: 0, Errors: 0, Skipped: 0, Time elapsed: 5.757 sec - in org.apache.hadoop.yarn.server.nodemanager.webapp.TestNMWebServicesContainers
Java HotSpot(TM) 64-Bit Server VM warning: ignoring option MaxPermSize=768m; support was removed
in 8.0
Running org.apache.hadoop.yarn.server.nodemanager.TestNMAuditLogger
Tests run: 3, Failures: 0, Errors: 0, Skipped: 0, Time elapsed: 0.94 sec - in org.apache.hadoop.yarn.server.nodemanager.TestNMAuditLogger

Results :

Tests run: 411, Failures: 0, Errors: 0, Skipped: 17

[INFO] 
[INFO] --- hadoop-maven-plugins:3.0.0-SNAPSHOT:cmake-test (test-container-executor) @ hadoop-yarn-server-nodemanager
---
[INFO] -------------------------------------------------------
[INFO]  C M A K E B U I L D E R    T E S T
[INFO] -------------------------------------------------------
[INFO] test-container-executor: running <https://builds.apache.org/job/Hadoop-Yarn-trunk-Java8/ws/hadoop-yarn-project/hadoop-yarn/hadoop-yarn-server/hadoop-yarn-server-nodemanager/target/native/target/usr/local/bin/test-container-executor>
[INFO] with extra environment variables {}
[INFO] STATUS: ERROR CODE 1 after 34 millisecond(s).
[INFO] -------------------------------------------------------
[INFO] ------------------------------------------------------------------------
[INFO] Reactor Summary:
[INFO] 
[INFO] Apache Hadoop YARN ................................ SUCCESS [  3.434 s]
[INFO] Apache Hadoop YARN API ............................ SUCCESS [01:21 min]
[INFO] Apache Hadoop YARN Common ......................... SUCCESS [02:35 min]
[INFO] Apache Hadoop YARN Server ......................... SUCCESS [  0.053 s]
[INFO] Apache Hadoop YARN Server Common .................. SUCCESS [ 36.245 s]
[INFO] Apache Hadoop YARN NodeManager .................... FAILURE [09:02 min]
[INFO] Apache Hadoop YARN Web Proxy ...................... SKIPPED
[INFO] Apache Hadoop YARN ApplicationHistoryService ...... SKIPPED
[INFO] Apache Hadoop YARN ResourceManager ................ SKIPPED
[INFO] Apache Hadoop YARN Server Tests ................... SKIPPED
[INFO] Apache Hadoop YARN Client ......................... SKIPPED
[INFO] Apache Hadoop YARN SharedCacheManager ............. SKIPPED
[INFO] Apache Hadoop YARN Timeline Plugin Storage ........ SKIPPED
[INFO] Apache Hadoop YARN Applications ................... SKIPPED
[INFO] Apache Hadoop YARN DistributedShell ............... SKIPPED
[INFO] Apache Hadoop YARN Unmanaged Am Launcher .......... SKIPPED
[INFO] Apache Hadoop YARN Site ........................... SKIPPED
[INFO] Apache Hadoop YARN Registry ....................... SKIPPED
[INFO] Apache Hadoop YARN Project ........................ SKIPPED
[INFO] ------------------------------------------------------------------------
[INFO] BUILD FAILURE
[INFO] ------------------------------------------------------------------------
[INFO] Total time: 13:40 min
[INFO] Finished at: 2016-01-20T20:05:20+00:00
[INFO] Final Memory: 80M/1002M
[INFO] ------------------------------------------------------------------------
[ERROR] Failed to execute goal org.apache.hadoop:hadoop-maven-plugins:3.0.0-SNAPSHOT:cmake-test
(test-container-executor) on project hadoop-yarn-server-nodemanager: Test <https://builds.apache.org/job/Hadoop-Yarn-trunk-Java8/ws/hadoop-yarn-project/hadoop-yarn/hadoop-yarn-server/hadoop-yarn-server-nodemanager/target/native/target/usr/local/bin/test-container-executor>
returned ERROR CODE 1 -> [Help 1]
[ERROR] 
[ERROR] To see the full stack trace of the errors, re-run Maven with the -e switch.
[ERROR] Re-run Maven using the -X switch to enable full debug logging.
[ERROR] 
[ERROR] For more information about the errors and possible solutions, please read the following
articles:
[ERROR] [Help 1] http://cwiki.apache.org/confluence/display/MAVEN/MojoExecutionException
[ERROR] 
[ERROR] After correcting the problems, you can resume the build with the command
[ERROR]   mvn <goals> -rf :hadoop-yarn-server-nodemanager
Build step 'Execute shell' marked build as failure
Archiving artifacts
Recording test results

Mime
View raw message