hadoop-yarn-dev mailing list archives

Site index · List index
Message view « Date » · « Thread »
Top « Date » · « Thread »
From Apache Jenkins Server <jenk...@builds.apache.org>
Subject Build failed in Jenkins: Hadoop-Yarn-trunk #1490
Date Mon, 07 Dec 2015 22:38:33 GMT
See <https://builds.apache.org/job/Hadoop-Yarn-trunk/1490/changes>

Changes:

[xgong] YARN-4392. ApplicationCreatedEvent event time resets after RM

------------------------------------------
[...truncated 9421 lines...]
	at org.apache.hadoop.yarn.server.resourcemanager.MockAM.registerAppAttempt(MockAM.java:106)
	at org.apache.hadoop.yarn.server.resourcemanager.scheduler.capacity.TestCapacityScheduler.testResourceOverCommit(TestCapacityScheduler.java:833)

testMoveAppForMoveToQueueWithFreeCap(org.apache.hadoop.yarn.server.resourcemanager.scheduler.capacity.TestCapacityScheduler)
 Time elapsed: 0.392 sec  <<< ERROR!
java.lang.NullPointerException: null
	at org.apache.hadoop.yarn.server.resourcemanager.NodeManager.startContainers(NodeManager.java:171)
	at org.apache.hadoop.yarn.server.resourcemanager.Application.assign(Application.java:403)
	at org.apache.hadoop.yarn.server.resourcemanager.Application.assign(Application.java:350)
	at org.apache.hadoop.yarn.server.resourcemanager.Application.schedule(Application.java:364)
	at org.apache.hadoop.yarn.server.resourcemanager.scheduler.capacity.TestCapacityScheduler.testMoveAppForMoveToQueueWithFreeCap(TestCapacityScheduler.java:1484)

testMoveAppQueueMetricsCheck(org.apache.hadoop.yarn.server.resourcemanager.scheduler.capacity.TestCapacityScheduler)
 Time elapsed: 0.22 sec  <<< ERROR!
java.lang.NullPointerException: null
	at org.apache.hadoop.yarn.server.resourcemanager.NodeManager.startContainers(NodeManager.java:171)
	at org.apache.hadoop.yarn.server.resourcemanager.Application.assign(Application.java:403)
	at org.apache.hadoop.yarn.server.resourcemanager.Application.assign(Application.java:350)
	at org.apache.hadoop.yarn.server.resourcemanager.Application.schedule(Application.java:364)
	at org.apache.hadoop.yarn.server.resourcemanager.scheduler.capacity.TestCapacityScheduler.testMoveAppQueueMetricsCheck(TestCapacityScheduler.java:1848)

testHierarchyQueuesCurrentLimits(org.apache.hadoop.yarn.server.resourcemanager.scheduler.capacity.TestCapacityScheduler)
 Time elapsed: 5.767 sec  <<< ERROR!
java.lang.NullPointerException: null
	at javax.security.auth.Subject$ClassSet.populateSet(Subject.java:1387)
	at javax.security.auth.Subject$ClassSet.<init>(Subject.java:1350)
	at javax.security.auth.Subject.getPublicCredentials(Subject.java:704)
	at org.apache.hadoop.security.UserGroupInformation.getTokenIdentifiers(UserGroupInformation.java:1439)
	at org.apache.hadoop.yarn.server.utils.YarnServerSecurityUtils.selectAMRMTokenIdentifier(YarnServerSecurityUtils.java:104)
	at org.apache.hadoop.yarn.server.utils.YarnServerSecurityUtils.authorizeRequest(YarnServerSecurityUtils.java:76)
	at org.apache.hadoop.yarn.server.resourcemanager.ApplicationMasterService.registerApplicationMaster(ApplicationMasterService.java:181)
	at org.apache.hadoop.yarn.server.resourcemanager.MockAM$1.run(MockAM.java:134)
	at org.apache.hadoop.yarn.server.resourcemanager.MockAM$1.run(MockAM.java:131)
	at java.security.AccessController.doPrivileged(Native Method)
	at javax.security.auth.Subject.doAs(Subject.java:415)
	at org.apache.hadoop.security.UserGroupInformation.doAs(UserGroupInformation.java:1669)
	at org.apache.hadoop.yarn.server.resourcemanager.MockAM.registerAppAttempt(MockAM.java:129)
	at org.apache.hadoop.yarn.server.resourcemanager.MockAM.registerAppAttempt(MockAM.java:106)
	at org.apache.hadoop.yarn.server.resourcemanager.MockRM.launchAndRegisterAM(MockRM.java:837)
	at org.apache.hadoop.yarn.server.resourcemanager.scheduler.capacity.TestCapacityScheduler.testHierarchyQueuesCurrentLimits(TestCapacityScheduler.java:2582)

testQueueHierarchyPendingResourceUpdate(org.apache.hadoop.yarn.server.resourcemanager.scheduler.capacity.TestCapacityScheduler)
 Time elapsed: 5.724 sec  <<< ERROR!
java.lang.NullPointerException: null
	at javax.security.auth.Subject$ClassSet.populateSet(Subject.java:1387)
	at javax.security.auth.Subject$ClassSet.<init>(Subject.java:1350)
	at javax.security.auth.Subject.getPublicCredentials(Subject.java:704)
	at org.apache.hadoop.security.UserGroupInformation.getTokenIdentifiers(UserGroupInformation.java:1439)
	at org.apache.hadoop.yarn.server.utils.YarnServerSecurityUtils.selectAMRMTokenIdentifier(YarnServerSecurityUtils.java:104)
	at org.apache.hadoop.yarn.server.utils.YarnServerSecurityUtils.authorizeRequest(YarnServerSecurityUtils.java:76)
	at org.apache.hadoop.yarn.server.resourcemanager.ApplicationMasterService.registerApplicationMaster(ApplicationMasterService.java:181)
	at org.apache.hadoop.yarn.server.resourcemanager.MockAM$1.run(MockAM.java:134)
	at org.apache.hadoop.yarn.server.resourcemanager.MockAM$1.run(MockAM.java:131)
	at java.security.AccessController.doPrivileged(Native Method)
	at javax.security.auth.Subject.doAs(Subject.java:415)
	at org.apache.hadoop.security.UserGroupInformation.doAs(UserGroupInformation.java:1669)
	at org.apache.hadoop.yarn.server.resourcemanager.MockAM.registerAppAttempt(MockAM.java:129)
	at org.apache.hadoop.yarn.server.resourcemanager.MockAM.registerAppAttempt(MockAM.java:106)
	at org.apache.hadoop.yarn.server.resourcemanager.MockRM.launchAndRegisterAM(MockRM.java:837)
	at org.apache.hadoop.yarn.server.resourcemanager.scheduler.capacity.TestCapacityScheduler.testQueueHierarchyPendingResourceUpdate(TestCapacityScheduler.java:2721)

Running org.apache.hadoop.yarn.server.resourcemanager.scheduler.capacity.TestWorkPreservingRMRestartForNodeLabel
Tests run: 1, Failures: 0, Errors: 0, Skipped: 0, Time elapsed: 21.883 sec - in org.apache.hadoop.yarn.server.resourcemanager.scheduler.capacity.TestWorkPreservingRMRestartForNodeLabel
Running org.apache.hadoop.yarn.server.resourcemanager.scheduler.capacity.TestCapacitySchedulerDynamicBehavior
Tests run: 4, Failures: 0, Errors: 0, Skipped: 0, Time elapsed: 6.694 sec - in org.apache.hadoop.yarn.server.resourcemanager.scheduler.capacity.TestCapacitySchedulerDynamicBehavior
Running org.apache.hadoop.yarn.server.resourcemanager.scheduler.capacity.TestReservations
Tests run: 9, Failures: 0, Errors: 0, Skipped: 0, Time elapsed: 5.796 sec - in org.apache.hadoop.yarn.server.resourcemanager.scheduler.capacity.TestReservations
Running org.apache.hadoop.yarn.server.resourcemanager.scheduler.capacity.TestParentQueue
Tests run: 9, Failures: 0, Errors: 0, Skipped: 0, Time elapsed: 5.037 sec - in org.apache.hadoop.yarn.server.resourcemanager.scheduler.capacity.TestParentQueue
Running org.apache.hadoop.yarn.server.resourcemanager.scheduler.capacity.TestApplicationLimitsByPartition
Tests run: 5, Failures: 0, Errors: 0, Skipped: 0, Time elapsed: 95.244 sec - in org.apache.hadoop.yarn.server.resourcemanager.scheduler.capacity.TestApplicationLimitsByPartition
Running org.apache.hadoop.yarn.server.resourcemanager.scheduler.capacity.TestReservationQueue
Tests run: 1, Failures: 0, Errors: 0, Skipped: 0, Time elapsed: 1.831 sec - in org.apache.hadoop.yarn.server.resourcemanager.scheduler.capacity.TestReservationQueue
Running org.apache.hadoop.yarn.server.resourcemanager.scheduler.capacity.TestQueueParsing
Tests run: 17, Failures: 0, Errors: 0, Skipped: 0, Time elapsed: 4.441 sec - in org.apache.hadoop.yarn.server.resourcemanager.scheduler.capacity.TestQueueParsing
Running org.apache.hadoop.yarn.server.resourcemanager.scheduler.capacity.TestCapacitySchedulerNodeLabelUpdate
Tests run: 4, Failures: 0, Errors: 0, Skipped: 0, Time elapsed: 33.893 sec - in org.apache.hadoop.yarn.server.resourcemanager.scheduler.capacity.TestCapacitySchedulerNodeLabelUpdate
Running org.apache.hadoop.yarn.server.resourcemanager.scheduler.capacity.TestQueueCapacities
Tests run: 6, Failures: 0, Errors: 0, Skipped: 0, Time elapsed: 0.256 sec - in org.apache.hadoop.yarn.server.resourcemanager.scheduler.capacity.TestQueueCapacities
Running org.apache.hadoop.yarn.server.resourcemanager.scheduler.capacity.TestApplicationPriority
Tests run: 8, Failures: 0, Errors: 0, Skipped: 0, Time elapsed: 64.902 sec - in org.apache.hadoop.yarn.server.resourcemanager.scheduler.capacity.TestApplicationPriority
Running org.apache.hadoop.yarn.server.resourcemanager.scheduler.TestQueueMetrics
Tests run: 8, Failures: 0, Errors: 0, Skipped: 0, Time elapsed: 3.579 sec - in org.apache.hadoop.yarn.server.resourcemanager.scheduler.TestQueueMetrics
Running org.apache.hadoop.yarn.server.resourcemanager.scheduler.fair.TestFSParentQueue
Tests run: 1, Failures: 0, Errors: 0, Skipped: 0, Time elapsed: 1.384 sec - in org.apache.hadoop.yarn.server.resourcemanager.scheduler.fair.TestFSParentQueue
Running org.apache.hadoop.yarn.server.resourcemanager.scheduler.fair.TestMaxRunningAppsEnforcer
Tests run: 6, Failures: 0, Errors: 0, Skipped: 0, Time elapsed: 1.698 sec - in org.apache.hadoop.yarn.server.resourcemanager.scheduler.fair.TestMaxRunningAppsEnforcer
Running org.apache.hadoop.yarn.server.resourcemanager.scheduler.fair.TestSchedulingUpdate
Tests run: 1, Failures: 0, Errors: 0, Skipped: 0, Time elapsed: 1.961 sec - in org.apache.hadoop.yarn.server.resourcemanager.scheduler.fair.TestSchedulingUpdate
Running org.apache.hadoop.yarn.server.resourcemanager.scheduler.fair.TestFSAppAttempt
Tests run: 4, Failures: 0, Errors: 0, Skipped: 0, Time elapsed: 2.793 sec - in org.apache.hadoop.yarn.server.resourcemanager.scheduler.fair.TestFSAppAttempt
Running org.apache.hadoop.yarn.server.resourcemanager.scheduler.fair.TestFairSchedulerFairShare
Tests run: 6, Failures: 0, Errors: 0, Skipped: 0, Time elapsed: 4.426 sec - in org.apache.hadoop.yarn.server.resourcemanager.scheduler.fair.TestFairSchedulerFairShare
Running org.apache.hadoop.yarn.server.resourcemanager.scheduler.fair.TestFairSchedulerQueueACLs
Tests run: 1, Failures: 0, Errors: 0, Skipped: 0, Time elapsed: 16.109 sec - in org.apache.hadoop.yarn.server.resourcemanager.scheduler.fair.TestFairSchedulerQueueACLs
Running org.apache.hadoop.yarn.server.resourcemanager.scheduler.fair.TestComputeFairShares
Tests run: 9, Failures: 0, Errors: 0, Skipped: 0, Time elapsed: 0.594 sec - in org.apache.hadoop.yarn.server.resourcemanager.scheduler.fair.TestComputeFairShares
Running org.apache.hadoop.yarn.server.resourcemanager.scheduler.fair.policies.TestEmptyQueues
Tests run: 3, Failures: 0, Errors: 0, Skipped: 0, Time elapsed: 0.581 sec - in org.apache.hadoop.yarn.server.resourcemanager.scheduler.fair.policies.TestEmptyQueues
Running org.apache.hadoop.yarn.server.resourcemanager.scheduler.fair.policies.TestDominantResourceFairnessPolicy
Tests run: 9, Failures: 0, Errors: 0, Skipped: 0, Time elapsed: 0.632 sec - in org.apache.hadoop.yarn.server.resourcemanager.scheduler.fair.policies.TestDominantResourceFairnessPolicy
Running org.apache.hadoop.yarn.server.resourcemanager.scheduler.fair.TestAllocationFileLoaderService
Tests run: 10, Failures: 0, Errors: 0, Skipped: 0, Time elapsed: 1.133 sec - in org.apache.hadoop.yarn.server.resourcemanager.scheduler.fair.TestAllocationFileLoaderService
Running org.apache.hadoop.yarn.server.resourcemanager.scheduler.fair.TestFairSchedulerEventLog
Tests run: 1, Failures: 0, Errors: 0, Skipped: 0, Time elapsed: 1.921 sec - in org.apache.hadoop.yarn.server.resourcemanager.scheduler.fair.TestFairSchedulerEventLog
Running org.apache.hadoop.yarn.server.resourcemanager.scheduler.fair.TestAppRunnability
Tests run: 8, Failures: 0, Errors: 0, Skipped: 0, Time elapsed: 4.674 sec - in org.apache.hadoop.yarn.server.resourcemanager.scheduler.fair.TestAppRunnability
Running org.apache.hadoop.yarn.server.resourcemanager.scheduler.fair.TestContinuousScheduling
Tests run: 1, Failures: 0, Errors: 0, Skipped: 0, Time elapsed: 3.013 sec - in org.apache.hadoop.yarn.server.resourcemanager.scheduler.fair.TestContinuousScheduling
Running org.apache.hadoop.yarn.server.resourcemanager.scheduler.fair.TestQueueManager
Tests run: 3, Failures: 0, Errors: 0, Skipped: 0, Time elapsed: 2.046 sec - in org.apache.hadoop.yarn.server.resourcemanager.scheduler.fair.TestQueueManager
Running org.apache.hadoop.yarn.server.resourcemanager.scheduler.fair.TestFairSchedulerConfiguration
Tests run: 5, Failures: 0, Errors: 0, Skipped: 0, Time elapsed: 0.845 sec - in org.apache.hadoop.yarn.server.resourcemanager.scheduler.fair.TestFairSchedulerConfiguration
Running org.apache.hadoop.yarn.server.resourcemanager.scheduler.fair.TestQueuePlacementPolicy
Tests run: 17, Failures: 0, Errors: 0, Skipped: 0, Time elapsed: 1.264 sec - in org.apache.hadoop.yarn.server.resourcemanager.scheduler.fair.TestQueuePlacementPolicy
Running org.apache.hadoop.yarn.server.resourcemanager.scheduler.fair.TestFairScheduler
Tests run: 88, Failures: 0, Errors: 0, Skipped: 0, Time elapsed: 20.86 sec - in org.apache.hadoop.yarn.server.resourcemanager.scheduler.fair.TestFairScheduler
Running org.apache.hadoop.yarn.server.resourcemanager.scheduler.fair.TestFairSchedulerPreemption
Tests run: 1, Failures: 0, Errors: 0, Skipped: 0, Time elapsed: 3.265 sec - in org.apache.hadoop.yarn.server.resourcemanager.scheduler.fair.TestFairSchedulerPreemption
Running org.apache.hadoop.yarn.server.resourcemanager.scheduler.fair.TestSchedulingPolicy
Tests run: 2, Failures: 0, Errors: 0, Skipped: 0, Time elapsed: 0.776 sec - in org.apache.hadoop.yarn.server.resourcemanager.scheduler.fair.TestSchedulingPolicy
Running org.apache.hadoop.yarn.server.resourcemanager.scheduler.fair.TestFSLeafQueue
Tests run: 5, Failures: 0, Errors: 0, Skipped: 0, Time elapsed: 3.981 sec - in org.apache.hadoop.yarn.server.resourcemanager.scheduler.fair.TestFSLeafQueue
Running org.apache.hadoop.yarn.server.resourcemanager.TestRMHAForNodeLabels
Tests run: 1, Failures: 0, Errors: 0, Skipped: 0, Time elapsed: 4.502 sec - in org.apache.hadoop.yarn.server.resourcemanager.TestRMHAForNodeLabels
Running org.apache.hadoop.yarn.server.resourcemanager.TestApplicationMasterLauncher
Tests run: 4, Failures: 0, Errors: 0, Skipped: 0, Time elapsed: 21.38 sec - in org.apache.hadoop.yarn.server.resourcemanager.TestApplicationMasterLauncher
Running org.apache.hadoop.yarn.server.resourcemanager.TestApplicationMasterService
Tests run: 8, Failures: 0, Errors: 0, Skipped: 0, Time elapsed: 51.108 sec - in org.apache.hadoop.yarn.server.resourcemanager.TestApplicationMasterService
Running org.apache.hadoop.yarn.server.resourcemanager.TestApplicationACLs
Tests run: 1, Failures: 0, Errors: 0, Skipped: 0, Time elapsed: 9.267 sec - in org.apache.hadoop.yarn.server.resourcemanager.TestApplicationACLs
Running org.apache.hadoop.yarn.server.resourcemanager.TestTokenClientRMService
Tests run: 6, Failures: 0, Errors: 0, Skipped: 0, Time elapsed: 1.815 sec - in org.apache.hadoop.yarn.server.resourcemanager.TestTokenClientRMService
Running org.apache.hadoop.yarn.server.resourcemanager.recovery.TestZKRMStateStore
Tests run: 6, Failures: 0, Errors: 0, Skipped: 0, Time elapsed: 19.856 sec - in org.apache.hadoop.yarn.server.resourcemanager.recovery.TestZKRMStateStore
Running org.apache.hadoop.yarn.server.resourcemanager.recovery.TestZKRMStateStoreZKClientConnections
Tests run: 5, Failures: 0, Errors: 0, Skipped: 0, Time elapsed: 10.41 sec - in org.apache.hadoop.yarn.server.resourcemanager.recovery.TestZKRMStateStoreZKClientConnections
Running org.apache.hadoop.yarn.server.resourcemanager.recovery.TestFSRMStateStore
Tests run: 4, Failures: 0, Errors: 0, Skipped: 0, Time elapsed: 36.971 sec - in org.apache.hadoop.yarn.server.resourcemanager.recovery.TestFSRMStateStore
Running org.apache.hadoop.yarn.server.resourcemanager.recovery.TestZKRMStateStorePerf
Tests run: 1, Failures: 0, Errors: 0, Skipped: 0, Time elapsed: 248.123 sec - in org.apache.hadoop.yarn.server.resourcemanager.recovery.TestZKRMStateStorePerf
Running org.apache.hadoop.yarn.server.resourcemanager.recovery.TestLeveldbRMStateStore
Tests run: 9, Failures: 0, Errors: 0, Skipped: 0, Time elapsed: 7.792 sec - in org.apache.hadoop.yarn.server.resourcemanager.recovery.TestLeveldbRMStateStore
Running org.apache.hadoop.yarn.server.resourcemanager.recovery.TestMemoryRMStateStore
Tests run: 1, Failures: 0, Errors: 0, Skipped: 0, Time elapsed: 0.916 sec - in org.apache.hadoop.yarn.server.resourcemanager.recovery.TestMemoryRMStateStore
Running org.apache.hadoop.yarn.server.resourcemanager.recovery.TestProtos
Tests run: 1, Failures: 0, Errors: 0, Skipped: 0, Time elapsed: 0.278 sec - in org.apache.hadoop.yarn.server.resourcemanager.recovery.TestProtos
Running org.apache.hadoop.yarn.server.resourcemanager.TestKillApplicationWithRMHA
Tests run: 4, Failures: 0, Errors: 0, Skipped: 0, Time elapsed: 26.897 sec - in org.apache.hadoop.yarn.server.resourcemanager.TestKillApplicationWithRMHA
Running org.apache.hadoop.yarn.server.resourcemanager.monitor.TestSchedulingMonitor
Tests run: 1, Failures: 0, Errors: 0, Skipped: 0, Time elapsed: 2.073 sec - in org.apache.hadoop.yarn.server.resourcemanager.monitor.TestSchedulingMonitor
Running org.apache.hadoop.yarn.server.resourcemanager.monitor.capacity.TestProportionalCapacityPreemptionPolicy
Tests run: 27, Failures: 0, Errors: 0, Skipped: 0, Time elapsed: 18.426 sec - in org.apache.hadoop.yarn.server.resourcemanager.monitor.capacity.TestProportionalCapacityPreemptionPolicy
Running org.apache.hadoop.yarn.server.resourcemanager.monitor.capacity.TestProportionalCapacityPreemptionPolicyForNodePartitions
Tests run: 11, Failures: 0, Errors: 0, Skipped: 0, Time elapsed: 7.035 sec - in org.apache.hadoop.yarn.server.resourcemanager.monitor.capacity.TestProportionalCapacityPreemptionPolicyForNodePartitions
Running org.apache.hadoop.yarn.server.resourcemanager.resourcetracker.TestNMReconnect
Tests run: 3, Failures: 0, Errors: 0, Skipped: 0, Time elapsed: 2.54 sec - in org.apache.hadoop.yarn.server.resourcemanager.resourcetracker.TestNMReconnect
Running org.apache.hadoop.yarn.server.resourcemanager.resourcetracker.TestNMExpiry
Tests run: 1, Failures: 0, Errors: 0, Skipped: 0, Time elapsed: 3.429 sec - in org.apache.hadoop.yarn.server.resourcemanager.resourcetracker.TestNMExpiry
Running org.apache.hadoop.yarn.server.resourcemanager.resourcetracker.TestRMNMRPCResponseId
Tests run: 1, Failures: 0, Errors: 0, Skipped: 0, Time elapsed: 1.631 sec - in org.apache.hadoop.yarn.server.resourcemanager.resourcetracker.TestRMNMRPCResponseId
Running org.apache.hadoop.yarn.server.resourcemanager.TestResourceManager
Tests run: 5, Failures: 0, Errors: 0, Skipped: 0, Time elapsed: 5.285 sec - in org.apache.hadoop.yarn.server.resourcemanager.TestResourceManager
Running org.apache.hadoop.yarn.server.resourcemanager.TestRMNodeTransitions
Tests run: 30, Failures: 0, Errors: 0, Skipped: 0, Time elapsed: 2.485 sec - in org.apache.hadoop.yarn.server.resourcemanager.TestRMNodeTransitions
Running org.apache.hadoop.yarn.server.resourcemanager.rmcontainer.TestRMContainerImpl
Tests run: 6, Failures: 0, Errors: 0, Skipped: 0, Time elapsed: 52.494 sec - in org.apache.hadoop.yarn.server.resourcemanager.rmcontainer.TestRMContainerImpl
Running org.apache.hadoop.yarn.server.resourcemanager.TestRMProxyUsersConf
Tests run: 3, Failures: 0, Errors: 0, Skipped: 0, Time elapsed: 32.708 sec - in org.apache.hadoop.yarn.server.resourcemanager.TestRMProxyUsersConf
Running org.apache.hadoop.yarn.server.resourcemanager.TestClusterMetrics
Tests run: 1, Failures: 0, Errors: 0, Skipped: 0, Time elapsed: 0.497 sec - in org.apache.hadoop.yarn.server.resourcemanager.TestClusterMetrics
Running org.apache.hadoop.yarn.server.resourcemanager.resource.TestResourceWeights
Tests run: 1, Failures: 0, Errors: 0, Skipped: 0, Time elapsed: 0.086 sec - in org.apache.hadoop.yarn.server.resourcemanager.resource.TestResourceWeights
Running org.apache.hadoop.yarn.server.resourcemanager.resource.TestResources
Tests run: 2, Failures: 0, Errors: 0, Skipped: 0, Time elapsed: 0.583 sec - in org.apache.hadoop.yarn.server.resourcemanager.resource.TestResources
Running org.apache.hadoop.yarn.server.resourcemanager.TestApplicationCleanup
Tests run: 7, Failures: 0, Errors: 0, Skipped: 0, Time elapsed: 42.091 sec - in org.apache.hadoop.yarn.server.resourcemanager.TestApplicationCleanup
Running org.apache.hadoop.yarn.server.resourcemanager.TestContainerResourceUsage
Tests run: 4, Failures: 0, Errors: 0, Skipped: 0, Time elapsed: 44.244 sec - in org.apache.hadoop.yarn.server.resourcemanager.TestContainerResourceUsage
Running org.apache.hadoop.yarn.server.resourcemanager.TestRMEmbeddedElector
Tests run: 1, Failures: 0, Errors: 0, Skipped: 0, Time elapsed: 3.76 sec - in org.apache.hadoop.yarn.server.resourcemanager.TestRMEmbeddedElector
Running org.apache.hadoop.yarn.server.resourcemanager.ahs.TestRMApplicationHistoryWriter
Tests run: 7, Failures: 0, Errors: 0, Skipped: 0, Time elapsed: 186.823 sec - in org.apache.hadoop.yarn.server.resourcemanager.ahs.TestRMApplicationHistoryWriter

Results :

Tests in error: 
  TestContainerAllocation.testLogAggregationContextPassedIntoContainerToken:249 » NoClassDefFound
  TestContainerAllocation.testAMContainerAllocationWhenDNSUnavailable:333 NoClassDefFound
  TestContainerAllocation.testContainerTokenGeneratedOnPullRequest:179 » NoClassDefFound
  TestContainerAllocation.testExcessReservationThanNodeManagerCapacity:148 » NoClassDefFound
  TestContainerAllocation.testNormalContainerAllocationWhenDNSUnavailable:197 NoClassDefFound
  TestContainerAllocation.testExcessReservationWillBeUnreserved:409 » NoClassDefFound
  TestCapacityScheduler.testRecoverRequestAfterPreemption:1225 » ServiceConfiguration
  TestCapacityScheduler.testAppReservationWithDominantResourceCalculator:2185 » NullPointer
  TestCapacityScheduler.testMoveAppViolateQueueState »  Unexpected exception, ex...
  TestCapacityScheduler.testCapacityScheduler:333 » NullPointer
  TestCapacityScheduler.testMoveAppSuccess:1608 » NullPointer
  TestCapacityScheduler.testPreemptionInfo:1160 » NullPointer
  TestCapacityScheduler.testParentQueueMaxCapsAreRespected:2665 » NullPointer
  TestCapacityScheduler.testPendingResourceUpdatedAccordingToIncreaseRequestChanges:3122 »
NullPointer
  TestCapacityScheduler.testResourceOverCommit:833 » NullPointer
  TestCapacityScheduler.testMoveAppForMoveToQueueWithFreeCap:1484 » NullPointer
  TestCapacityScheduler.testMoveAppQueueMetricsCheck:1848 » NullPointer
  TestCapacityScheduler.testHierarchyQueuesCurrentLimits:2582 » NullPointer
  TestCapacityScheduler.testQueueHierarchyPendingResourceUpdate:2721 » NullPointer

Tests run: 1268, Failures: 0, Errors: 19, Skipped: 2

[INFO] ------------------------------------------------------------------------
[INFO] Reactor Summary:
[INFO] 
[INFO] Apache Hadoop YARN ................................ SUCCESS [  4.344 s]
[INFO] Apache Hadoop YARN API ............................ SUCCESS [05:04 min]
[INFO] Apache Hadoop YARN Common ......................... SUCCESS [03:49 min]
[INFO] Apache Hadoop YARN Server ......................... SUCCESS [  0.105 s]
[INFO] Apache Hadoop YARN Server Common .................. SUCCESS [01:02 min]
[INFO] Apache Hadoop YARN NodeManager .................... SUCCESS [11:15 min]
[INFO] Apache Hadoop YARN Web Proxy ...................... SUCCESS [ 37.283 s]
[INFO] Apache Hadoop YARN ApplicationHistoryService ...... SUCCESS [05:28 min]
[INFO] Apache Hadoop YARN ResourceManager ................ FAILURE [  01:05 h]
[INFO] Apache Hadoop YARN Server Tests ................... SKIPPED
[INFO] Apache Hadoop YARN Client ......................... SKIPPED
[INFO] Apache Hadoop YARN SharedCacheManager ............. SKIPPED
[INFO] Apache Hadoop YARN Applications ................... SKIPPED
[INFO] Apache Hadoop YARN DistributedShell ............... SKIPPED
[INFO] Apache Hadoop YARN Unmanaged Am Launcher .......... SKIPPED
[INFO] Apache Hadoop YARN Site ........................... SKIPPED
[INFO] Apache Hadoop YARN Registry ....................... SKIPPED
[INFO] Apache Hadoop YARN Project ........................ SKIPPED
[INFO] ------------------------------------------------------------------------
[INFO] BUILD FAILURE
[INFO] ------------------------------------------------------------------------
[INFO] Total time: 01:33 h
[INFO] Finished at: 2015-12-07T22:38:21+00:00
[INFO] Final Memory: 60M/517M
[INFO] ------------------------------------------------------------------------
[ERROR] Failed to execute goal org.apache.maven.plugins:maven-surefire-plugin:2.17:test (default-test)
on project hadoop-yarn-server-resourcemanager: There are test failures.
[ERROR] 
[ERROR] Please refer to <https://builds.apache.org/job/Hadoop-Yarn-trunk/ws/hadoop-yarn-project/hadoop-yarn/hadoop-yarn-server/hadoop-yarn-server-resourcemanager/target/surefire-reports>
for the individual test results.
[ERROR] -> [Help 1]
[ERROR] 
[ERROR] To see the full stack trace of the errors, re-run Maven with the -e switch.
[ERROR] Re-run Maven using the -X switch to enable full debug logging.
[ERROR] 
[ERROR] For more information about the errors and possible solutions, please read the following
articles:
[ERROR] [Help 1] http://cwiki.apache.org/confluence/display/MAVEN/MojoFailureException
[ERROR] 
[ERROR] After correcting the problems, you can resume the build with the command
[ERROR]   mvn <goals> -rf :hadoop-yarn-server-resourcemanager
Build step 'Execute shell' marked build as failure
Archiving artifacts
Recording test results

Mime
View raw message