hadoop-yarn-dev mailing list archives

Site index · List index
Message view « Date » · « Thread »
Top « Date » · « Thread »
From Apache Jenkins Server <jenk...@builds.apache.org>
Subject Hadoop-Yarn-trunk - Build # 1481 - Still Failing
Date Fri, 04 Dec 2015 19:59:41 GMT
See https://builds.apache.org/job/Hadoop-Yarn-trunk/1481/

###################################################################################
########################## LAST 60 LINES OF THE CONSOLE ###########################
[...truncated 8617 lines...]
Running org.apache.hadoop.yarn.server.webproxy.TestWebAppProxyServer
Tests run: 2, Failures: 0, Errors: 0, Skipped: 0, Time elapsed: 3.97 sec - in org.apache.hadoop.yarn.server.webproxy.TestWebAppProxyServer
Running org.apache.hadoop.yarn.server.webproxy.TestAppReportFetcher
Tests run: 2, Failures: 0, Errors: 0, Skipped: 0, Time elapsed: 1.62 sec - in org.apache.hadoop.yarn.server.webproxy.TestAppReportFetcher

Results :

Tests in error: 
  TestAmFilter.testFilter:164 ยป  test timed out after 1000 milliseconds

Tests run: 20, Failures: 0, Errors: 1, Skipped: 0

[INFO] ------------------------------------------------------------------------
[INFO] Reactor Summary:
[INFO] 
[INFO] Apache Hadoop YARN ................................ SUCCESS [  7.615 s]
[INFO] Apache Hadoop YARN API ............................ SUCCESS [07:57 min]
[INFO] Apache Hadoop YARN Common ......................... SUCCESS [06:19 min]
[INFO] Apache Hadoop YARN Server ......................... SUCCESS [  0.141 s]
[INFO] Apache Hadoop YARN Server Common .................. SUCCESS [01:54 min]
[INFO] Apache Hadoop YARN NodeManager .................... SUCCESS [14:48 min]
[INFO] Apache Hadoop YARN Web Proxy ...................... FAILURE [ 21.435 s]
[INFO] Apache Hadoop YARN ApplicationHistoryService ...... SKIPPED
[INFO] Apache Hadoop YARN ResourceManager ................ SKIPPED
[INFO] Apache Hadoop YARN Server Tests ................... SKIPPED
[INFO] Apache Hadoop YARN Client ......................... SKIPPED
[INFO] Apache Hadoop YARN SharedCacheManager ............. SKIPPED
[INFO] Apache Hadoop YARN Applications ................... SKIPPED
[INFO] Apache Hadoop YARN DistributedShell ............... SKIPPED
[INFO] Apache Hadoop YARN Unmanaged Am Launcher .......... SKIPPED
[INFO] Apache Hadoop YARN Site ........................... SKIPPED
[INFO] Apache Hadoop YARN Registry ....................... SKIPPED
[INFO] Apache Hadoop YARN Project ........................ SKIPPED
[INFO] ------------------------------------------------------------------------
[INFO] BUILD FAILURE
[INFO] ------------------------------------------------------------------------
[INFO] Total time: 31:33 min
[INFO] Finished at: 2015-12-04T19:59:39+00:00
[INFO] Final Memory: 85M/1142M
[INFO] ------------------------------------------------------------------------
[ERROR] Failed to execute goal org.apache.maven.plugins:maven-surefire-plugin:2.17:test (default-test)
on project hadoop-yarn-server-web-proxy: There are test failures.
[ERROR] 
[ERROR] Please refer to /home/jenkins/jenkins-slave/workspace/Hadoop-Yarn-trunk/hadoop-yarn-project/hadoop-yarn/hadoop-yarn-server/hadoop-yarn-server-web-proxy/target/surefire-reports
for the individual test results.
[ERROR] -> [Help 1]
[ERROR] 
[ERROR] To see the full stack trace of the errors, re-run Maven with the -e switch.
[ERROR] Re-run Maven using the -X switch to enable full debug logging.
[ERROR] 
[ERROR] For more information about the errors and possible solutions, please read the following
articles:
[ERROR] [Help 1] http://cwiki.apache.org/confluence/display/MAVEN/MojoFailureException
[ERROR] 
[ERROR] After correcting the problems, you can resume the build with the command
[ERROR]   mvn <goals> -rf :hadoop-yarn-server-web-proxy
Build step 'Execute shell' marked build as failure
Archiving artifacts
Recording test results
Sending e-mails to: yarn-dev@hadoop.apache.org
Email was triggered for: Failure - Any
Sending email for trigger: Failure - Any



###################################################################################
############################## FAILED TESTS (if any) ##############################
1 tests failed.
FAILED:  org.apache.hadoop.yarn.server.webproxy.amfilter.TestAmFilter.testFilter

Error Message:
test timed out after 1000 milliseconds

Stack Trace:
java.lang.Exception: test timed out after 1000 milliseconds
	at org.apache.hadoop.yarn.webapp.hamlet.Hamlet.div_(Hamlet.java:20867)
	at org.apache.hadoop.yarn.webapp.hamlet.Hamlet.access$1400(Hamlet.java:30)
	at org.apache.hadoop.yarn.webapp.hamlet.Hamlet$BODY.div(Hamlet.java:20651)
	at org.apache.hadoop.yarn.server.webproxy.ProxyUtils.sendRedirect(ProxyUtils.java:88)
	at org.apache.hadoop.yarn.server.webproxy.amfilter.AmIpFilter.doFilter(AmIpFilter.java:140)
	at org.apache.hadoop.yarn.server.webproxy.amfilter.TestAmFilter.testFilter(TestAmFilter.java:164)



Mime
  • Unnamed multipart/mixed (inline, None, 0 bytes)
View raw message