hadoop-yarn-dev mailing list archives

Site index · List index
Message view « Date » · « Thread »
Top « Date » · « Thread »
From Apache Jenkins Server <jenk...@builds.apache.org>
Subject Hadoop-Yarn-trunk - Build # 1555 - Failure
Date Thu, 24 Dec 2015 11:20:08 GMT
See https://builds.apache.org/job/Hadoop-Yarn-trunk/1555/

###################################################################################
########################## LAST 60 LINES OF THE CONSOLE ###########################
[...truncated 9411 lines...]
Tests run: 9, Failures: 0, Errors: 0, Skipped: 0, Time elapsed: 172.111 sec - in org.apache.hadoop.yarn.server.resourcemanager.applicationsmanager.TestAMRestart

Results :

Failed tests: 
  TestRMDelegationTokens.testRMDTMasterKeyStateOnRollingMasterKey:115 null

Tests in error: 
  TestRMDelegationTokens.testRemoveExpiredMasterKeyInRMStateStore:140 ยป ClassCast

Tests run: 1293, Failures: 1, Errors: 1, Skipped: 2

[INFO] ------------------------------------------------------------------------
[INFO] Reactor Summary:
[INFO] 
[INFO] Apache Hadoop YARN ................................ SUCCESS [  3.376 s]
[INFO] Apache Hadoop YARN API ............................ SUCCESS [04:12 min]
[INFO] Apache Hadoop YARN Common ......................... SUCCESS [03:05 min]
[INFO] Apache Hadoop YARN Server ......................... SUCCESS [  0.092 s]
[INFO] Apache Hadoop YARN Server Common .................. SUCCESS [ 46.938 s]
[INFO] Apache Hadoop YARN NodeManager .................... SUCCESS [09:26 min]
[INFO] Apache Hadoop YARN Web Proxy ...................... SUCCESS [ 25.124 s]
[INFO] Apache Hadoop YARN ApplicationHistoryService ...... SUCCESS [03:25 min]
[INFO] Apache Hadoop YARN ResourceManager ................ FAILURE [  01:00 h]
[INFO] Apache Hadoop YARN Server Tests ................... SKIPPED
[INFO] Apache Hadoop YARN Client ......................... SKIPPED
[INFO] Apache Hadoop YARN SharedCacheManager ............. SKIPPED
[INFO] Apache Hadoop YARN Applications ................... SKIPPED
[INFO] Apache Hadoop YARN DistributedShell ............... SKIPPED
[INFO] Apache Hadoop YARN Unmanaged Am Launcher .......... SKIPPED
[INFO] Apache Hadoop YARN Site ........................... SKIPPED
[INFO] Apache Hadoop YARN Registry ....................... SKIPPED
[INFO] Apache Hadoop YARN Project ........................ SKIPPED
[INFO] ------------------------------------------------------------------------
[INFO] BUILD FAILURE
[INFO] ------------------------------------------------------------------------
[INFO] Total time: 01:21 h
[INFO] Finished at: 2015-12-24T11:20:07+00:00
[INFO] Final Memory: 60M/485M
[INFO] ------------------------------------------------------------------------
[ERROR] Failed to execute goal org.apache.maven.plugins:maven-surefire-plugin:2.17:test (default-test)
on project hadoop-yarn-server-resourcemanager: There are test failures.
[ERROR] 
[ERROR] Please refer to /home/jenkins/jenkins-slave/workspace/Hadoop-Yarn-trunk/hadoop-yarn-project/hadoop-yarn/hadoop-yarn-server/hadoop-yarn-server-resourcemanager/target/surefire-reports
for the individual test results.
[ERROR] -> [Help 1]
[ERROR] 
[ERROR] To see the full stack trace of the errors, re-run Maven with the -e switch.
[ERROR] Re-run Maven using the -X switch to enable full debug logging.
[ERROR] 
[ERROR] For more information about the errors and possible solutions, please read the following
articles:
[ERROR] [Help 1] http://cwiki.apache.org/confluence/display/MAVEN/MojoFailureException
[ERROR] 
[ERROR] After correcting the problems, you can resume the build with the command
[ERROR]   mvn <goals> -rf :hadoop-yarn-server-resourcemanager
Build step 'Execute shell' marked build as failure
Archiving artifacts
Recording test results
Sending e-mails to: yarn-dev@hadoop.apache.org
Email was triggered for: Failure - Any
Sending email for trigger: Failure - Any



###################################################################################
############################## FAILED TESTS (if any) ##############################
2 tests failed.
FAILED:  org.apache.hadoop.yarn.server.resourcemanager.security.TestRMDelegationTokens.testRMDTMasterKeyStateOnRollingMasterKey

Error Message:
null

Stack Trace:
java.lang.AssertionError: null
	at org.junit.Assert.fail(Assert.java:86)
	at org.junit.Assert.assertTrue(Assert.java:41)
	at org.junit.Assert.assertTrue(Assert.java:52)
	at org.apache.hadoop.yarn.server.resourcemanager.security.TestRMDelegationTokens$TestRMDelegationTokenSecretManager.checkCurrentKeyInStateStore(TestRMDelegationTokens.java:211)
	at org.apache.hadoop.yarn.server.resourcemanager.security.TestRMDelegationTokens.testRMDTMasterKeyStateOnRollingMasterKey(TestRMDelegationTokens.java:115)


FAILED:  org.apache.hadoop.yarn.server.resourcemanager.security.TestRMDelegationTokens.testRemoveExpiredMasterKeyInRMStateStore

Error Message:
org.apache.hadoop.yarn.server.resourcemanager.scheduler.capacity.CSQueueMetrics cannot be
cast to org.apache.hadoop.yarn.server.resourcemanager.scheduler.fair.FSQueueMetrics

Stack Trace:
java.lang.ClassCastException: org.apache.hadoop.yarn.server.resourcemanager.scheduler.capacity.CSQueueMetrics
cannot be cast to org.apache.hadoop.yarn.server.resourcemanager.scheduler.fair.FSQueueMetrics
	at org.apache.hadoop.yarn.server.resourcemanager.scheduler.fair.FSQueueMetrics.forQueue(FSQueueMetrics.java:118)
	at org.apache.hadoop.yarn.server.resourcemanager.scheduler.fair.FairScheduler.initScheduler(FairScheduler.java:1422)
	at org.apache.hadoop.yarn.server.resourcemanager.scheduler.fair.FairScheduler.serviceInit(FairScheduler.java:1483)
	at org.apache.hadoop.service.AbstractService.init(AbstractService.java:163)
	at org.apache.hadoop.service.CompositeService.serviceInit(CompositeService.java:107)
	at org.apache.hadoop.yarn.server.resourcemanager.ResourceManager$RMActiveServices.serviceInit(ResourceManager.java:568)
	at org.apache.hadoop.service.AbstractService.init(AbstractService.java:163)
	at org.apache.hadoop.yarn.server.resourcemanager.ResourceManager.createAndInitActiveServices(ResourceManager.java:974)
	at org.apache.hadoop.yarn.server.resourcemanager.ResourceManager.serviceInit(ResourceManager.java:254)
	at org.apache.hadoop.service.AbstractService.init(AbstractService.java:163)
	at org.apache.hadoop.yarn.server.resourcemanager.TestRMRestart$TestSecurityMockRM.init(TestRMRestart.java:2071)
	at org.apache.hadoop.yarn.server.resourcemanager.MockRM.<init>(MockRM.java:125)
	at org.apache.hadoop.yarn.server.resourcemanager.MockRM.<init>(MockRM.java:118)
	at org.apache.hadoop.yarn.server.resourcemanager.TestRMRestart$TestSecurityMockRM.<init>(TestRMRestart.java:2064)
	at org.apache.hadoop.yarn.server.resourcemanager.security.TestRMDelegationTokens$MyMockRM.<init>(TestRMDelegationTokens.java:167)
	at org.apache.hadoop.yarn.server.resourcemanager.security.TestRMDelegationTokens.testRemoveExpiredMasterKeyInRMStateStore(TestRMDelegationTokens.java:140)



Mime
  • Unnamed multipart/mixed (inline, None, 0 bytes)
View raw message