hadoop-yarn-dev mailing list archives

Site index · List index
Message view « Date » · « Thread »
Top « Date » · « Thread »
From Apache Jenkins Server <jenk...@builds.apache.org>
Subject Hadoop-Yarn-trunk-Java8 - Build # 855 - Failure
Date Thu, 31 Dec 2015 01:23:12 GMT
See https://builds.apache.org/job/Hadoop-Yarn-trunk-Java8/855/

###################################################################################
########################## LAST 60 LINES OF THE CONSOLE ###########################
[...truncated 5804 lines...]
Tests run: 1, Failures: 0, Errors: 0, Skipped: 0, Time elapsed: 37.573 sec - in org.apache.hadoop.yarn.applications.distributedshell.TestDistributedShellWithNodeLabels
Java HotSpot(TM) 64-Bit Server VM warning: ignoring option MaxPermSize=768m; support was removed
in 8.0
Running org.apache.hadoop.yarn.applications.distributedshell.TestDSAppMaster
Tests run: 2, Failures: 0, Errors: 0, Skipped: 0, Time elapsed: 1.728 sec - in org.apache.hadoop.yarn.applications.distributedshell.TestDSAppMaster

Results :

Tests in error: 
  TestDistributedShell.testContainerLaunchFailureHandling:809 ยป  test timed out ...

Tests run: 14, Failures: 0, Errors: 1, Skipped: 0

[INFO] ------------------------------------------------------------------------
[INFO] Reactor Summary:
[INFO] 
[INFO] Apache Hadoop YARN ................................ SUCCESS [  3.525 s]
[INFO] Apache Hadoop YARN API ............................ SUCCESS [01:19 min]
[INFO] Apache Hadoop YARN Common ......................... SUCCESS [02:33 min]
[INFO] Apache Hadoop YARN Server ......................... SUCCESS [  0.059 s]
[INFO] Apache Hadoop YARN Server Common .................. SUCCESS [ 36.590 s]
[INFO] Apache Hadoop YARN NodeManager .................... SUCCESS [09:33 min]
[INFO] Apache Hadoop YARN Web Proxy ...................... SUCCESS [ 16.326 s]
[INFO] Apache Hadoop YARN ApplicationHistoryService ...... SUCCESS [03:54 min]
[INFO] Apache Hadoop YARN ResourceManager ................ SUCCESS [  01:07 h]
[INFO] Apache Hadoop YARN Server Tests ................... SUCCESS [03:10 min]
[INFO] Apache Hadoop YARN Client ......................... SUCCESS [08:18 min]
[INFO] Apache Hadoop YARN SharedCacheManager ............. SUCCESS [ 17.571 s]
[INFO] Apache Hadoop YARN Applications ................... SUCCESS [  0.032 s]
[INFO] Apache Hadoop YARN DistributedShell ............... FAILURE [08:17 min]
[INFO] Apache Hadoop YARN Unmanaged Am Launcher .......... SKIPPED
[INFO] Apache Hadoop YARN Site ........................... SKIPPED
[INFO] Apache Hadoop YARN Registry ....................... SKIPPED
[INFO] Apache Hadoop YARN Project ........................ SKIPPED
[INFO] ------------------------------------------------------------------------
[INFO] BUILD FAILURE
[INFO] ------------------------------------------------------------------------
[INFO] Total time: 01:45 h
[INFO] Finished at: 2015-12-31T01:23:09+00:00
[INFO] Final Memory: 85M/767M
[INFO] ------------------------------------------------------------------------
[ERROR] Failed to execute goal org.apache.maven.plugins:maven-surefire-plugin:2.17:test (default-test)
on project hadoop-yarn-applications-distributedshell: There are test failures.
[ERROR] 
[ERROR] Please refer to /home/jenkins/jenkins-slave/workspace/Hadoop-Yarn-trunk-Java8/hadoop-yarn-project/hadoop-yarn/hadoop-yarn-applications/hadoop-yarn-applications-distributedshell/target/surefire-reports
for the individual test results.
[ERROR] -> [Help 1]
[ERROR] 
[ERROR] To see the full stack trace of the errors, re-run Maven with the -e switch.
[ERROR] Re-run Maven using the -X switch to enable full debug logging.
[ERROR] 
[ERROR] For more information about the errors and possible solutions, please read the following
articles:
[ERROR] [Help 1] http://cwiki.apache.org/confluence/display/MAVEN/MojoFailureException
[ERROR] 
[ERROR] After correcting the problems, you can resume the build with the command
[ERROR]   mvn <goals> -rf :hadoop-yarn-applications-distributedshell
Build step 'Execute shell' marked build as failure
Archiving artifacts
Recording test results
Sending e-mails to: yarn-dev@hadoop.apache.org
Email was triggered for: Failure - Any
Sending email for trigger: Failure - Any



###################################################################################
############################## FAILED TESTS (if any) ##############################
1 tests failed.
FAILED:  org.apache.hadoop.yarn.applications.distributedshell.TestDistributedShell.testContainerLaunchFailureHandling

Error Message:
test timed out after 90000 milliseconds

Stack Trace:
java.lang.Exception: test timed out after 90000 milliseconds
	at java.lang.Thread.sleep(Native Method)
	at org.apache.hadoop.yarn.applications.distributedshell.Client.monitorApplication(Client.java:734)
	at org.apache.hadoop.yarn.applications.distributedshell.Client.run(Client.java:715)
	at org.apache.hadoop.yarn.applications.distributedshell.TestDistributedShell.testContainerLaunchFailureHandling(TestDistributedShell.java:809)



Mime
  • Unnamed multipart/mixed (inline, None, 0 bytes)
View raw message