hadoop-yarn-dev mailing list archives

Site index · List index
Message view « Date » · « Thread »
Top « Date » · « Thread »
From Apache Jenkins Server <jenk...@builds.apache.org>
Subject Build failed in Jenkins: Hadoop-Yarn-trunk-Java8 #766
Date Sat, 05 Dec 2015 17:38:38 GMT
See <https://builds.apache.org/job/Hadoop-Yarn-trunk-Java8/766/changes>

Changes:

[arp] HDFS-9414. Add missing license header

------------------------------------------
[...truncated 3758 lines...]
[INFO] Executing tasks

main:
    [mkdir] Created dir: <https://builds.apache.org/job/Hadoop-Yarn-trunk-Java8/ws/hadoop-yarn-project/hadoop-yarn/target/test-dir>
[INFO] Executed tasks
[INFO] 
[INFO] --- maven-source-plugin:2.3:jar-no-fork (hadoop-java-sources) @ hadoop-yarn ---
[INFO] 
[INFO] --- maven-source-plugin:2.3:test-jar-no-fork (hadoop-java-sources) @ hadoop-yarn ---
[INFO] 
[INFO] --- maven-enforcer-plugin:1.3.1:enforce (dist-enforce) @ hadoop-yarn ---
[INFO] 
[INFO] --- maven-site-plugin:3.4:attach-descriptor (attach-descriptor) @ hadoop-yarn ---
[INFO] 
[INFO] --- maven-javadoc-plugin:2.8.1:jar (module-javadocs) @ hadoop-yarn ---
[INFO] Skipping javadoc generation
[INFO] 
[INFO] --- maven-enforcer-plugin:1.3.1:enforce (depcheck) @ hadoop-yarn ---
[INFO] 
[INFO] --- maven-checkstyle-plugin:2.15:checkstyle (default-cli) @ hadoop-yarn ---
[INFO] 
[INFO] --- findbugs-maven-plugin:3.0.0:findbugs (default-cli) @ hadoop-yarn ---
[INFO]                                                                         
[INFO] ------------------------------------------------------------------------
[INFO] Building Apache Hadoop YARN API 3.0.0-SNAPSHOT
[INFO] ------------------------------------------------------------------------
Downloading: https://repository.apache.org/content/repositories/snapshots/org/apache/hadoop/hadoop-project-dist/3.0.0-SNAPSHOT/hadoop-project-dist-3.0.0-20151205.173700-6919.pom
4/18 KB   
8/18 KB   
8/18 KB   
12/18 KB   
16/18 KB   
16/18 KB   
18/18 KB   
           
Downloaded: https://repository.apache.org/content/repositories/snapshots/org/apache/hadoop/hadoop-project-dist/3.0.0-SNAPSHOT/hadoop-project-dist-3.0.0-20151205.173700-6919.pom
(18 KB at 21.2 KB/sec)
Downloading: https://repository.apache.org/content/repositories/snapshots/org/apache/hadoop/hadoop-annotations/3.0.0-SNAPSHOT/hadoop-annotations-3.0.0-20151205.173656-7840.pom
3/3 KB     
         
Downloaded: https://repository.apache.org/content/repositories/snapshots/org/apache/hadoop/hadoop-annotations/3.0.0-SNAPSHOT/hadoop-annotations-3.0.0-20151205.173656-7840.pom
(3 KB at 9.9 KB/sec)
Downloading: https://repository.apache.org/content/repositories/snapshots/org/apache/hadoop/hadoop-auth/3.0.0-SNAPSHOT/hadoop-auth-3.0.0-20151205.173721-7828.jar
Downloading: https://repository.apache.org/content/repositories/snapshots/org/apache/hadoop/hadoop-annotations/3.0.0-SNAPSHOT/hadoop-annotations-3.0.0-20151205.173656-7840.jar
4/76 KB   
8/76 KB   
8/76 KB   
4/17 KB   8/76 KB   
8/17 KB   8/76 KB   
8/17 KB   8/76 KB   
8/17 KB   12/76 KB   
8/17 KB   14/76 KB   
8/17 KB   16/76 KB   
8/17 KB   20/76 KB   
8/17 KB   22/76 KB   
12/17 KB   22/76 KB   
14/17 KB   22/76 KB   
14/17 KB   24/76 KB   
17/17 KB   24/76 KB   
17/17 KB   28/76 KB   
17/17 KB   30/76 KB   
17/17 KB   32/76 KB   
17/17 KB   36/76 KB   
17/17 KB   38/76 KB   
17/17 KB   40/76 KB   
17/17 KB   44/76 KB   
17/17 KB   45/76 KB   
17/17 KB   48/76 KB   
17/17 KB   52/76 KB   
17/17 KB   53/76 KB   
17/17 KB   56/76 KB   
17/17 KB   60/76 KB   
17/17 KB   61/76 KB   
17/17 KB   64/76 KB   
17/17 KB   65/76 KB   
17/17 KB   69/76 KB   
17/17 KB   73/76 KB   
17/17 KB   73/76 KB   
17/17 KB   76/76 KB   
                      
Downloaded: https://repository.apache.org/content/repositories/snapshots/org/apache/hadoop/hadoop-auth/3.0.0-SNAPSHOT/hadoop-auth-3.0.0-20151205.173721-7828.jar
(76 KB at 235.0 KB/sec)
                      
Downloaded: https://repository.apache.org/content/repositories/snapshots/org/apache/hadoop/hadoop-annotations/3.0.0-SNAPSHOT/hadoop-annotations-3.0.0-20151205.173656-7840.jar
(17 KB at 52.7 KB/sec)
[INFO] 
[INFO] --- maven-clean-plugin:2.5:clean (default-clean) @ hadoop-yarn-api ---
[INFO] Deleting <https://builds.apache.org/job/Hadoop-Yarn-trunk-Java8/ws/hadoop-yarn-project/hadoop-yarn/hadoop-yarn-api/target>
[INFO] 
[INFO] --- maven-antrun-plugin:1.7:run (create-testdirs) @ hadoop-yarn-api ---
[INFO] Executing tasks

main:
    [mkdir] Created dir: <https://builds.apache.org/job/Hadoop-Yarn-trunk-Java8/ws/hadoop-yarn-project/hadoop-yarn/hadoop-yarn-api/target/test-dir>
[INFO] Executed tasks
[INFO] 
[INFO] --- hadoop-maven-plugins:3.0.0-SNAPSHOT:protoc (compile-protoc) @ hadoop-yarn-api ---
[INFO] Wrote protoc checksums to file <https://builds.apache.org/job/Hadoop-Yarn-trunk-Java8/ws/hadoop-yarn-project/hadoop-yarn/hadoop-yarn-api/target/hadoop-maven-plugins-protoc-checksums.json>
[INFO] 
[INFO] --- maven-resources-plugin:2.6:resources (default-resources) @ hadoop-yarn-api ---
[INFO] Using 'UTF-8' encoding to copy filtered resources.
[INFO] Copying 1 resource
[INFO] 
[INFO] --- maven-compiler-plugin:3.1:compile (default-compile) @ hadoop-yarn-api ---
[INFO] Changes detected - recompiling the module!
[INFO] Compiling 226 source files to <https://builds.apache.org/job/Hadoop-Yarn-trunk-Java8/ws/hadoop-yarn-project/hadoop-yarn/hadoop-yarn-api/target/classes>
[INFO] 
[INFO] --- maven-resources-plugin:2.6:testResources (default-testResources) @ hadoop-yarn-api
---
[INFO] Using 'UTF-8' encoding to copy filtered resources.
[INFO] skip non existing resourceDirectory <https://builds.apache.org/job/Hadoop-Yarn-trunk-Java8/ws/hadoop-yarn-project/hadoop-yarn/hadoop-yarn-api/src/test/resources>
[INFO] 
[INFO] --- maven-compiler-plugin:3.1:testCompile (default-testCompile) @ hadoop-yarn-api ---
[INFO] Changes detected - recompiling the module!
[INFO] Compiling 1 source file to <https://builds.apache.org/job/Hadoop-Yarn-trunk-Java8/ws/hadoop-yarn-project/hadoop-yarn/hadoop-yarn-api/target/test-classes>
[INFO] 
[INFO] --- maven-jar-plugin:2.5:test-jar (default) @ hadoop-yarn-api ---
[INFO] Building jar: <https://builds.apache.org/job/Hadoop-Yarn-trunk-Java8/ws/hadoop-yarn-project/hadoop-yarn/hadoop-yarn-api/target/hadoop-yarn-api-3.0.0-SNAPSHOT-tests.jar>
[INFO] 
[INFO] --- maven-surefire-plugin:2.17:test (default-test) @ hadoop-yarn-api ---
[INFO] Surefire report directory: <https://builds.apache.org/job/Hadoop-Yarn-trunk-Java8/ws/hadoop-yarn-project/hadoop-yarn/hadoop-yarn-api/target/surefire-reports>

-------------------------------------------------------
 T E S T S
-------------------------------------------------------

-------------------------------------------------------
 T E S T S
-------------------------------------------------------
Java HotSpot(TM) 64-Bit Server VM warning: ignoring option MaxPermSize=768m; support was removed
in 8.0
Running org.apache.hadoop.yarn.conf.TestYarnConfigurationFields
Tests run: 2, Failures: 0, Errors: 0, Skipped: 0, Time elapsed: 0.376 sec - in org.apache.hadoop.yarn.conf.TestYarnConfigurationFields

Results :

Tests run: 2, Failures: 0, Errors: 0, Skipped: 0

[INFO] 
[INFO] --- maven-jar-plugin:2.5:jar (default-jar) @ hadoop-yarn-api ---
[INFO] Building jar: <https://builds.apache.org/job/Hadoop-Yarn-trunk-Java8/ws/hadoop-yarn-project/hadoop-yarn/hadoop-yarn-api/target/hadoop-yarn-api-3.0.0-SNAPSHOT.jar>
[INFO] 
[INFO] --- maven-source-plugin:2.3:jar-no-fork (hadoop-java-sources) @ hadoop-yarn-api ---
[INFO] Building jar: <https://builds.apache.org/job/Hadoop-Yarn-trunk-Java8/ws/hadoop-yarn-project/hadoop-yarn/hadoop-yarn-api/target/hadoop-yarn-api-3.0.0-SNAPSHOT-sources.jar>
[INFO] 
[INFO] --- maven-source-plugin:2.3:test-jar-no-fork (hadoop-java-sources) @ hadoop-yarn-api
---
[INFO] Building jar: <https://builds.apache.org/job/Hadoop-Yarn-trunk-Java8/ws/hadoop-yarn-project/hadoop-yarn/hadoop-yarn-api/target/hadoop-yarn-api-3.0.0-SNAPSHOT-test-sources.jar>
[INFO] 
[INFO] --- maven-enforcer-plugin:1.3.1:enforce (dist-enforce) @ hadoop-yarn-api ---
[INFO] 
[INFO] --- maven-site-plugin:3.4:attach-descriptor (attach-descriptor) @ hadoop-yarn-api ---
[INFO] 
[INFO] --- maven-javadoc-plugin:2.8.1:jar (module-javadocs) @ hadoop-yarn-api ---
[INFO] Skipping javadoc generation
[INFO] 
[INFO] --- maven-enforcer-plugin:1.3.1:enforce (depcheck) @ hadoop-yarn-api ---
Downloading: https://repository.apache.org/content/repositories/snapshots/org/apache/hadoop/hadoop-project/3.0.0-SNAPSHOT/hadoop-project-3.0.0-20151205.173651-6924.pom
4/45 KB               
8/45 KB   
8/45 KB   
12/45 KB   
14/45 KB   
18/45 KB   
22/45 KB   
22/45 KB   
26/45 KB   
30/45 KB   
30/45 KB   
34/45 KB   
38/45 KB   
38/45 KB   
42/45 KB   
45/45 KB   
           
Downloaded: https://repository.apache.org/content/repositories/snapshots/org/apache/hadoop/hadoop-project/3.0.0-SNAPSHOT/hadoop-project-3.0.0-20151205.173651-6924.pom
(45 KB at 133.6 KB/sec)
Downloading: https://repository.apache.org/content/repositories/snapshots/org/apache/hadoop/hadoop-main/3.0.0-SNAPSHOT/hadoop-main-3.0.0-20151205.173643-6930.pom
4/25 KB    
8/25 KB   
8/25 KB   
12/25 KB   
14/25 KB   
18/25 KB   
22/25 KB   
22/25 KB   
25/25 KB   
           
Downloaded: https://repository.apache.org/content/repositories/snapshots/org/apache/hadoop/hadoop-main/3.0.0-SNAPSHOT/hadoop-main-3.0.0-20151205.173643-6930.pom
(25 KB at 69.6 KB/sec)
[WARNING] 
Dependency convergence error for org.apache.hadoop:hadoop-annotations:3.0.0-SNAPSHOT paths
to dependency are:
+-org.apache.hadoop:hadoop-yarn-api:3.0.0-SNAPSHOT
  +-org.apache.hadoop:hadoop-common:3.0.0-SNAPSHOT
    +-org.apache.hadoop:hadoop-annotations:3.0.0-SNAPSHOT
and
+-org.apache.hadoop:hadoop-yarn-api:3.0.0-SNAPSHOT
  +-org.apache.hadoop:hadoop-annotations:3.0.0-20151205.173656-7840
and
+-org.apache.hadoop:hadoop-yarn-api:3.0.0-SNAPSHOT
  +-org.apache.hadoop:hadoop-common:3.0.0-SNAPSHOT
    +-org.apache.hadoop:hadoop-annotations:3.0.0-SNAPSHOT

[WARNING] Rule 0: org.apache.maven.plugins.enforcer.DependencyConvergence failed with message:
Failed while enforcing releasability the error(s) are [
Dependency convergence error for org.apache.hadoop:hadoop-annotations:3.0.0-SNAPSHOT paths
to dependency are:
+-org.apache.hadoop:hadoop-yarn-api:3.0.0-SNAPSHOT
  +-org.apache.hadoop:hadoop-common:3.0.0-SNAPSHOT
    +-org.apache.hadoop:hadoop-annotations:3.0.0-SNAPSHOT
and
+-org.apache.hadoop:hadoop-yarn-api:3.0.0-SNAPSHOT
  +-org.apache.hadoop:hadoop-annotations:3.0.0-20151205.173656-7840
and
+-org.apache.hadoop:hadoop-yarn-api:3.0.0-SNAPSHOT
  +-org.apache.hadoop:hadoop-common:3.0.0-SNAPSHOT
    +-org.apache.hadoop:hadoop-annotations:3.0.0-SNAPSHOT
]
[INFO] ------------------------------------------------------------------------
[INFO] Reactor Summary:
[INFO] 
[INFO] Apache Hadoop YARN ................................ SUCCESS [  3.121 s]
[INFO] Apache Hadoop YARN API ............................ FAILURE [ 16.892 s]
[INFO] Apache Hadoop YARN Common ......................... SKIPPED
[INFO] Apache Hadoop YARN Server ......................... SKIPPED
[INFO] Apache Hadoop YARN Server Common .................. SKIPPED
[INFO] Apache Hadoop YARN NodeManager .................... SKIPPED
[INFO] Apache Hadoop YARN Web Proxy ...................... SKIPPED
[INFO] Apache Hadoop YARN ApplicationHistoryService ...... SKIPPED
[INFO] Apache Hadoop YARN ResourceManager ................ SKIPPED
[INFO] Apache Hadoop YARN Server Tests ................... SKIPPED
[INFO] Apache Hadoop YARN Client ......................... SKIPPED
[INFO] Apache Hadoop YARN SharedCacheManager ............. SKIPPED
[INFO] Apache Hadoop YARN Applications ................... SKIPPED
[INFO] Apache Hadoop YARN DistributedShell ............... SKIPPED
[INFO] Apache Hadoop YARN Unmanaged Am Launcher .......... SKIPPED
[INFO] Apache Hadoop YARN Site ........................... SKIPPED
[INFO] Apache Hadoop YARN Registry ....................... SKIPPED
[INFO] Apache Hadoop YARN Project ........................ SKIPPED
[INFO] ------------------------------------------------------------------------
[INFO] BUILD FAILURE
[INFO] ------------------------------------------------------------------------
[INFO] Total time: 21.133 s
[INFO] Finished at: 2015-12-05T17:38:45+00:00
[INFO] Final Memory: 51M/293M
[INFO] ------------------------------------------------------------------------
[ERROR] Failed to execute goal org.apache.maven.plugins:maven-enforcer-plugin:1.3.1:enforce
(depcheck) on project hadoop-yarn-api: Some Enforcer rules have failed. Look above for specific
messages explaining why the rule failed. -> [Help 1]
[ERROR] 
[ERROR] To see the full stack trace of the errors, re-run Maven with the -e switch.
[ERROR] Re-run Maven using the -X switch to enable full debug logging.
[ERROR] 
[ERROR] For more information about the errors and possible solutions, please read the following
articles:
[ERROR] [Help 1] http://cwiki.apache.org/confluence/display/MAVEN/MojoExecutionException
[ERROR] 
[ERROR] After correcting the problems, you can resume the build with the command
[ERROR]   mvn <goals> -rf :hadoop-yarn-api
Build step 'Execute shell' marked build as failure
Archiving artifacts
Recording test results

Mime
View raw message