hadoop-yarn-dev mailing list archives

Site index · List index
Message view « Date » · « Thread »
Top « Date » · « Thread »
From Apache Jenkins Server <jenk...@builds.apache.org>
Subject Hadoop-Yarn-trunk-Java8 - Build # 731 - Still Failing
Date Wed, 25 Nov 2015 08:17:07 GMT
See https://builds.apache.org/job/Hadoop-Yarn-trunk-Java8/731/

###################################################################################
########################## LAST 60 LINES OF THE CONSOLE ###########################
[...truncated 5136 lines...]
  TestNMWebServicesApps.<init>:176->JerseyTestBase.<init>:30->JerseyTest.<init>:217->JerseyTest.getContainer:342
» TestContainer
  TestNMWebServicesApps.<init>:176->JerseyTestBase.<init>:30->JerseyTest.<init>:217->JerseyTest.getContainer:342
» TestContainer
  TestNodeManagerResync.testNMshutdownWhenResyncThrowException:224 »  test timed...
  TestNodeManagerResync.testPreserveContainersOnResyncKeepingContainers:148 » Metrics
  TestNodeManagerResync.testContainerResourceIncreaseIsSynchronizedWithRMResync:246 » Metrics
  TestNodeManagerResync.testBlockNewContainerRequestsOnStartAndResync:195 » Metrics
  TestNodeManagerResync.testKillContainersOnResync:139 » Metrics Metrics source ...
  TestNodeManagerResync.testNMSentContainerStatusOnResync:355 » YarnRuntime NMWe...

Tests run: 395, Failures: 1, Errors: 9, Skipped: 17

[INFO] ------------------------------------------------------------------------
[INFO] Reactor Summary:
[INFO] 
[INFO] Apache Hadoop YARN ................................ SUCCESS [ 10.798 s]
[INFO] Apache Hadoop YARN API ............................ SUCCESS [03:54 min]
[INFO] Apache Hadoop YARN Common ......................... SUCCESS [06:04 min]
[INFO] Apache Hadoop YARN Server ......................... SUCCESS [  0.361 s]
[INFO] Apache Hadoop YARN Server Common .................. SUCCESS [01:27 min]
[INFO] Apache Hadoop YARN NodeManager .................... FAILURE [14:40 min]
[INFO] Apache Hadoop YARN Web Proxy ...................... SKIPPED
[INFO] Apache Hadoop YARN ApplicationHistoryService ...... SKIPPED
[INFO] Apache Hadoop YARN ResourceManager ................ SKIPPED
[INFO] Apache Hadoop YARN Server Tests ................... SKIPPED
[INFO] Apache Hadoop YARN Client ......................... SKIPPED
[INFO] Apache Hadoop YARN SharedCacheManager ............. SKIPPED
[INFO] Apache Hadoop YARN Applications ................... SKIPPED
[INFO] Apache Hadoop YARN DistributedShell ............... SKIPPED
[INFO] Apache Hadoop YARN Unmanaged Am Launcher .......... SKIPPED
[INFO] Apache Hadoop YARN Site ........................... SKIPPED
[INFO] Apache Hadoop YARN Registry ....................... SKIPPED
[INFO] Apache Hadoop YARN Project ........................ SKIPPED
[INFO] ------------------------------------------------------------------------
[INFO] BUILD FAILURE
[INFO] ------------------------------------------------------------------------
[INFO] Total time: 26:22 min
[INFO] Finished at: 2015-11-25T08:16:59+00:00
[INFO] Final Memory: 82M/1059M
[INFO] ------------------------------------------------------------------------
[ERROR] Failed to execute goal org.apache.maven.plugins:maven-surefire-plugin:2.17:test (default-test)
on project hadoop-yarn-server-nodemanager: There are test failures.
[ERROR] 
[ERROR] Please refer to /home/jenkins/jenkins-slave/workspace/Hadoop-Yarn-trunk-Java8/hadoop-yarn-project/hadoop-yarn/hadoop-yarn-server/hadoop-yarn-server-nodemanager/target/surefire-reports
for the individual test results.
[ERROR] -> [Help 1]
[ERROR] 
[ERROR] To see the full stack trace of the errors, re-run Maven with the -e switch.
[ERROR] Re-run Maven using the -X switch to enable full debug logging.
[ERROR] 
[ERROR] For more information about the errors and possible solutions, please read the following
articles:
[ERROR] [Help 1] http://cwiki.apache.org/confluence/display/MAVEN/MojoFailureException
[ERROR] 
[ERROR] After correcting the problems, you can resume the build with the command
[ERROR]   mvn <goals> -rf :hadoop-yarn-server-nodemanager
Build step 'Execute shell' marked build as failure
Archiving artifacts
Recording test results
Updating MAPREDUCE-6553
Sending e-mails to: yarn-dev@hadoop.apache.org
Email was triggered for: Failure - Any
Sending email for trigger: Failure - Any



###################################################################################
############################## FAILED TESTS (if any) ##############################
10 tests failed.
FAILED:  org.apache.hadoop.yarn.server.nodemanager.TestNodeManagerResync.testNMshutdownWhenResyncThrowException

Error Message:
test timed out after 10000 milliseconds

Stack Trace:
java.lang.Exception: test timed out after 10000 milliseconds
	at java.lang.Class.getDeclaredMethods0(Native Method)
	at java.lang.Class.privateGetDeclaredMethods(Class.java:2688)
	at java.lang.Class.getDeclaredMethods(Class.java:1962)
	at com.sun.jersey.core.reflection.MethodList.getAllDeclaredMethods(MethodList.java:70)
	at com.sun.jersey.core.reflection.MethodList.<init>(MethodList.java:64)
	at com.sun.jersey.core.spi.component.ComponentConstructor.getPostConstructMethods(ComponentConstructor.java:131)
	at com.sun.jersey.core.spi.component.ComponentConstructor.<init>(ComponentConstructor.java:123)
	at com.sun.jersey.core.spi.component.ProviderFactory.__getComponentProvider(ProviderFactory.java:165)
	at com.sun.jersey.core.spi.component.ProviderFactory.getComponentProvider(ProviderFactory.java:137)
	at com.sun.jersey.core.spi.component.ProviderServices.getComponent(ProviderServices.java:256)
	at com.sun.jersey.core.spi.component.ProviderServices.getServices(ProviderServices.java:160)
	at com.sun.jersey.core.spi.factory.MessageBodyFactory.initWriters(MessageBodyFactory.java:207)
	at com.sun.jersey.core.spi.factory.MessageBodyFactory.init(MessageBodyFactory.java:163)
	at com.sun.jersey.server.impl.application.WebApplicationImpl._initiate(WebApplicationImpl.java:1277)
	at com.sun.jersey.server.impl.application.WebApplicationImpl.access$700(WebApplicationImpl.java:169)
	at com.sun.jersey.server.impl.application.WebApplicationImpl$13.f(WebApplicationImpl.java:775)
	at com.sun.jersey.server.impl.application.WebApplicationImpl$13.f(WebApplicationImpl.java:771)
	at com.sun.jersey.spi.inject.Errors.processWithErrors(Errors.java:193)
	at com.sun.jersey.server.impl.application.WebApplicationImpl.initiate(WebApplicationImpl.java:771)
	at com.sun.jersey.guice.spi.container.servlet.GuiceContainer.initiate(GuiceContainer.java:121)
	at com.sun.jersey.spi.container.servlet.ServletContainer$InternalWebComponent.initiate(ServletContainer.java:318)
	at com.sun.jersey.spi.container.servlet.WebComponent.load(WebComponent.java:609)
	at com.sun.jersey.spi.container.servlet.WebComponent.init(WebComponent.java:210)
	at com.sun.jersey.spi.container.servlet.ServletContainer.init(ServletContainer.java:373)
	at com.sun.jersey.spi.container.servlet.ServletContainer.init(ServletContainer.java:710)
	at com.google.inject.servlet.FilterDefinition.init(FilterDefinition.java:114)
	at com.google.inject.servlet.ManagedFilterPipeline.initPipeline(ManagedFilterPipeline.java:98)
	at com.google.inject.servlet.GuiceFilter.init(GuiceFilter.java:172)
	at org.mortbay.jetty.servlet.FilterHolder.doStart(FilterHolder.java:97)
	at org.mortbay.component.AbstractLifeCycle.start(AbstractLifeCycle.java:50)
	at org.mortbay.jetty.servlet.ServletHandler.initialize(ServletHandler.java:713)
	at org.mortbay.jetty.servlet.Context.startContext(Context.java:140)
	at org.mortbay.jetty.webapp.WebAppContext.startContext(WebAppContext.java:1282)
	at org.mortbay.jetty.handler.ContextHandler.doStart(ContextHandler.java:518)
	at org.mortbay.jetty.webapp.WebAppContext.doStart(WebAppContext.java:499)
	at org.mortbay.component.AbstractLifeCycle.start(AbstractLifeCycle.java:50)
	at org.mortbay.jetty.handler.HandlerCollection.doStart(HandlerCollection.java:152)
	at org.mortbay.jetty.handler.ContextHandlerCollection.doStart(ContextHandlerCollection.java:156)
	at org.mortbay.component.AbstractLifeCycle.start(AbstractLifeCycle.java:50)
	at org.mortbay.jetty.handler.HandlerWrapper.doStart(HandlerWrapper.java:130)
	at org.mortbay.jetty.Server.doStart(Server.java:224)
	at org.mortbay.component.AbstractLifeCycle.start(AbstractLifeCycle.java:50)
	at org.apache.hadoop.http.HttpServer2.start(HttpServer2.java:844)
	at org.apache.hadoop.yarn.webapp.WebApps$Builder.start(WebApps.java:306)
	at org.apache.hadoop.yarn.server.nodemanager.webapp.WebServer.serviceStart(WebServer.java:82)
	at org.apache.hadoop.service.AbstractService.start(AbstractService.java:193)
	at org.apache.hadoop.service.CompositeService.serviceStart(CompositeService.java:120)
	at org.apache.hadoop.yarn.server.nodemanager.NodeManager.serviceStart(NodeManager.java:368)
	at org.apache.hadoop.service.AbstractService.start(AbstractService.java:193)
	at org.apache.hadoop.yarn.server.nodemanager.TestNodeManagerResync.testNMshutdownWhenResyncThrowException(TestNodeManagerResync.java:224)


FAILED:  org.apache.hadoop.yarn.server.nodemanager.TestNodeManagerResync.testPreserveContainersOnResyncKeepingContainers

Error Message:
Metrics source JvmMetrics already exists!

Stack Trace:
org.apache.hadoop.metrics2.MetricsException: Metrics source JvmMetrics already exists!
	at org.apache.hadoop.metrics2.lib.DefaultMetricsSystem.newSourceName(DefaultMetricsSystem.java:143)
	at org.apache.hadoop.metrics2.lib.DefaultMetricsSystem.sourceName(DefaultMetricsSystem.java:120)
	at org.apache.hadoop.metrics2.impl.MetricsSystemImpl.register(MetricsSystemImpl.java:230)
	at org.apache.hadoop.metrics2.source.JvmMetrics.create(JvmMetrics.java:85)
	at org.apache.hadoop.yarn.server.nodemanager.metrics.NodeManagerMetrics.create(NodeManagerMetrics.java:74)
	at org.apache.hadoop.yarn.server.nodemanager.metrics.NodeManagerMetrics.create(NodeManagerMetrics.java:70)
	at org.apache.hadoop.yarn.server.nodemanager.NodeManager.<init>(NodeManager.java:89)
	at org.apache.hadoop.yarn.server.nodemanager.TestNodeManagerResync$TestNodeManager1.<init>(TestNodeManagerResync.java:410)
	at org.apache.hadoop.yarn.server.nodemanager.TestNodeManagerResync.testPreserveContainersOnResyncKeepingContainers(TestNodeManagerResync.java:148)


FAILED:  org.apache.hadoop.yarn.server.nodemanager.TestNodeManagerResync.testContainerResourceIncreaseIsSynchronizedWithRMResync

Error Message:
Metrics source JvmMetrics already exists!

Stack Trace:
org.apache.hadoop.metrics2.MetricsException: Metrics source JvmMetrics already exists!
	at org.apache.hadoop.metrics2.lib.DefaultMetricsSystem.newSourceName(DefaultMetricsSystem.java:143)
	at org.apache.hadoop.metrics2.lib.DefaultMetricsSystem.sourceName(DefaultMetricsSystem.java:120)
	at org.apache.hadoop.metrics2.impl.MetricsSystemImpl.register(MetricsSystemImpl.java:230)
	at org.apache.hadoop.metrics2.source.JvmMetrics.create(JvmMetrics.java:85)
	at org.apache.hadoop.yarn.server.nodemanager.metrics.NodeManagerMetrics.create(NodeManagerMetrics.java:74)
	at org.apache.hadoop.yarn.server.nodemanager.metrics.NodeManagerMetrics.create(NodeManagerMetrics.java:70)
	at org.apache.hadoop.yarn.server.nodemanager.NodeManager.<init>(NodeManager.java:89)
	at org.apache.hadoop.yarn.server.nodemanager.TestNodeManagerResync$TestNodeManager4.<init>(TestNodeManagerResync.java:652)
	at org.apache.hadoop.yarn.server.nodemanager.TestNodeManagerResync.testContainerResourceIncreaseIsSynchronizedWithRMResync(TestNodeManagerResync.java:246)


FAILED:  org.apache.hadoop.yarn.server.nodemanager.TestNodeManagerResync.testBlockNewContainerRequestsOnStartAndResync

Error Message:
Metrics source JvmMetrics already exists!

Stack Trace:
org.apache.hadoop.metrics2.MetricsException: Metrics source JvmMetrics already exists!
	at org.apache.hadoop.metrics2.lib.DefaultMetricsSystem.newSourceName(DefaultMetricsSystem.java:143)
	at org.apache.hadoop.metrics2.lib.DefaultMetricsSystem.sourceName(DefaultMetricsSystem.java:120)
	at org.apache.hadoop.metrics2.impl.MetricsSystemImpl.register(MetricsSystemImpl.java:230)
	at org.apache.hadoop.metrics2.source.JvmMetrics.create(JvmMetrics.java:85)
	at org.apache.hadoop.yarn.server.nodemanager.metrics.NodeManagerMetrics.create(NodeManagerMetrics.java:74)
	at org.apache.hadoop.yarn.server.nodemanager.metrics.NodeManagerMetrics.create(NodeManagerMetrics.java:70)
	at org.apache.hadoop.yarn.server.nodemanager.NodeManager.<init>(NodeManager.java:89)
	at org.apache.hadoop.yarn.server.nodemanager.TestNodeManagerResync$TestNodeManager2.<init>(TestNodeManagerResync.java:483)
	at org.apache.hadoop.yarn.server.nodemanager.TestNodeManagerResync.testBlockNewContainerRequestsOnStartAndResync(TestNodeManagerResync.java:195)


FAILED:  org.apache.hadoop.yarn.server.nodemanager.TestNodeManagerResync.testKillContainersOnResync

Error Message:
Metrics source JvmMetrics already exists!

Stack Trace:
org.apache.hadoop.metrics2.MetricsException: Metrics source JvmMetrics already exists!
	at org.apache.hadoop.metrics2.lib.DefaultMetricsSystem.newSourceName(DefaultMetricsSystem.java:143)
	at org.apache.hadoop.metrics2.lib.DefaultMetricsSystem.sourceName(DefaultMetricsSystem.java:120)
	at org.apache.hadoop.metrics2.impl.MetricsSystemImpl.register(MetricsSystemImpl.java:230)
	at org.apache.hadoop.metrics2.source.JvmMetrics.create(JvmMetrics.java:85)
	at org.apache.hadoop.yarn.server.nodemanager.metrics.NodeManagerMetrics.create(NodeManagerMetrics.java:74)
	at org.apache.hadoop.yarn.server.nodemanager.metrics.NodeManagerMetrics.create(NodeManagerMetrics.java:70)
	at org.apache.hadoop.yarn.server.nodemanager.NodeManager.<init>(NodeManager.java:89)
	at org.apache.hadoop.yarn.server.nodemanager.TestNodeManagerResync$TestNodeManager1.<init>(TestNodeManagerResync.java:410)
	at org.apache.hadoop.yarn.server.nodemanager.TestNodeManagerResync.testKillContainersOnResync(TestNodeManagerResync.java:139)


FAILED:  org.apache.hadoop.yarn.server.nodemanager.TestNodeManagerResync.testNMSentContainerStatusOnResync

Error Message:
NMWebapps failed to start.

Stack Trace:
org.apache.hadoop.yarn.exceptions.YarnRuntimeException: NMWebapps failed to start.
	at sun.nio.ch.Net.bind0(Native Method)
	at sun.nio.ch.Net.bind(Net.java:414)
	at sun.nio.ch.Net.bind(Net.java:406)
	at sun.nio.ch.ServerSocketChannelImpl.bind(ServerSocketChannelImpl.java:214)
	at sun.nio.ch.ServerSocketAdaptor.bind(ServerSocketAdaptor.java:74)
	at org.mortbay.jetty.nio.SelectChannelConnector.open(SelectChannelConnector.java:216)
	at org.apache.hadoop.http.HttpServer2.openListeners(HttpServer2.java:901)
	at org.apache.hadoop.http.HttpServer2.start(HttpServer2.java:843)
	at org.apache.hadoop.yarn.webapp.WebApps$Builder.start(WebApps.java:306)
	at org.apache.hadoop.yarn.server.nodemanager.webapp.WebServer.serviceStart(WebServer.java:82)
	at org.apache.hadoop.service.AbstractService.start(AbstractService.java:193)
	at org.apache.hadoop.service.CompositeService.serviceStart(CompositeService.java:120)
	at org.apache.hadoop.yarn.server.nodemanager.NodeManager.serviceStart(NodeManager.java:368)
	at org.apache.hadoop.service.AbstractService.start(AbstractService.java:193)
	at org.apache.hadoop.yarn.server.nodemanager.TestNodeManagerResync.testNMSentContainerStatusOnResync(TestNodeManagerResync.java:355)


FAILED:  org.apache.hadoop.yarn.server.nodemanager.containermanager.logaggregation.TestLogAggregationService.testLocalFileDeletionOnDiskFull

Error Message:
check /home/jenkins/jenkins-slave/workspace/Hadoop-Yarn-trunk-Java8/hadoop-yarn-project/hadoop-yarn/hadoop-yarn-server/hadoop-yarn-server-nodemanager/target/TestLogAggregationService-localLogDir/application_1234_0001/container_1234_0001_01_000001/stdout

Stack Trace:
java.lang.AssertionError: check /home/jenkins/jenkins-slave/workspace/Hadoop-Yarn-trunk-Java8/hadoop-yarn-project/hadoop-yarn/hadoop-yarn-server/hadoop-yarn-server-nodemanager/target/TestLogAggregationService-localLogDir/application_1234_0001/container_1234_0001_01_000001/stdout
	at org.junit.Assert.fail(Assert.java:88)
	at org.junit.Assert.assertTrue(Assert.java:41)
	at org.junit.Assert.assertFalse(Assert.java:64)
	at org.apache.hadoop.yarn.server.nodemanager.containermanager.logaggregation.TestLogAggregationService.verifyLocalFileDeletion(TestLogAggregationService.java:226)
	at org.apache.hadoop.yarn.server.nodemanager.containermanager.logaggregation.TestLogAggregationService.testLocalFileDeletionOnDiskFull(TestLogAggregationService.java:285)


FAILED:  org.apache.hadoop.yarn.server.nodemanager.webapp.TestNMWebServicesApps.testNodeAppsSlash

Error Message:
java.net.BindException: Address already in use

Stack Trace:
com.sun.jersey.test.framework.spi.container.TestContainerException: java.net.BindException:
Address already in use
	at sun.nio.ch.Net.bind0(Native Method)
	at sun.nio.ch.Net.bind(Net.java:414)
	at sun.nio.ch.Net.bind(Net.java:406)
	at sun.nio.ch.ServerSocketChannelImpl.bind(ServerSocketChannelImpl.java:214)
	at sun.nio.ch.ServerSocketAdaptor.bind(ServerSocketAdaptor.java:74)
	at org.glassfish.grizzly.nio.transport.TCPNIOTransport.bind(TCPNIOTransport.java:413)
	at org.glassfish.grizzly.nio.transport.TCPNIOTransport.bind(TCPNIOTransport.java:384)
	at org.glassfish.grizzly.nio.transport.TCPNIOTransport.bind(TCPNIOTransport.java:375)
	at org.glassfish.grizzly.http.server.NetworkListener.start(NetworkListener.java:549)
	at org.glassfish.grizzly.http.server.HttpServer.start(HttpServer.java:255)
	at com.sun.jersey.api.container.grizzly2.GrizzlyServerFactory.createHttpServer(GrizzlyServerFactory.java:326)
	at com.sun.jersey.api.container.grizzly2.GrizzlyServerFactory.createHttpServer(GrizzlyServerFactory.java:343)
	at com.sun.jersey.test.framework.spi.container.grizzly2.web.GrizzlyWebTestContainerFactory$GrizzlyWebTestContainer.instantiateGrizzlyWebServer(GrizzlyWebTestContainerFactory.java:219)
	at com.sun.jersey.test.framework.spi.container.grizzly2.web.GrizzlyWebTestContainerFactory$GrizzlyWebTestContainer.<init>(GrizzlyWebTestContainerFactory.java:129)
	at com.sun.jersey.test.framework.spi.container.grizzly2.web.GrizzlyWebTestContainerFactory$GrizzlyWebTestContainer.<init>(GrizzlyWebTestContainerFactory.java:86)
	at com.sun.jersey.test.framework.spi.container.grizzly2.web.GrizzlyWebTestContainerFactory.create(GrizzlyWebTestContainerFactory.java:79)
	at com.sun.jersey.test.framework.JerseyTest.getContainer(JerseyTest.java:342)
	at com.sun.jersey.test.framework.JerseyTest.<init>(JerseyTest.java:217)
	at org.apache.hadoop.yarn.webapp.JerseyTestBase.<init>(JerseyTestBase.java:30)
	at org.apache.hadoop.yarn.server.nodemanager.webapp.TestNMWebServicesApps.<init>(TestNMWebServicesApps.java:176)


FAILED:  org.apache.hadoop.yarn.server.nodemanager.webapp.TestNMWebServicesApps.testNodeAppsState

Error Message:
java.net.BindException: Address already in use

Stack Trace:
com.sun.jersey.test.framework.spi.container.TestContainerException: java.net.BindException:
Address already in use
	at sun.nio.ch.Net.bind0(Native Method)
	at sun.nio.ch.Net.bind(Net.java:414)
	at sun.nio.ch.Net.bind(Net.java:406)
	at sun.nio.ch.ServerSocketChannelImpl.bind(ServerSocketChannelImpl.java:214)
	at sun.nio.ch.ServerSocketAdaptor.bind(ServerSocketAdaptor.java:74)
	at org.glassfish.grizzly.nio.transport.TCPNIOTransport.bind(TCPNIOTransport.java:413)
	at org.glassfish.grizzly.nio.transport.TCPNIOTransport.bind(TCPNIOTransport.java:384)
	at org.glassfish.grizzly.nio.transport.TCPNIOTransport.bind(TCPNIOTransport.java:375)
	at org.glassfish.grizzly.http.server.NetworkListener.start(NetworkListener.java:549)
	at org.glassfish.grizzly.http.server.HttpServer.start(HttpServer.java:255)
	at com.sun.jersey.api.container.grizzly2.GrizzlyServerFactory.createHttpServer(GrizzlyServerFactory.java:326)
	at com.sun.jersey.api.container.grizzly2.GrizzlyServerFactory.createHttpServer(GrizzlyServerFactory.java:343)
	at com.sun.jersey.test.framework.spi.container.grizzly2.web.GrizzlyWebTestContainerFactory$GrizzlyWebTestContainer.instantiateGrizzlyWebServer(GrizzlyWebTestContainerFactory.java:219)
	at com.sun.jersey.test.framework.spi.container.grizzly2.web.GrizzlyWebTestContainerFactory$GrizzlyWebTestContainer.<init>(GrizzlyWebTestContainerFactory.java:129)
	at com.sun.jersey.test.framework.spi.container.grizzly2.web.GrizzlyWebTestContainerFactory$GrizzlyWebTestContainer.<init>(GrizzlyWebTestContainerFactory.java:86)
	at com.sun.jersey.test.framework.spi.container.grizzly2.web.GrizzlyWebTestContainerFactory.create(GrizzlyWebTestContainerFactory.java:79)
	at com.sun.jersey.test.framework.JerseyTest.getContainer(JerseyTest.java:342)
	at com.sun.jersey.test.framework.JerseyTest.<init>(JerseyTest.java:217)
	at org.apache.hadoop.yarn.webapp.JerseyTestBase.<init>(JerseyTestBase.java:30)
	at org.apache.hadoop.yarn.server.nodemanager.webapp.TestNMWebServicesApps.<init>(TestNMWebServicesApps.java:176)


FAILED:  org.apache.hadoop.yarn.server.nodemanager.webapp.TestNMWebServicesApps.testNodeAppsXML

Error Message:
java.net.BindException: Address already in use

Stack Trace:
com.sun.jersey.test.framework.spi.container.TestContainerException: java.net.BindException:
Address already in use
	at sun.nio.ch.Net.bind0(Native Method)
	at sun.nio.ch.Net.bind(Net.java:414)
	at sun.nio.ch.Net.bind(Net.java:406)
	at sun.nio.ch.ServerSocketChannelImpl.bind(ServerSocketChannelImpl.java:214)
	at sun.nio.ch.ServerSocketAdaptor.bind(ServerSocketAdaptor.java:74)
	at org.glassfish.grizzly.nio.transport.TCPNIOTransport.bind(TCPNIOTransport.java:413)
	at org.glassfish.grizzly.nio.transport.TCPNIOTransport.bind(TCPNIOTransport.java:384)
	at org.glassfish.grizzly.nio.transport.TCPNIOTransport.bind(TCPNIOTransport.java:375)
	at org.glassfish.grizzly.http.server.NetworkListener.start(NetworkListener.java:549)
	at org.glassfish.grizzly.http.server.HttpServer.start(HttpServer.java:255)
	at com.sun.jersey.api.container.grizzly2.GrizzlyServerFactory.createHttpServer(GrizzlyServerFactory.java:326)
	at com.sun.jersey.api.container.grizzly2.GrizzlyServerFactory.createHttpServer(GrizzlyServerFactory.java:343)
	at com.sun.jersey.test.framework.spi.container.grizzly2.web.GrizzlyWebTestContainerFactory$GrizzlyWebTestContainer.instantiateGrizzlyWebServer(GrizzlyWebTestContainerFactory.java:219)
	at com.sun.jersey.test.framework.spi.container.grizzly2.web.GrizzlyWebTestContainerFactory$GrizzlyWebTestContainer.<init>(GrizzlyWebTestContainerFactory.java:129)
	at com.sun.jersey.test.framework.spi.container.grizzly2.web.GrizzlyWebTestContainerFactory$GrizzlyWebTestContainer.<init>(GrizzlyWebTestContainerFactory.java:86)
	at com.sun.jersey.test.framework.spi.container.grizzly2.web.GrizzlyWebTestContainerFactory.create(GrizzlyWebTestContainerFactory.java:79)
	at com.sun.jersey.test.framework.JerseyTest.getContainer(JerseyTest.java:342)
	at com.sun.jersey.test.framework.JerseyTest.<init>(JerseyTest.java:217)
	at org.apache.hadoop.yarn.webapp.JerseyTestBase.<init>(JerseyTestBase.java:30)
	at org.apache.hadoop.yarn.server.nodemanager.webapp.TestNMWebServicesApps.<init>(TestNMWebServicesApps.java:176)



Mime
  • Unnamed multipart/mixed (inline, None, 0 bytes)
View raw message