hadoop-yarn-dev mailing list archives

Site index · List index
Message view « Date » · « Thread »
Top « Date » · « Thread »
From Apache Jenkins Server <jenk...@builds.apache.org>
Subject Hadoop-Yarn-trunk-Java8 - Build # 646 - Failure
Date Fri, 06 Nov 2015 07:46:48 GMT
See https://builds.apache.org/job/Hadoop-Yarn-trunk-Java8/646/

###################################################################################
########################## LAST 60 LINES OF THE CONSOLE ###########################
[...truncated 4663 lines...]
-> at org.apache.hadoop.yarn.server.nodemanager.containermanager.localizer.TestResourceLocalizationService.testDownloadingResourcesOnContainerKill(TestResourceLocalizationService.java:1322)
Actual invocation has different arguments:
deletionService.delete(
    "user0",
    /home/jenkins/jenkins-slave/workspace/Hadoop-Yarn-trunk-Java8/hadoop-yarn-project/hadoop-yarn/hadoop-yarn-server/hadoop-yarn-server-nodemanager/target/org.apache.hadoop.yarn.server.nodemanager.containermanager.localizer.TestResourceLocalizationService/0/usercache/user0/appcache/application_314159265358979_0003/container_314159265358979_0003_01_000042
);
-> at org.apache.hadoop.yarn.server.nodemanager.containermanager.localizer.TestResourceLocalizationService.testDownloadingResourcesOnContainerKill(TestResourceLocalizationService.java:1296)


Tests run: 393, Failures: 3, Errors: 0, Skipped: 17

[INFO] ------------------------------------------------------------------------
[INFO] Reactor Summary:
[INFO] 
[INFO] Apache Hadoop YARN ................................ SUCCESS [ 12.411 s]
[INFO] Apache Hadoop YARN API ............................ SUCCESS [03:38 min]
[INFO] Apache Hadoop YARN Common ......................... SUCCESS [05:35 min]
[INFO] Apache Hadoop YARN Server ......................... SUCCESS [  0.136 s]
[INFO] Apache Hadoop YARN Server Common .................. SUCCESS [01:33 min]
[INFO] Apache Hadoop YARN NodeManager .................... FAILURE [14:40 min]
[INFO] Apache Hadoop YARN Web Proxy ...................... SKIPPED
[INFO] Apache Hadoop YARN ApplicationHistoryService ...... SKIPPED
[INFO] Apache Hadoop YARN ResourceManager ................ SKIPPED
[INFO] Apache Hadoop YARN Server Tests ................... SKIPPED
[INFO] Apache Hadoop YARN Client ......................... SKIPPED
[INFO] Apache Hadoop YARN SharedCacheManager ............. SKIPPED
[INFO] Apache Hadoop YARN Applications ................... SKIPPED
[INFO] Apache Hadoop YARN DistributedShell ............... SKIPPED
[INFO] Apache Hadoop YARN Unmanaged Am Launcher .......... SKIPPED
[INFO] Apache Hadoop YARN Site ........................... SKIPPED
[INFO] Apache Hadoop YARN Registry ....................... SKIPPED
[INFO] Apache Hadoop YARN Project ........................ SKIPPED
[INFO] ------------------------------------------------------------------------
[INFO] BUILD FAILURE
[INFO] ------------------------------------------------------------------------
[INFO] Total time: 25:44 min
[INFO] Finished at: 2015-11-06T07:46:52+00:00
[INFO] Final Memory: 81M/1127M
[INFO] ------------------------------------------------------------------------
[ERROR] Failed to execute goal org.apache.maven.plugins:maven-surefire-plugin:2.17:test (default-test)
on project hadoop-yarn-server-nodemanager: There are test failures.
[ERROR] 
[ERROR] Please refer to /home/jenkins/jenkins-slave/workspace/Hadoop-Yarn-trunk-Java8/hadoop-yarn-project/hadoop-yarn/hadoop-yarn-server/hadoop-yarn-server-nodemanager/target/surefire-reports
for the individual test results.
[ERROR] -> [Help 1]
[ERROR] 
[ERROR] To see the full stack trace of the errors, re-run Maven with the -e switch.
[ERROR] Re-run Maven using the -X switch to enable full debug logging.
[ERROR] 
[ERROR] For more information about the errors and possible solutions, please read the following
articles:
[ERROR] [Help 1] http://cwiki.apache.org/confluence/display/MAVEN/MojoFailureException
[ERROR] 
[ERROR] After correcting the problems, you can resume the build with the command
[ERROR]   mvn <goals> -rf :hadoop-yarn-server-nodemanager
Build step 'Execute shell' marked build as failure
Archiving artifacts
Recording test results
Updating HDFS-9384
Sending e-mails to: yarn-dev@hadoop.apache.org
Email was triggered for: Failure - Any
Sending email for trigger: Failure - Any



###################################################################################
############################## FAILED TESTS (if any) ##############################
3 tests failed.
FAILED:  org.apache.hadoop.yarn.server.nodemanager.containermanager.localizer.TestResourceLocalizationService.testDownloadingResourcesOnContainerKill

Error Message:

Argument(s) are different! Wanted:
deletionService.delete(
    "user0",
    null,
    <Downloading paths matcher>
);
-> at org.apache.hadoop.yarn.server.nodemanager.containermanager.localizer.TestResourceLocalizationService.testDownloadingResourcesOnContainerKill(TestResourceLocalizationService.java:1322)
Actual invocation has different arguments:
deletionService.delete(
    "user0",
    /home/jenkins/jenkins-slave/workspace/Hadoop-Yarn-trunk-Java8/hadoop-yarn-project/hadoop-yarn/hadoop-yarn-server/hadoop-yarn-server-nodemanager/target/org.apache.hadoop.yarn.server.nodemanager.containermanager.localizer.TestResourceLocalizationService/0/usercache/user0/appcache/application_314159265358979_0003/container_314159265358979_0003_01_000042
);
-> at org.apache.hadoop.yarn.server.nodemanager.containermanager.localizer.TestResourceLocalizationService.testDownloadingResourcesOnContainerKill(TestResourceLocalizationService.java:1296)


Stack Trace:
org.mockito.exceptions.verification.junit.ArgumentsAreDifferent: 
Argument(s) are different! Wanted:
deletionService.delete(
    "user0",
    null,
    <Downloading paths matcher>
);
-> at org.apache.hadoop.yarn.server.nodemanager.containermanager.localizer.TestResourceLocalizationService.testDownloadingResourcesOnContainerKill(TestResourceLocalizationService.java:1322)
Actual invocation has different arguments:
deletionService.delete(
    "user0",
    /home/jenkins/jenkins-slave/workspace/Hadoop-Yarn-trunk-Java8/hadoop-yarn-project/hadoop-yarn/hadoop-yarn-server/hadoop-yarn-server-nodemanager/target/org.apache.hadoop.yarn.server.nodemanager.containermanager.localizer.TestResourceLocalizationService/0/usercache/user0/appcache/application_314159265358979_0003/container_314159265358979_0003_01_000042
);
-> at org.apache.hadoop.yarn.server.nodemanager.containermanager.localizer.TestResourceLocalizationService.testDownloadingResourcesOnContainerKill(TestResourceLocalizationService.java:1296)

	at sun.reflect.NativeConstructorAccessorImpl.newInstance0(Native Method)
	at sun.reflect.NativeConstructorAccessorImpl.newInstance(NativeConstructorAccessorImpl.java:62)
	at sun.reflect.DelegatingConstructorAccessorImpl.newInstance(DelegatingConstructorAccessorImpl.java:45)
	at java.lang.reflect.Constructor.newInstance(Constructor.java:408)
	at org.apache.hadoop.yarn.server.nodemanager.containermanager.localizer.TestResourceLocalizationService.testDownloadingResourcesOnContainerKill(TestResourceLocalizationService.java:1322)


FAILED:  org.apache.hadoop.yarn.server.nodemanager.containermanager.logaggregation.TestLogAggregationService.testLocalFileDeletionOnDiskFull

Error Message:
null

Stack Trace:
java.lang.AssertionError: null
	at org.junit.Assert.fail(Assert.java:86)
	at org.junit.Assert.assertTrue(Assert.java:41)
	at org.junit.Assert.assertFalse(Assert.java:64)
	at org.junit.Assert.assertFalse(Assert.java:74)
	at org.apache.hadoop.yarn.server.nodemanager.containermanager.logaggregation.TestLogAggregationService.verifyLocalFileDeletion(TestLogAggregationService.java:229)
	at org.apache.hadoop.yarn.server.nodemanager.containermanager.logaggregation.TestLogAggregationService.testLocalFileDeletionOnDiskFull(TestLogAggregationService.java:285)


FAILED:  org.apache.hadoop.yarn.server.nodemanager.containermanager.logaggregation.TestLogAggregationService.testLocalFileDeletionAfterUpload

Error Message:
null

Stack Trace:
java.lang.AssertionError: null
	at org.junit.Assert.fail(Assert.java:86)
	at org.junit.Assert.assertTrue(Assert.java:41)
	at org.junit.Assert.assertFalse(Assert.java:64)
	at org.junit.Assert.assertFalse(Assert.java:74)
	at org.apache.hadoop.yarn.server.nodemanager.containermanager.logaggregation.TestLogAggregationService.verifyLocalFileDeletion(TestLogAggregationService.java:229)
	at org.apache.hadoop.yarn.server.nodemanager.containermanager.logaggregation.TestLogAggregationService.testLocalFileDeletionAfterUpload(TestLogAggregationService.java:265)



Mime
  • Unnamed multipart/mixed (inline, None, 0 bytes)
View raw message