hadoop-yarn-dev mailing list archives

Site index · List index
Message view « Date » · « Thread »
Top « Date » · « Thread »
From Apache Jenkins Server <jenk...@builds.apache.org>
Subject Build failed in Jenkins: Hadoop-Yarn-trunk #1427
Date Sat, 21 Nov 2015 00:12:21 GMT
See <https://builds.apache.org/job/Hadoop-Yarn-trunk/1427/changes>

Changes:

[jlowe] YARN-4374. RM capacity scheduler UI rounds user limit factor.

[wangda] YARN-3769. Consider user limit when calculating total pending resource

------------------------------------------
[...truncated 5463 lines...]
8/25 KB   
8/25 KB   
12/25 KB   
14/25 KB   
18/25 KB   
22/25 KB   
22/25 KB   
25/25 KB   
           
Downloaded: https://repository.apache.org/content/repositories/snapshots/org/apache/hadoop/hadoop-main/3.0.0-SNAPSHOT/hadoop-main-3.0.0-20151121.000421-6835.pom
(25 KB at 191.9 KB/sec)
[INFO] 
[INFO] --- maven-checkstyle-plugin:2.15:checkstyle (default-cli) @ hadoop-yarn-api ---
[INFO] There are 36652 errors reported by Checkstyle 6.6 with checkstyle/checkstyle.xml ruleset.
[WARNING] Unable to locate Source XRef to link to - DISABLED
[INFO] 
[INFO] --- findbugs-maven-plugin:3.0.0:findbugs (default-cli) @ hadoop-yarn-api ---
[INFO] Fork Value is true
[INFO] Done FindBugs Analysis....
[INFO]                                                                         
[INFO] ------------------------------------------------------------------------
[INFO] Building Apache Hadoop YARN Common 3.0.0-SNAPSHOT
[INFO] ------------------------------------------------------------------------
[INFO] 
[INFO] --- maven-clean-plugin:2.5:clean (default-clean) @ hadoop-yarn-common ---
[INFO] Deleting <https://builds.apache.org/job/Hadoop-Yarn-trunk/ws/hadoop-yarn-project/hadoop-yarn/hadoop-yarn-common/target>
[INFO] 
[INFO] --- maven-antrun-plugin:1.7:run (create-testdirs) @ hadoop-yarn-common ---
[INFO] Executing tasks

main:
    [mkdir] Created dir: <https://builds.apache.org/job/Hadoop-Yarn-trunk/ws/hadoop-yarn-project/hadoop-yarn/hadoop-yarn-common/target/test-dir>
[INFO] Executed tasks
[INFO] 
[INFO] --- hadoop-maven-plugins:3.0.0-SNAPSHOT:protoc (compile-protoc) @ hadoop-yarn-common
---
[INFO] Wrote protoc checksums to file <https://builds.apache.org/job/Hadoop-Yarn-trunk/ws/hadoop-yarn-project/hadoop-yarn/hadoop-yarn-common/target/hadoop-maven-plugins-protoc-checksums.json>
[INFO] 
[INFO] --- hadoop-maven-plugins:3.0.0-SNAPSHOT:version-info (version-info) @ hadoop-yarn-common
---
[WARNING] [svn, info] failed with error code 1
[INFO] SCM: GIT
[INFO] Computed MD5: c8e24d296307bceb9cc7c51f20ac10
[INFO] 
[INFO] --- maven-resources-plugin:2.6:resources (default-resources) @ hadoop-yarn-common ---
[INFO] Using 'UTF-8' encoding to copy filtered resources.
[INFO] Copying 48 resources
[INFO] Copying 1 resource
[INFO] 
[INFO] --- maven-compiler-plugin:3.1:compile (default-compile) @ hadoop-yarn-common ---
[INFO] Changes detected - recompiling the module!
[INFO] Compiling 340 source files to <https://builds.apache.org/job/Hadoop-Yarn-trunk/ws/hadoop-yarn-project/hadoop-yarn/hadoop-yarn-common/target/classes>
[INFO] 
[INFO] --- maven-resources-plugin:2.6:testResources (default-testResources) @ hadoop-yarn-common
---
[INFO] Using 'UTF-8' encoding to copy filtered resources.
[INFO] Copying 6 resources
[INFO] 
[INFO] --- maven-compiler-plugin:3.1:testCompile (default-testCompile) @ hadoop-yarn-common
---
[INFO] Changes detected - recompiling the module!
[INFO] Compiling 72 source files to <https://builds.apache.org/job/Hadoop-Yarn-trunk/ws/hadoop-yarn-project/hadoop-yarn/hadoop-yarn-common/target/test-classes>
[INFO] 
[INFO] --- maven-jar-plugin:2.5:test-jar (default) @ hadoop-yarn-common ---
[INFO] Building jar: <https://builds.apache.org/job/Hadoop-Yarn-trunk/ws/hadoop-yarn-project/hadoop-yarn/hadoop-yarn-common/target/hadoop-yarn-common-3.0.0-SNAPSHOT-tests.jar>
[INFO] 
[INFO] --- maven-surefire-plugin:2.17:test (default-test) @ hadoop-yarn-common ---
[INFO] Surefire report directory: <https://builds.apache.org/job/Hadoop-Yarn-trunk/ws/hadoop-yarn-project/hadoop-yarn/hadoop-yarn-common/target/surefire-reports>

-------------------------------------------------------
 T E S T S
-------------------------------------------------------

-------------------------------------------------------
 T E S T S
-------------------------------------------------------
Running org.apache.hadoop.yarn.api.TestGetApplicationsRequest
Tests run: 1, Failures: 0, Errors: 0, Skipped: 0, Time elapsed: 1.015 sec - in org.apache.hadoop.yarn.api.TestGetApplicationsRequest
Running org.apache.hadoop.yarn.api.TestPBImplRecords
Tests run: 118, Failures: 0, Errors: 0, Skipped: 5, Time elapsed: 3.182 sec - in org.apache.hadoop.yarn.api.TestPBImplRecords
Running org.apache.hadoop.yarn.api.records.impl.pb.TestSerializedExceptionPBImpl
Tests run: 5, Failures: 0, Errors: 0, Skipped: 0, Time elapsed: 0.225 sec - in org.apache.hadoop.yarn.api.records.impl.pb.TestSerializedExceptionPBImpl
Running org.apache.hadoop.yarn.api.records.timeline.TestTimelineRecords
Tests run: 5, Failures: 0, Errors: 0, Skipped: 0, Time elapsed: 1.13 sec - in org.apache.hadoop.yarn.api.records.timeline.TestTimelineRecords
Running org.apache.hadoop.yarn.api.TestApplicationAttemptId
Tests run: 1, Failures: 0, Errors: 0, Skipped: 0, Time elapsed: 0.982 sec - in org.apache.hadoop.yarn.api.TestApplicationAttemptId
Running org.apache.hadoop.yarn.api.TestContainerId
Tests run: 1, Failures: 0, Errors: 0, Skipped: 0, Time elapsed: 0.812 sec - in org.apache.hadoop.yarn.api.TestContainerId
Running org.apache.hadoop.yarn.api.TestApplicationId
Tests run: 1, Failures: 0, Errors: 0, Skipped: 0, Time elapsed: 0.856 sec - in org.apache.hadoop.yarn.api.TestApplicationId
Running org.apache.hadoop.yarn.api.TestApplicatonReport
Tests run: 1, Failures: 0, Errors: 0, Skipped: 0, Time elapsed: 0.313 sec - in org.apache.hadoop.yarn.api.TestApplicatonReport
Running org.apache.hadoop.yarn.api.TestNodeId
Tests run: 1, Failures: 0, Errors: 0, Skipped: 0, Time elapsed: 0.758 sec - in org.apache.hadoop.yarn.api.TestNodeId
Running org.apache.hadoop.yarn.logaggregation.TestAggregatedLogFormat
Tests run: 3, Failures: 0, Errors: 0, Skipped: 1, Time elapsed: 3.01 sec - in org.apache.hadoop.yarn.logaggregation.TestAggregatedLogFormat
Running org.apache.hadoop.yarn.logaggregation.TestAggregatedLogsBlock
Tests run: 5, Failures: 0, Errors: 0, Skipped: 0, Time elapsed: 2.909 sec - in org.apache.hadoop.yarn.logaggregation.TestAggregatedLogsBlock
Running org.apache.hadoop.yarn.logaggregation.TestAggregatedLogDeletionService
Tests run: 3, Failures: 0, Errors: 0, Skipped: 0, Time elapsed: 4.58 sec - in org.apache.hadoop.yarn.logaggregation.TestAggregatedLogDeletionService
Running org.apache.hadoop.yarn.server.security.TestApplicationACLsManager
Tests run: 3, Failures: 0, Errors: 0, Skipped: 0, Time elapsed: 1.781 sec - in org.apache.hadoop.yarn.server.security.TestApplicationACLsManager
Running org.apache.hadoop.yarn.client.api.impl.TestTimelineClient
Tests run: 9, Failures: 0, Errors: 0, Skipped: 0, Time elapsed: 19.892 sec - in org.apache.hadoop.yarn.client.api.impl.TestTimelineClient
Running org.apache.hadoop.yarn.client.TestClientRMProxy
Tests run: 2, Failures: 0, Errors: 0, Skipped: 0, Time elapsed: 1.413 sec - in org.apache.hadoop.yarn.client.TestClientRMProxy
Running org.apache.hadoop.yarn.nodelabels.TestFileSystemNodeLabelsStore
Tests run: 4, Failures: 0, Errors: 0, Skipped: 0, Time elapsed: 3.27 sec - in org.apache.hadoop.yarn.nodelabels.TestFileSystemNodeLabelsStore
Running org.apache.hadoop.yarn.nodelabels.TestCommonNodeLabelsManager
Tests run: 16, Failures: 0, Errors: 0, Skipped: 0, Time elapsed: 3.267 sec - in org.apache.hadoop.yarn.nodelabels.TestCommonNodeLabelsManager
Running org.apache.hadoop.yarn.TestContainerLogAppender
Tests run: 1, Failures: 0, Errors: 0, Skipped: 0, Time elapsed: 0.427 sec - in org.apache.hadoop.yarn.TestContainerLogAppender
Running org.apache.hadoop.yarn.util.resource.TestResourceCalculator
Tests run: 4, Failures: 0, Errors: 0, Skipped: 0, Time elapsed: 0.794 sec - in org.apache.hadoop.yarn.util.resource.TestResourceCalculator
Running org.apache.hadoop.yarn.util.resource.TestResources
Tests run: 2, Failures: 0, Errors: 0, Skipped: 0, Time elapsed: 0.823 sec - in org.apache.hadoop.yarn.util.resource.TestResources
Running org.apache.hadoop.yarn.util.TestWindowsBasedProcessTree
Tests run: 1, Failures: 0, Errors: 0, Skipped: 0, Time elapsed: 0.547 sec - in org.apache.hadoop.yarn.util.TestWindowsBasedProcessTree
Running org.apache.hadoop.yarn.util.TestFSDownload
Tests run: 10, Failures: 0, Errors: 0, Skipped: 1, Time elapsed: 4.66 sec - in org.apache.hadoop.yarn.util.TestFSDownload
Running org.apache.hadoop.yarn.util.TestAdHocLogDumper
Tests run: 1, Failures: 0, Errors: 0, Skipped: 0, Time elapsed: 2.401 sec - in org.apache.hadoop.yarn.util.TestAdHocLogDumper
Running org.apache.hadoop.yarn.util.TestTimes
Tests run: 5, Failures: 0, Errors: 0, Skipped: 0, Time elapsed: 0.373 sec - in org.apache.hadoop.yarn.util.TestTimes
Running org.apache.hadoop.yarn.util.TestResourceCalculatorProcessTree
Tests run: 2, Failures: 0, Errors: 0, Skipped: 0, Time elapsed: 0.468 sec - in org.apache.hadoop.yarn.util.TestResourceCalculatorProcessTree
Running org.apache.hadoop.yarn.util.TestRackResolver
Tests run: 1, Failures: 0, Errors: 0, Skipped: 0, Time elapsed: 0.857 sec - in org.apache.hadoop.yarn.util.TestRackResolver
Running org.apache.hadoop.yarn.util.TestLog4jWarningErrorMetricsAppender
Tests run: 6, Failures: 0, Errors: 0, Skipped: 0, Time elapsed: 9.417 sec - in org.apache.hadoop.yarn.util.TestLog4jWarningErrorMetricsAppender
Running org.apache.hadoop.yarn.util.TestConverterUtils
Tests run: 9, Failures: 0, Errors: 0, Skipped: 0, Time elapsed: 1.078 sec - in org.apache.hadoop.yarn.util.TestConverterUtils
Running org.apache.hadoop.yarn.util.TestRackResolverScriptBasedMapping
Tests run: 1, Failures: 0, Errors: 0, Skipped: 0, Time elapsed: 0.837 sec - in org.apache.hadoop.yarn.util.TestRackResolverScriptBasedMapping
Running org.apache.hadoop.yarn.util.TestProcfsBasedProcessTree
Tests run: 5, Failures: 0, Errors: 0, Skipped: 0, Time elapsed: 2.369 sec - in org.apache.hadoop.yarn.util.TestProcfsBasedProcessTree
Running org.apache.hadoop.yarn.util.TestYarnVersionInfo
Tests run: 1, Failures: 0, Errors: 0, Skipped: 0, Time elapsed: 0.439 sec - in org.apache.hadoop.yarn.util.TestYarnVersionInfo
Running org.apache.hadoop.yarn.util.TestApps
Tests run: 1, Failures: 0, Errors: 0, Skipped: 0, Time elapsed: 0.531 sec - in org.apache.hadoop.yarn.util.TestApps
Running org.apache.hadoop.yarn.TestRPC
Tests run: 2, Failures: 0, Errors: 0, Skipped: 0, Time elapsed: 2.928 sec - in org.apache.hadoop.yarn.TestRPC
Running org.apache.hadoop.yarn.security.TestYARNTokenIdentifier
Tests run: 8, Failures: 0, Errors: 0, Skipped: 0, Time elapsed: 1.708 sec - in org.apache.hadoop.yarn.security.TestYARNTokenIdentifier
Running org.apache.hadoop.yarn.TestRpcFactoryProvider
Tests run: 1, Failures: 0, Errors: 0, Skipped: 0, Time elapsed: 0.948 sec - in org.apache.hadoop.yarn.TestRpcFactoryProvider
Running org.apache.hadoop.yarn.conf.TestHAUtil
Tests run: 4, Failures: 0, Errors: 0, Skipped: 0, Time elapsed: 1.623 sec - in org.apache.hadoop.yarn.conf.TestHAUtil
Running org.apache.hadoop.yarn.conf.TestYarnConfiguration
Tests run: 5, Failures: 0, Errors: 0, Skipped: 0, Time elapsed: 2.076 sec - in org.apache.hadoop.yarn.conf.TestYarnConfiguration
Running org.apache.hadoop.yarn.TestContainerResourceIncreaseRPC
Tests run: 1, Failures: 0, Errors: 0, Skipped: 0, Time elapsed: 5.319 sec - in org.apache.hadoop.yarn.TestContainerResourceIncreaseRPC
Running org.apache.hadoop.yarn.TestRecordFactory
Tests run: 1, Failures: 0, Errors: 0, Skipped: 0, Time elapsed: 0.665 sec - in org.apache.hadoop.yarn.TestRecordFactory
Running org.apache.hadoop.yarn.TestContainerLaunchRPC
Tests run: 1, Failures: 0, Errors: 0, Skipped: 0, Time elapsed: 5.294 sec - in org.apache.hadoop.yarn.TestContainerLaunchRPC
Running org.apache.hadoop.yarn.TestYarnUncaughtExceptionHandler
Exception: org.apache.hadoop.util.ExitUtil$ExitException thrown from the UncaughtExceptionHandler
in thread "Thread-0"
Exception: org.apache.hadoop.util.ExitUtil$HaltException thrown from the UncaughtExceptionHandler
in thread "Thread-3"
Tests run: 3, Failures: 0, Errors: 0, Skipped: 0, Time elapsed: 0.713 sec - in org.apache.hadoop.yarn.TestYarnUncaughtExceptionHandler
Running org.apache.hadoop.yarn.ipc.TestRPCUtil
Tests run: 11, Failures: 0, Errors: 0, Skipped: 0, Time elapsed: 0.142 sec - in org.apache.hadoop.yarn.ipc.TestRPCUtil
Running org.apache.hadoop.yarn.event.TestAsyncDispatcher
Tests run: 2, Failures: 0, Errors: 0, Skipped: 0, Time elapsed: 3.564 sec - in org.apache.hadoop.yarn.event.TestAsyncDispatcher
Running org.apache.hadoop.yarn.TestRPCFactories
Tests run: 1, Failures: 0, Errors: 0, Skipped: 0, Time elapsed: 1.691 sec - in org.apache.hadoop.yarn.TestRPCFactories
Running org.apache.hadoop.yarn.webapp.view.TestCommonViews
Tests run: 5, Failures: 0, Errors: 0, Skipped: 0, Time elapsed: 2.053 sec - in org.apache.hadoop.yarn.webapp.view.TestCommonViews
Running org.apache.hadoop.yarn.webapp.view.TestHtmlPage
Tests run: 2, Failures: 0, Errors: 0, Skipped: 0, Time elapsed: 1.54 sec - in org.apache.hadoop.yarn.webapp.view.TestHtmlPage
Running org.apache.hadoop.yarn.webapp.view.TestInfoBlock
Tests run: 2, Failures: 0, Errors: 0, Skipped: 0, Time elapsed: 1.526 sec - in org.apache.hadoop.yarn.webapp.view.TestInfoBlock
Running org.apache.hadoop.yarn.webapp.view.TestTwoColumnCssPage
Tests run: 1, Failures: 0, Errors: 0, Skipped: 0, Time elapsed: 2.403 sec - in org.apache.hadoop.yarn.webapp.view.TestTwoColumnCssPage
Running org.apache.hadoop.yarn.webapp.view.TestTwoColumnLayout
Tests run: 1, Failures: 0, Errors: 0, Skipped: 0, Time elapsed: 2.417 sec - in org.apache.hadoop.yarn.webapp.view.TestTwoColumnLayout
Running org.apache.hadoop.yarn.webapp.view.TestHtmlBlock
Tests run: 3, Failures: 0, Errors: 0, Skipped: 0, Time elapsed: 1.503 sec - in org.apache.hadoop.yarn.webapp.view.TestHtmlBlock
Running org.apache.hadoop.yarn.webapp.util.TestWebAppUtils
Tests run: 3, Failures: 0, Errors: 0, Skipped: 0, Time elapsed: 2.282 sec - in org.apache.hadoop.yarn.webapp.util.TestWebAppUtils
Running org.apache.hadoop.yarn.webapp.test.TestWebAppTests
Tests run: 4, Failures: 0, Errors: 0, Skipped: 0, Time elapsed: 1.188 sec - in org.apache.hadoop.yarn.webapp.test.TestWebAppTests
Running org.apache.hadoop.yarn.webapp.TestParseRoute
Tests run: 10, Failures: 0, Errors: 0, Skipped: 0, Time elapsed: 0.514 sec - in org.apache.hadoop.yarn.webapp.TestParseRoute
Running org.apache.hadoop.yarn.webapp.TestSubViews
Tests run: 1, Failures: 0, Errors: 0, Skipped: 0, Time elapsed: 1.655 sec - in org.apache.hadoop.yarn.webapp.TestSubViews
Running org.apache.hadoop.yarn.webapp.TestWebApp
Tests run: 9, Failures: 0, Errors: 1, Skipped: 0, Time elapsed: 7.268 sec <<< FAILURE!
- in org.apache.hadoop.yarn.webapp.TestWebApp
testYARNWebAppContext(org.apache.hadoop.yarn.webapp.TestWebApp)  Time elapsed: 2.261 sec 
<<< ERROR!
java.lang.RuntimeException: java.io.IOException: Server returned HTTP response code: 403 for
URL: http://localhost:47183/static/
	at sun.net.www.protocol.http.HttpURLConnection.getInputStream(HttpURLConnection.java:1626)
	at org.apache.hadoop.yarn.webapp.TestWebApp.getContent(TestWebApp.java:293)
	at org.apache.hadoop.yarn.webapp.TestWebApp.testYARNWebAppContext(TestWebApp.java:276)

Running org.apache.hadoop.yarn.webapp.hamlet.TestHamletImpl
Tests run: 4, Failures: 0, Errors: 0, Skipped: 0, Time elapsed: 1.085 sec - in org.apache.hadoop.yarn.webapp.hamlet.TestHamletImpl
Running org.apache.hadoop.yarn.webapp.hamlet.TestHamlet
Tests run: 6, Failures: 0, Errors: 0, Skipped: 0, Time elapsed: 1.182 sec - in org.apache.hadoop.yarn.webapp.hamlet.TestHamlet
Running org.apache.hadoop.yarn.webapp.hamlet.TestParseSelector
Tests run: 5, Failures: 0, Errors: 0, Skipped: 0, Time elapsed: 0.297 sec - in org.apache.hadoop.yarn.webapp.hamlet.TestParseSelector

Results :

Tests in error: 
  TestWebApp.testYARNWebAppContext:276->getContent:302 Runtime java.io.IOExcepti...

Tests run: 325, Failures: 0, Errors: 1, Skipped: 7

[INFO] ------------------------------------------------------------------------
[INFO] Reactor Summary:
[INFO] 
[INFO] Apache Hadoop YARN ................................ SUCCESS [  7.671 s]
[INFO] Apache Hadoop YARN API ............................ SUCCESS [07:05 min]
[INFO] Apache Hadoop YARN Common ......................... FAILURE [02:53 min]
[INFO] Apache Hadoop YARN Server ......................... SKIPPED
[INFO] Apache Hadoop YARN Server Common .................. SKIPPED
[INFO] Apache Hadoop YARN NodeManager .................... SKIPPED
[INFO] Apache Hadoop YARN Web Proxy ...................... SKIPPED
[INFO] Apache Hadoop YARN ApplicationHistoryService ...... SKIPPED
[INFO] Apache Hadoop YARN ResourceManager ................ SKIPPED
[INFO] Apache Hadoop YARN Server Tests ................... SKIPPED
[INFO] Apache Hadoop YARN Client ......................... SKIPPED
[INFO] Apache Hadoop YARN SharedCacheManager ............. SKIPPED
[INFO] Apache Hadoop YARN Applications ................... SKIPPED
[INFO] Apache Hadoop YARN DistributedShell ............... SKIPPED
[INFO] Apache Hadoop YARN Unmanaged Am Launcher .......... SKIPPED
[INFO] Apache Hadoop YARN Site ........................... SKIPPED
[INFO] Apache Hadoop YARN Registry ....................... SKIPPED
[INFO] Apache Hadoop YARN Project ........................ SKIPPED
[INFO] ------------------------------------------------------------------------
[INFO] BUILD FAILURE
[INFO] ------------------------------------------------------------------------
[INFO] Total time: 10:09 min
[INFO] Finished at: 2015-11-21T00:12:24+00:00
[INFO] Final Memory: 66M/945M
[INFO] ------------------------------------------------------------------------
[ERROR] Failed to execute goal org.apache.maven.plugins:maven-surefire-plugin:2.17:test (default-test)
on project hadoop-yarn-common: There are test failures.
[ERROR] 
[ERROR] Please refer to <https://builds.apache.org/job/Hadoop-Yarn-trunk/ws/hadoop-yarn-project/hadoop-yarn/hadoop-yarn-common/target/surefire-reports>
for the individual test results.
[ERROR] -> [Help 1]
[ERROR] 
[ERROR] To see the full stack trace of the errors, re-run Maven with the -e switch.
[ERROR] Re-run Maven using the -X switch to enable full debug logging.
[ERROR] 
[ERROR] For more information about the errors and possible solutions, please read the following
articles:
[ERROR] [Help 1] http://cwiki.apache.org/confluence/display/MAVEN/MojoFailureException
[ERROR] 
[ERROR] After correcting the problems, you can resume the build with the command
[ERROR]   mvn <goals> -rf :hadoop-yarn-common
Build step 'Execute shell' marked build as failure
Archiving artifacts
Recording test results
Updating YARN-4374
Updating YARN-3769

Mime
View raw message