hadoop-yarn-dev mailing list archives

Site index · List index
Message view « Date » · « Thread »
Top « Date » · « Thread »
From Apache Jenkins Server <jenk...@builds.apache.org>
Subject Hadoop-Yarn-trunk - Build # 1458 - Still Failing
Date Thu, 26 Nov 2015 07:46:39 GMT
See https://builds.apache.org/job/Hadoop-Yarn-trunk/1458/

###################################################################################
########################## LAST 60 LINES OF THE CONSOLE ###########################
[...truncated 9475 lines...]
Failed tests: 
  TestRMAppTransitions.testAppKilledKilled:927->assertTimesAtFinish:321 application finish
time is not greater then 0
  TestApplicationPriority.testApplicationPriorityAllocationWithChangeInPriority:492 Attempt
state is not correct (timedout): expected: SCHEDULED actual: ALLOCATED for the application
attempt appattempt_1448521768647_0002_000001

Tests in error: 
  TestEmptyQueues.testFifoPolicy:44 »  test timed out after 1000 milliseconds
  TestSchedulingPolicy.testIsApplicableTo:81 »  test timed out after 1000 millis...
  TestSubmitApplicationWithRMHA.testHandleRMHADuringSubmitApplicationCallWithSavedApplicationState:241->RMHATestBase.explicitFailover:184
» 

Tests run: 1266, Failures: 2, Errors: 3, Skipped: 2

[INFO] ------------------------------------------------------------------------
[INFO] Reactor Summary:
[INFO] 
[INFO] Apache Hadoop YARN ................................ SUCCESS [  9.337 s]
[INFO] Apache Hadoop YARN API ............................ SUCCESS [08:09 min]
[INFO] Apache Hadoop YARN Common ......................... SUCCESS [06:22 min]
[INFO] Apache Hadoop YARN Server ......................... SUCCESS [  0.284 s]
[INFO] Apache Hadoop YARN Server Common .................. SUCCESS [01:51 min]
[INFO] Apache Hadoop YARN NodeManager .................... SUCCESS [14:16 min]
[INFO] Apache Hadoop YARN Web Proxy ...................... SUCCESS [01:04 min]
[INFO] Apache Hadoop YARN ApplicationHistoryService ...... SUCCESS [06:16 min]
[INFO] Apache Hadoop YARN ResourceManager ................ FAILURE [  01:19 h]
[INFO] Apache Hadoop YARN Server Tests ................... SKIPPED
[INFO] Apache Hadoop YARN Client ......................... SKIPPED
[INFO] Apache Hadoop YARN SharedCacheManager ............. SKIPPED
[INFO] Apache Hadoop YARN Applications ................... SKIPPED
[INFO] Apache Hadoop YARN DistributedShell ............... SKIPPED
[INFO] Apache Hadoop YARN Unmanaged Am Launcher .......... SKIPPED
[INFO] Apache Hadoop YARN Site ........................... SKIPPED
[INFO] Apache Hadoop YARN Registry ....................... SKIPPED
[INFO] Apache Hadoop YARN Project ........................ SKIPPED
[INFO] ------------------------------------------------------------------------
[INFO] BUILD FAILURE
[INFO] ------------------------------------------------------------------------
[INFO] Total time: 01:57 h
[INFO] Finished at: 2015-11-26T07:46:28+00:00
[INFO] Final Memory: 61M/468M
[INFO] ------------------------------------------------------------------------
[ERROR] Failed to execute goal org.apache.maven.plugins:maven-surefire-plugin:2.17:test (default-test)
on project hadoop-yarn-server-resourcemanager: There are test failures.
[ERROR] 
[ERROR] Please refer to /home/jenkins/jenkins-slave/workspace/Hadoop-Yarn-trunk/hadoop-yarn-project/hadoop-yarn/hadoop-yarn-server/hadoop-yarn-server-resourcemanager/target/surefire-reports
for the individual test results.
[ERROR] -> [Help 1]
[ERROR] 
[ERROR] To see the full stack trace of the errors, re-run Maven with the -e switch.
[ERROR] Re-run Maven using the -X switch to enable full debug logging.
[ERROR] 
[ERROR] For more information about the errors and possible solutions, please read the following
articles:
[ERROR] [Help 1] http://cwiki.apache.org/confluence/display/MAVEN/MojoFailureException
[ERROR] 
[ERROR] After correcting the problems, you can resume the build with the command
[ERROR]   mvn <goals> -rf :hadoop-yarn-server-resourcemanager
Build step 'Execute shell' marked build as failure
Archiving artifacts
Recording test results
Updating HDFS-9426
Sending e-mails to: yarn-dev@hadoop.apache.org
Email was triggered for: Failure - Any
Sending email for trigger: Failure - Any



###################################################################################
############################## FAILED TESTS (if any) ##############################
5 tests failed.
FAILED:  org.apache.hadoop.yarn.server.resourcemanager.TestSubmitApplicationWithRMHA.testHandleRMHADuringSubmitApplicationCallWithSavedApplicationState

Error Message:
test timed out after 5000 milliseconds

Stack Trace:
java.lang.Exception: test timed out after 5000 milliseconds
	at java.lang.Throwable.getStackTraceDepth(Native Method)
	at java.lang.Throwable.getOurStackTrace(Throwable.java:824)
	at java.lang.Throwable.getStackTrace(Throwable.java:816)
	at sun.reflect.GeneratedMethodAccessor2.invoke(Unknown Source)
	at sun.reflect.DelegatingMethodAccessorImpl.invoke(DelegatingMethodAccessorImpl.java:43)
	at java.lang.reflect.Method.invoke(Method.java:606)
	at org.apache.log4j.spi.LocationInfo.<init>(LocationInfo.java:139)
	at org.apache.log4j.spi.LoggingEvent.getLocationInformation(LoggingEvent.java:253)
	at org.apache.log4j.helpers.PatternParser$LocationPatternConverter.convert(PatternParser.java:500)
	at org.apache.log4j.helpers.PatternConverter.format(PatternConverter.java:65)
	at org.apache.log4j.PatternLayout.format(PatternLayout.java:506)
	at org.apache.log4j.WriterAppender.subAppend(WriterAppender.java:310)
	at org.apache.log4j.WriterAppender.append(WriterAppender.java:162)
	at org.apache.log4j.AppenderSkeleton.doAppend(AppenderSkeleton.java:251)
	at org.apache.log4j.helpers.AppenderAttachableImpl.appendLoopOnAppenders(AppenderAttachableImpl.java:66)
	at org.apache.log4j.Category.callAppenders(Category.java:206)
	at org.apache.log4j.Category.forcedLog(Category.java:391)
	at org.apache.log4j.Category.log(Category.java:856)
	at org.apache.commons.logging.impl.Log4JLogger.info(Log4JLogger.java:176)
	at org.apache.hadoop.yarn.server.resourcemanager.RMAuditLogger.logSuccess(RMAuditLogger.java:214)
	at org.apache.hadoop.yarn.server.resourcemanager.AdminService.refreshSuperUserGroupsConfiguration(AdminService.java:457)
	at org.apache.hadoop.yarn.server.resourcemanager.AdminService.refreshAll(AdminService.java:674)
	at org.apache.hadoop.yarn.server.resourcemanager.AdminService.transitionToActive(AdminService.java:329)
	at org.apache.hadoop.yarn.server.resourcemanager.RMHATestBase.explicitFailover(RMHATestBase.java:184)
	at org.apache.hadoop.yarn.server.resourcemanager.TestSubmitApplicationWithRMHA.testHandleRMHADuringSubmitApplicationCallWithSavedApplicationState(TestSubmitApplicationWithRMHA.java:241)


FAILED:  org.apache.hadoop.yarn.server.resourcemanager.rmapp.TestRMAppTransitions.testAppKilledKilled[0]

Error Message:
application finish time is not greater then 0

Stack Trace:
java.lang.AssertionError: application finish time is not greater then 0
	at org.junit.Assert.fail(Assert.java:88)
	at org.junit.Assert.assertTrue(Assert.java:41)
	at org.apache.hadoop.yarn.server.resourcemanager.rmapp.TestRMAppTransitions.assertTimesAtFinish(TestRMAppTransitions.java:321)
	at org.apache.hadoop.yarn.server.resourcemanager.rmapp.TestRMAppTransitions.testAppKilledKilled(TestRMAppTransitions.java:927)


FAILED:  org.apache.hadoop.yarn.server.resourcemanager.scheduler.capacity.TestApplicationPriority.testApplicationPriorityAllocationWithChangeInPriority

Error Message:
Attempt state is not correct (timedout): expected: SCHEDULED actual: ALLOCATED for the application
attempt appattempt_1448521768647_0002_000001

Stack Trace:
java.lang.AssertionError: Attempt state is not correct (timedout): expected: SCHEDULED actual:
ALLOCATED for the application attempt appattempt_1448521768647_0002_000001
	at org.junit.Assert.fail(Assert.java:88)
	at org.apache.hadoop.yarn.server.resourcemanager.MockRM.waitForState(MockRM.java:197)
	at org.apache.hadoop.yarn.server.resourcemanager.MockRM.waitForState(MockRM.java:172)
	at org.apache.hadoop.yarn.server.resourcemanager.MockRM.waitForAttemptScheduled(MockRM.java:830)
	at org.apache.hadoop.yarn.server.resourcemanager.MockRM.launchAM(MockRM.java:817)
	at org.apache.hadoop.yarn.server.resourcemanager.scheduler.capacity.TestApplicationPriority.testApplicationPriorityAllocationWithChangeInPriority(TestApplicationPriority.java:492)


FAILED:  org.apache.hadoop.yarn.server.resourcemanager.scheduler.fair.TestSchedulingPolicy.testIsApplicableTo

Error Message:
test timed out after 1000 milliseconds

Stack Trace:
java.lang.Exception: test timed out after 1000 milliseconds
	at org.apache.xerces.dom.DeferredDocumentImpl.synchronizeChildren(Unknown Source)
	at org.apache.xerces.dom.DeferredElementNSImpl.synchronizeChildren(Unknown Source)
	at org.apache.xerces.dom.ParentNode.getChildNodes(Unknown Source)
	at org.apache.hadoop.conf.Configuration.loadResource(Configuration.java:2651)
	at org.apache.hadoop.conf.Configuration.loadResources(Configuration.java:2567)
	at org.apache.hadoop.conf.Configuration.getProps(Configuration.java:2471)
	at org.apache.hadoop.conf.Configuration.get(Configuration.java:1296)
	at org.apache.hadoop.yarn.factory.providers.RecordFactoryProvider.getRecordFactory(RecordFactoryProvider.java:49)
	at org.apache.hadoop.yarn.util.Records.<clinit>(Records.java:32)
	at org.apache.hadoop.yarn.util.resource.Resources.createResource(Resources.java:102)
	at org.apache.hadoop.yarn.util.resource.Resources.createResource(Resources.java:98)
	at org.apache.hadoop.yarn.server.resourcemanager.scheduler.fair.policies.FairSharePolicy$FairShareComparator.<clinit>(FairSharePolicy.java:71)
	at org.apache.hadoop.yarn.server.resourcemanager.scheduler.fair.policies.FairSharePolicy.<clinit>(FairSharePolicy.java:47)
	at sun.reflect.NativeConstructorAccessorImpl.newInstance0(Native Method)
	at sun.reflect.NativeConstructorAccessorImpl.newInstance(NativeConstructorAccessorImpl.java:57)
	at sun.reflect.DelegatingConstructorAccessorImpl.newInstance(DelegatingConstructorAccessorImpl.java:45)
	at java.lang.reflect.Constructor.newInstance(Constructor.java:526)
	at org.apache.hadoop.util.ReflectionUtils.newInstance(ReflectionUtils.java:132)
	at org.apache.hadoop.yarn.server.resourcemanager.scheduler.fair.SchedulingPolicy.getInstance(SchedulingPolicy.java:55)
	at org.apache.hadoop.yarn.server.resourcemanager.scheduler.fair.SchedulingPolicy.<clinit>(SchedulingPolicy.java:42)
	at org.apache.hadoop.yarn.server.resourcemanager.scheduler.fair.TestSchedulingPolicy.testIsApplicableTo(TestSchedulingPolicy.java:81)


FAILED:  org.apache.hadoop.yarn.server.resourcemanager.scheduler.fair.policies.TestEmptyQueues.testFifoPolicy

Error Message:
test timed out after 1000 milliseconds

Stack Trace:
java.lang.Exception: test timed out after 1000 milliseconds
	at java.util.zip.Inflater.inflateBytes(Native Method)
	at java.util.zip.Inflater.inflate(Inflater.java:259)
	at java.util.zip.InflaterInputStream.read(InflaterInputStream.java:152)
	at sun.misc.Resource.getBytes(Resource.java:124)
	at java.net.URLClassLoader.defineClass(URLClassLoader.java:444)
	at java.net.URLClassLoader.access$100(URLClassLoader.java:71)
	at java.net.URLClassLoader$1.run(URLClassLoader.java:361)
	at java.net.URLClassLoader$1.run(URLClassLoader.java:355)
	at java.security.AccessController.doPrivileged(Native Method)
	at java.net.URLClassLoader.findClass(URLClassLoader.java:354)
	at java.lang.ClassLoader.loadClass(ClassLoader.java:425)
	at sun.misc.Launcher$AppClassLoader.loadClass(Launcher.java:308)
	at java.lang.ClassLoader.loadClass(ClassLoader.java:358)
	at org.apache.hadoop.yarn.proto.YarnProtos$ResourceProto.<init>(YarnProtos.java:4716)
	at org.apache.hadoop.yarn.proto.YarnProtos$ResourceProto.<clinit>(YarnProtos.java:5199)
	at org.apache.hadoop.yarn.api.records.impl.pb.ResourcePBImpl.<init>(ResourcePBImpl.java:31)
	at sun.reflect.NativeConstructorAccessorImpl.newInstance0(Native Method)
	at sun.reflect.NativeConstructorAccessorImpl.newInstance(NativeConstructorAccessorImpl.java:57)
	at sun.reflect.DelegatingConstructorAccessorImpl.newInstance(DelegatingConstructorAccessorImpl.java:45)
	at java.lang.reflect.Constructor.newInstance(Constructor.java:526)
	at org.apache.hadoop.yarn.factories.impl.pb.RecordFactoryPBImpl.newRecordInstance(RecordFactoryPBImpl.java:70)
	at org.apache.hadoop.yarn.util.Records.newRecord(Records.java:36)
	at org.apache.hadoop.yarn.util.resource.Resources.createResource(Resources.java:102)
	at org.apache.hadoop.yarn.util.resource.Resources.createResource(Resources.java:98)
	at org.apache.hadoop.yarn.server.resourcemanager.scheduler.fair.policies.FairSharePolicy$FairShareComparator.<clinit>(FairSharePolicy.java:71)
	at org.apache.hadoop.yarn.server.resourcemanager.scheduler.fair.policies.FairSharePolicy.<clinit>(FairSharePolicy.java:47)
	at sun.reflect.NativeConstructorAccessorImpl.newInstance0(Native Method)
	at sun.reflect.NativeConstructorAccessorImpl.newInstance(NativeConstructorAccessorImpl.java:57)
	at sun.reflect.DelegatingConstructorAccessorImpl.newInstance(DelegatingConstructorAccessorImpl.java:45)
	at java.lang.reflect.Constructor.newInstance(Constructor.java:526)
	at org.apache.hadoop.util.ReflectionUtils.newInstance(ReflectionUtils.java:132)
	at org.apache.hadoop.yarn.server.resourcemanager.scheduler.fair.SchedulingPolicy.getInstance(SchedulingPolicy.java:55)
	at org.apache.hadoop.yarn.server.resourcemanager.scheduler.fair.SchedulingPolicy.<clinit>(SchedulingPolicy.java:42)
	at org.apache.hadoop.yarn.server.resourcemanager.scheduler.fair.policies.TestEmptyQueues.testFifoPolicy(TestEmptyQueues.java:44)



Mime
  • Unnamed multipart/mixed (inline, None, 0 bytes)
View raw message