hadoop-yarn-dev mailing list archives

Site index · List index
Message view « Date » · « Thread »
Top « Date » · « Thread »
From Apache Jenkins Server <jenk...@builds.apache.org>
Subject Hadoop-Yarn-trunk - Build # 1429 - Still Failing
Date Sat, 21 Nov 2015 19:04:29 GMT
See https://builds.apache.org/job/Hadoop-Yarn-trunk/1429/

###################################################################################
########################## LAST 60 LINES OF THE CONSOLE ###########################
[...truncated 5589 lines...]
Tests run: 16, Failures: 0, Errors: 0, Skipped: 0, Time elapsed: 1.325 sec - in org.apache.hadoop.yarn.nodelabels.TestCommonNodeLabelsManager
Running org.apache.hadoop.yarn.nodelabels.TestFileSystemNodeLabelsStore
Tests run: 4, Failures: 0, Errors: 0, Skipped: 0, Time elapsed: 1.527 sec - in org.apache.hadoop.yarn.nodelabels.TestFileSystemNodeLabelsStore

Results :

Tests in error: 
  TestWebApp.testYARNWebAppContext:276->getContent:302 Runtime java.io.IOExcepti...

Tests run: 325, Failures: 0, Errors: 1, Skipped: 7

[INFO] ------------------------------------------------------------------------
[INFO] Reactor Summary:
[INFO] 
[INFO] Apache Hadoop YARN ................................ SUCCESS [  3.083 s]
[INFO] Apache Hadoop YARN API ............................ SUCCESS [04:08 min]
[INFO] Apache Hadoop YARN Common ......................... FAILURE [01:42 min]
[INFO] Apache Hadoop YARN Server ......................... SKIPPED
[INFO] Apache Hadoop YARN Server Common .................. SKIPPED
[INFO] Apache Hadoop YARN NodeManager .................... SKIPPED
[INFO] Apache Hadoop YARN Web Proxy ...................... SKIPPED
[INFO] Apache Hadoop YARN ApplicationHistoryService ...... SKIPPED
[INFO] Apache Hadoop YARN ResourceManager ................ SKIPPED
[INFO] Apache Hadoop YARN Server Tests ................... SKIPPED
[INFO] Apache Hadoop YARN Client ......................... SKIPPED
[INFO] Apache Hadoop YARN SharedCacheManager ............. SKIPPED
[INFO] Apache Hadoop YARN Applications ................... SKIPPED
[INFO] Apache Hadoop YARN DistributedShell ............... SKIPPED
[INFO] Apache Hadoop YARN Unmanaged Am Launcher .......... SKIPPED
[INFO] Apache Hadoop YARN Site ........................... SKIPPED
[INFO] Apache Hadoop YARN Registry ....................... SKIPPED
[INFO] Apache Hadoop YARN Project ........................ SKIPPED
[INFO] ------------------------------------------------------------------------
[INFO] BUILD FAILURE
[INFO] ------------------------------------------------------------------------
[INFO] Total time: 05:55 min
[INFO] Finished at: 2015-11-21T19:04:34+00:00
[INFO] Final Memory: 69M/1138M
[INFO] ------------------------------------------------------------------------
[ERROR] Failed to execute goal org.apache.maven.plugins:maven-surefire-plugin:2.17:test (default-test)
on project hadoop-yarn-common: There are test failures.
[ERROR] 
[ERROR] Please refer to /home/jenkins/jenkins-slave/workspace/Hadoop-Yarn-trunk/hadoop-yarn-project/hadoop-yarn/hadoop-yarn-common/target/surefire-reports
for the individual test results.
[ERROR] -> [Help 1]
[ERROR] 
[ERROR] To see the full stack trace of the errors, re-run Maven with the -e switch.
[ERROR] Re-run Maven using the -X switch to enable full debug logging.
[ERROR] 
[ERROR] For more information about the errors and possible solutions, please read the following
articles:
[ERROR] [Help 1] http://cwiki.apache.org/confluence/display/MAVEN/MojoFailureException
[ERROR] 
[ERROR] After correcting the problems, you can resume the build with the command
[ERROR]   mvn <goals> -rf :hadoop-yarn-common
Build step 'Execute shell' marked build as failure
Archiving artifacts
Recording test results
Updating YARN-3454
Sending e-mails to: yarn-dev@hadoop.apache.org
Email was triggered for: Failure - Any
Sending email for trigger: Failure - Any



###################################################################################
############################## FAILED TESTS (if any) ##############################
1 tests failed.
FAILED:  org.apache.hadoop.yarn.webapp.TestWebApp.testYARNWebAppContext

Error Message:
java.io.IOException: Server returned HTTP response code: 403 for URL: http://localhost:37031/static/

Stack Trace:
java.lang.RuntimeException: java.io.IOException: Server returned HTTP response code: 403 for
URL: http://localhost:37031/static/
	at sun.net.www.protocol.http.HttpURLConnection.getInputStream(HttpURLConnection.java:1626)
	at org.apache.hadoop.yarn.webapp.TestWebApp.getContent(TestWebApp.java:293)
	at org.apache.hadoop.yarn.webapp.TestWebApp.testYARNWebAppContext(TestWebApp.java:276)



Mime
  • Unnamed multipart/mixed (inline, None, 0 bytes)
View raw message