hadoop-yarn-dev mailing list archives

Site index · List index
Message view « Date » · « Thread »
Top « Date » · « Thread »
From Apache Jenkins Server <jenk...@builds.apache.org>
Subject Hadoop-Yarn-trunk - Build # 1455 - Still Failing
Date Wed, 25 Nov 2015 20:14:16 GMT
See https://builds.apache.org/job/Hadoop-Yarn-trunk/1455/

###################################################################################
########################## LAST 60 LINES OF THE CONSOLE ###########################
[...truncated 10574 lines...]
	at org.apache.hadoop.yarn.server.TestDiskFailures.testLogDirsFailures(TestDiskFailures.java:111)


Results :

Tests in error: 
  TestDiskFailures.testLocalDirsFailures:99->testDirsFailures:179->verifyDisksHealth:247
» NoSuchElement
  TestDiskFailures.testLogDirsFailures:111->testDirsFailures:179->verifyDisksHealth:247
» NoSuchElement

Tests run: 11, Failures: 0, Errors: 2, Skipped: 0

[INFO] ------------------------------------------------------------------------
[INFO] Reactor Summary:
[INFO] 
[INFO] Apache Hadoop YARN ................................ SUCCESS [  3.676 s]
[INFO] Apache Hadoop YARN API ............................ SUCCESS [04:47 min]
[INFO] Apache Hadoop YARN Common ......................... SUCCESS [03:23 min]
[INFO] Apache Hadoop YARN Server ......................... SUCCESS [  0.095 s]
[INFO] Apache Hadoop YARN Server Common .................. SUCCESS [ 55.602 s]
[INFO] Apache Hadoop YARN NodeManager .................... SUCCESS [09:57 min]
[INFO] Apache Hadoop YARN Web Proxy ...................... SUCCESS [ 29.207 s]
[INFO] Apache Hadoop YARN ApplicationHistoryService ...... SUCCESS [03:40 min]
[INFO] Apache Hadoop YARN ResourceManager ................ SUCCESS [  01:05 h]
[INFO] Apache Hadoop YARN Server Tests ................... FAILURE [02:56 min]
[INFO] Apache Hadoop YARN Client ......................... SKIPPED
[INFO] Apache Hadoop YARN SharedCacheManager ............. SKIPPED
[INFO] Apache Hadoop YARN Applications ................... SKIPPED
[INFO] Apache Hadoop YARN DistributedShell ............... SKIPPED
[INFO] Apache Hadoop YARN Unmanaged Am Launcher .......... SKIPPED
[INFO] Apache Hadoop YARN Site ........................... SKIPPED
[INFO] Apache Hadoop YARN Registry ....................... SKIPPED
[INFO] Apache Hadoop YARN Project ........................ SKIPPED
[INFO] ------------------------------------------------------------------------
[INFO] BUILD FAILURE
[INFO] ------------------------------------------------------------------------
[INFO] Total time: 01:31 h
[INFO] Finished at: 2015-11-25T20:13:59+00:00
[INFO] Final Memory: 75M/706M
[INFO] ------------------------------------------------------------------------
[ERROR] Failed to execute goal org.apache.maven.plugins:maven-surefire-plugin:2.17:test (default-test)
on project hadoop-yarn-server-tests: There are test failures.
[ERROR] 
[ERROR] Please refer to /home/jenkins/jenkins-slave/workspace/Hadoop-Yarn-trunk/hadoop-yarn-project/hadoop-yarn/hadoop-yarn-server/hadoop-yarn-server-tests/target/surefire-reports
for the individual test results.
[ERROR] -> [Help 1]
[ERROR] 
[ERROR] To see the full stack trace of the errors, re-run Maven with the -e switch.
[ERROR] Re-run Maven using the -X switch to enable full debug logging.
[ERROR] 
[ERROR] For more information about the errors and possible solutions, please read the following
articles:
[ERROR] [Help 1] http://cwiki.apache.org/confluence/display/MAVEN/MojoFailureException
[ERROR] 
[ERROR] After correcting the problems, you can resume the build with the command
[ERROR]   mvn <goals> -rf :hadoop-yarn-server-tests
Build step 'Execute shell' marked build as failure
Archiving artifacts
Recording test results
Updating HDFS-9459
Sending e-mails to: yarn-dev@hadoop.apache.org
Email was triggered for: Failure - Any
Sending email for trigger: Failure - Any



###################################################################################
############################## FAILED TESTS (if any) ##############################
2 tests failed.
FAILED:  org.apache.hadoop.yarn.server.TestDiskFailures.testLocalDirsFailures

Error Message:
null

Stack Trace:
java.util.NoSuchElementException: null
	at java.util.concurrent.ConcurrentHashMap$HashIterator.nextEntry(ConcurrentHashMap.java:1354)
	at java.util.concurrent.ConcurrentHashMap$ValueIterator.next(ConcurrentHashMap.java:1384)
	at org.apache.hadoop.yarn.server.TestDiskFailures.verifyDisksHealth(TestDiskFailures.java:247)
	at org.apache.hadoop.yarn.server.TestDiskFailures.testDirsFailures(TestDiskFailures.java:179)
	at org.apache.hadoop.yarn.server.TestDiskFailures.testLocalDirsFailures(TestDiskFailures.java:99)


FAILED:  org.apache.hadoop.yarn.server.TestDiskFailures.testLogDirsFailures

Error Message:
null

Stack Trace:
java.util.NoSuchElementException: null
	at java.util.concurrent.ConcurrentHashMap$HashIterator.nextEntry(ConcurrentHashMap.java:1354)
	at java.util.concurrent.ConcurrentHashMap$ValueIterator.next(ConcurrentHashMap.java:1384)
	at org.apache.hadoop.yarn.server.TestDiskFailures.verifyDisksHealth(TestDiskFailures.java:247)
	at org.apache.hadoop.yarn.server.TestDiskFailures.testDirsFailures(TestDiskFailures.java:179)
	at org.apache.hadoop.yarn.server.TestDiskFailures.testLogDirsFailures(TestDiskFailures.java:111)



Mime
  • Unnamed multipart/mixed (inline, None, 0 bytes)
View raw message