hadoop-yarn-dev mailing list archives

Site index · List index
Message view « Date » · « Thread »
Top « Date » · « Thread »
From Apache Jenkins Server <jenk...@builds.apache.org>
Subject Hadoop-Yarn-trunk - Build # 1461 - Still Failing
Date Sun, 29 Nov 2015 00:26:12 GMT
See https://builds.apache.org/job/Hadoop-Yarn-trunk/1461/

###################################################################################
########################## LAST 60 LINES OF THE CONSOLE ###########################
[...truncated 9106 lines...]
[WARNING] Rule 0: org.apache.maven.plugins.enforcer.DependencyConvergence failed with message:
Failed while enforcing releasability the error(s) are [
Dependency convergence error for org.apache.hadoop:hadoop-auth:3.0.0-SNAPSHOT paths to dependency
are:
+-org.apache.hadoop:hadoop-yarn-server-applicationhistoryservice:3.0.0-SNAPSHOT
  +-org.apache.hadoop:hadoop-common:3.0.0-SNAPSHOT
    +-org.apache.hadoop:hadoop-auth:3.0.0-SNAPSHOT
and
+-org.apache.hadoop:hadoop-yarn-server-applicationhistoryservice:3.0.0-SNAPSHOT
  +-org.apache.hadoop:hadoop-common:3.0.0-SNAPSHOT
    +-org.apache.hadoop:hadoop-auth:3.0.0-SNAPSHOT
and
+-org.apache.hadoop:hadoop-yarn-server-applicationhistoryservice:3.0.0-SNAPSHOT
  +-org.apache.hadoop:hadoop-auth:3.0.0-20151128.235730-7797
]
[INFO] ------------------------------------------------------------------------
[INFO] Reactor Summary:
[INFO] 
[INFO] Apache Hadoop YARN ................................ SUCCESS [  4.939 s]
[INFO] Apache Hadoop YARN API ............................ SUCCESS [05:45 min]
[INFO] Apache Hadoop YARN Common ......................... SUCCESS [04:05 min]
[INFO] Apache Hadoop YARN Server ......................... SUCCESS [  0.118 s]
[INFO] Apache Hadoop YARN Server Common .................. SUCCESS [01:07 min]
[INFO] Apache Hadoop YARN NodeManager .................... SUCCESS [11:07 min]
[INFO] Apache Hadoop YARN Web Proxy ...................... SUCCESS [ 37.767 s]
[INFO] Apache Hadoop YARN ApplicationHistoryService ...... FAILURE [03:50 min]
[INFO] Apache Hadoop YARN ResourceManager ................ SKIPPED
[INFO] Apache Hadoop YARN Server Tests ................... SKIPPED
[INFO] Apache Hadoop YARN Client ......................... SKIPPED
[INFO] Apache Hadoop YARN SharedCacheManager ............. SKIPPED
[INFO] Apache Hadoop YARN Applications ................... SKIPPED
[INFO] Apache Hadoop YARN DistributedShell ............... SKIPPED
[INFO] Apache Hadoop YARN Unmanaged Am Launcher .......... SKIPPED
[INFO] Apache Hadoop YARN Site ........................... SKIPPED
[INFO] Apache Hadoop YARN Registry ....................... SKIPPED
[INFO] Apache Hadoop YARN Project ........................ SKIPPED
[INFO] ------------------------------------------------------------------------
[INFO] BUILD FAILURE
[INFO] ------------------------------------------------------------------------
[INFO] Total time: 26:40 min
[INFO] Finished at: 2015-11-29T00:26:07+00:00
[INFO] Final Memory: 88M/881M
[INFO] ------------------------------------------------------------------------
[ERROR] Failed to execute goal org.apache.maven.plugins:maven-enforcer-plugin:1.3.1:enforce
(depcheck) on project hadoop-yarn-server-applicationhistoryservice: Some Enforcer rules have
failed. Look above for specific messages explaining why the rule failed. -> [Help 1]
[ERROR] 
[ERROR] To see the full stack trace of the errors, re-run Maven with the -e switch.
[ERROR] Re-run Maven using the -X switch to enable full debug logging.
[ERROR] 
[ERROR] For more information about the errors and possible solutions, please read the following
articles:
[ERROR] [Help 1] http://cwiki.apache.org/confluence/display/MAVEN/MojoExecutionException
[ERROR] 
[ERROR] After correcting the problems, you can resume the build with the command
[ERROR]   mvn <goals> -rf :hadoop-yarn-server-applicationhistoryservice
Build step 'Execute shell' marked build as failure
Archiving artifacts
Recording test results
Updating HADOOP-12600
Sending e-mails to: yarn-dev@hadoop.apache.org
Email was triggered for: Failure - Any
Sending email for trigger: Failure - Any



###################################################################################
############################## FAILED TESTS (if any) ##############################
All tests passed
Mime
  • Unnamed multipart/mixed (inline, None, 0 bytes)
View raw message