hadoop-yarn-dev mailing list archives

Site index · List index
Message view « Date » · « Thread »
Top « Date » · « Thread »
From Apache Jenkins Server <jenk...@builds.apache.org>
Subject Hadoop-Yarn-trunk - Build # 1446 - Failure
Date Tue, 24 Nov 2015 13:56:23 GMT
See https://builds.apache.org/job/Hadoop-Yarn-trunk/1446/

###################################################################################
########################## LAST 60 LINES OF THE CONSOLE ###########################
[...truncated 9371 lines...]
Tests run: 3, Failures: 0, Errors: 0, Skipped: 0, Time elapsed: 8.498 sec - in org.apache.hadoop.yarn.server.resourcemanager.metrics.TestSystemMetricsPublisher
Running org.apache.hadoop.yarn.server.resourcemanager.TestKillApplicationWithRMHA
Tests run: 4, Failures: 0, Errors: 0, Skipped: 0, Time elapsed: 30.218 sec - in org.apache.hadoop.yarn.server.resourcemanager.TestKillApplicationWithRMHA

Results :

Failed tests: 
  TestRMRestart.testRMRestart:370 Attempt state is not correct (timedout): expected: ALLOCATED
actual: SCHEDULED for the application attempt appattempt_1448373083301_0002_000002

Tests run: 1266, Failures: 1, Errors: 0, Skipped: 2

[INFO] ------------------------------------------------------------------------
[INFO] Reactor Summary:
[INFO] 
[INFO] Apache Hadoop YARN ................................ SUCCESS [  4.593 s]
[INFO] Apache Hadoop YARN API ............................ SUCCESS [05:00 min]
[INFO] Apache Hadoop YARN Common ......................... SUCCESS [03:34 min]
[INFO] Apache Hadoop YARN Server ......................... SUCCESS [  0.118 s]
[INFO] Apache Hadoop YARN Server Common .................. SUCCESS [ 57.751 s]
[INFO] Apache Hadoop YARN NodeManager .................... SUCCESS [10:15 min]
[INFO] Apache Hadoop YARN Web Proxy ...................... SUCCESS [ 31.906 s]
[INFO] Apache Hadoop YARN ApplicationHistoryService ...... SUCCESS [03:57 min]
[INFO] Apache Hadoop YARN ResourceManager ................ FAILURE [  01:04 h]
[INFO] Apache Hadoop YARN Server Tests ................... SKIPPED
[INFO] Apache Hadoop YARN Client ......................... SKIPPED
[INFO] Apache Hadoop YARN SharedCacheManager ............. SKIPPED
[INFO] Apache Hadoop YARN Applications ................... SKIPPED
[INFO] Apache Hadoop YARN DistributedShell ............... SKIPPED
[INFO] Apache Hadoop YARN Unmanaged Am Launcher .......... SKIPPED
[INFO] Apache Hadoop YARN Site ........................... SKIPPED
[INFO] Apache Hadoop YARN Registry ....................... SKIPPED
[INFO] Apache Hadoop YARN Project ........................ SKIPPED
[INFO] ------------------------------------------------------------------------
[INFO] BUILD FAILURE
[INFO] ------------------------------------------------------------------------
[INFO] Total time: 01:29 h
[INFO] Finished at: 2015-11-24T13:56:08+00:00
[INFO] Final Memory: 60M/504M
[INFO] ------------------------------------------------------------------------
[ERROR] Failed to execute goal org.apache.maven.plugins:maven-surefire-plugin:2.17:test (default-test)
on project hadoop-yarn-server-resourcemanager: There are test failures.
[ERROR] 
[ERROR] Please refer to /home/jenkins/jenkins-slave/workspace/Hadoop-Yarn-trunk/hadoop-yarn-project/hadoop-yarn/hadoop-yarn-server/hadoop-yarn-server-resourcemanager/target/surefire-reports
for the individual test results.
[ERROR] -> [Help 1]
[ERROR] 
[ERROR] To see the full stack trace of the errors, re-run Maven with the -e switch.
[ERROR] Re-run Maven using the -X switch to enable full debug logging.
[ERROR] 
[ERROR] For more information about the errors and possible solutions, please read the following
articles:
[ERROR] [Help 1] http://cwiki.apache.org/confluence/display/MAVEN/MojoFailureException
[ERROR] 
[ERROR] After correcting the problems, you can resume the build with the command
[ERROR]   mvn <goals> -rf :hadoop-yarn-server-resourcemanager
Build step 'Execute shell' marked build as failure
Archiving artifacts
Recording test results
Updating YARN-4387
Sending e-mails to: yarn-dev@hadoop.apache.org
Email was triggered for: Failure - Any
Sending email for trigger: Failure - Any



###################################################################################
############################## FAILED TESTS (if any) ##############################
1 tests failed.
FAILED:  org.apache.hadoop.yarn.server.resourcemanager.TestRMRestart.testRMRestart[1]

Error Message:
Attempt state is not correct (timedout): expected: ALLOCATED actual: SCHEDULED for the application
attempt appattempt_1448373083301_0002_000002

Stack Trace:
java.lang.AssertionError: Attempt state is not correct (timedout): expected: ALLOCATED actual:
SCHEDULED for the application attempt appattempt_1448373083301_0002_000002
	at org.junit.Assert.fail(Assert.java:88)
	at org.apache.hadoop.yarn.server.resourcemanager.MockRM.waitForState(MockRM.java:197)
	at org.apache.hadoop.yarn.server.resourcemanager.MockRM.waitForState(MockRM.java:172)
	at org.apache.hadoop.yarn.server.resourcemanager.TestRMRestart.testRMRestart(TestRMRestart.java:370)



Mime
  • Unnamed multipart/mixed (inline, None, 0 bytes)
View raw message