hadoop-yarn-dev mailing list archives

Site index · List index
Message view « Date » · « Thread »
Top « Date » · « Thread »
From Apache Jenkins Server <jenk...@builds.apache.org>
Subject Hadoop-Yarn-trunk-Java8 - Build # 735 - Failure
Date Wed, 25 Nov 2015 23:53:57 GMT
See https://builds.apache.org/job/Hadoop-Yarn-trunk-Java8/735/

###################################################################################
########################## LAST 60 LINES OF THE CONSOLE ###########################
[...truncated 5451 lines...]
  TestRMAppTransitions.testAppRunningKill:762->assertKilled:338->assertTimesAtFinish:321
application finish time is not greater then 0
  TestRMAppTransitions.testAppRunningKill:762->assertKilled:338->assertTimesAtFinish:321
application finish time is not greater then 0
  TestRMApplicationHistoryWriter.testRMWritingMassiveHistoryForCapacitySche:383->testRMWritingMassiveHistory:431->testRMWritingMassiveHistory:470
expected:<10000> but was:<9791>

Tests in error: 
  TestSchedulingPolicy.testIsApplicableTo:116 »  test timed out after 1000 milli...
  TestSubmitApplicationWithRMHA.testHandleRMHADuringSubmitApplicationCallWithSavedApplicationState:241->RMHATestBase.explicitFailover:184
» 

Tests run: 1266, Failures: 4, Errors: 2, Skipped: 2

[INFO] ------------------------------------------------------------------------
[INFO] Reactor Summary:
[INFO] 
[INFO] Apache Hadoop YARN ................................ SUCCESS [ 10.830 s]
[INFO] Apache Hadoop YARN API ............................ SUCCESS [03:06 min]
[INFO] Apache Hadoop YARN Common ......................... SUCCESS [04:57 min]
[INFO] Apache Hadoop YARN Server ......................... SUCCESS [  0.190 s]
[INFO] Apache Hadoop YARN Server Common .................. SUCCESS [01:21 min]
[INFO] Apache Hadoop YARN NodeManager .................... SUCCESS [14:06 min]
[INFO] Apache Hadoop YARN Web Proxy ...................... SUCCESS [ 44.668 s]
[INFO] Apache Hadoop YARN ApplicationHistoryService ...... SUCCESS [05:39 min]
[INFO] Apache Hadoop YARN ResourceManager ................ FAILURE [  01:27 h]
[INFO] Apache Hadoop YARN Server Tests ................... SKIPPED
[INFO] Apache Hadoop YARN Client ......................... SKIPPED
[INFO] Apache Hadoop YARN SharedCacheManager ............. SKIPPED
[INFO] Apache Hadoop YARN Applications ................... SKIPPED
[INFO] Apache Hadoop YARN DistributedShell ............... SKIPPED
[INFO] Apache Hadoop YARN Unmanaged Am Launcher .......... SKIPPED
[INFO] Apache Hadoop YARN Site ........................... SKIPPED
[INFO] Apache Hadoop YARN Registry ....................... SKIPPED
[INFO] Apache Hadoop YARN Project ........................ SKIPPED
[INFO] ------------------------------------------------------------------------
[INFO] BUILD FAILURE
[INFO] ------------------------------------------------------------------------
[INFO] Total time: 01:57 h
[INFO] Finished at: 2015-11-25T23:53:38+00:00
[INFO] Final Memory: 61M/1035M
[INFO] ------------------------------------------------------------------------
[ERROR] Failed to execute goal org.apache.maven.plugins:maven-surefire-plugin:2.17:test (default-test)
on project hadoop-yarn-server-resourcemanager: There are test failures.
[ERROR] 
[ERROR] Please refer to /home/jenkins/jenkins-slave/workspace/Hadoop-Yarn-trunk-Java8/hadoop-yarn-project/hadoop-yarn/hadoop-yarn-server/hadoop-yarn-server-resourcemanager/target/surefire-reports
for the individual test results.
[ERROR] -> [Help 1]
[ERROR] 
[ERROR] To see the full stack trace of the errors, re-run Maven with the -e switch.
[ERROR] Re-run Maven using the -X switch to enable full debug logging.
[ERROR] 
[ERROR] For more information about the errors and possible solutions, please read the following
articles:
[ERROR] [Help 1] http://cwiki.apache.org/confluence/display/MAVEN/MojoFailureException
[ERROR] 
[ERROR] After correcting the problems, you can resume the build with the command
[ERROR]   mvn <goals> -rf :hadoop-yarn-server-resourcemanager
Build step 'Execute shell' marked build as failure
Archiving artifacts
Recording test results
Updating HDFS-8512
Updating HDFS-9451
Sending e-mails to: yarn-dev@hadoop.apache.org
Email was triggered for: Failure - Any
Sending email for trigger: Failure - Any



###################################################################################
############################## FAILED TESTS (if any) ##############################
6 tests failed.
FAILED:  org.apache.hadoop.yarn.server.resourcemanager.TestSubmitApplicationWithRMHA.testHandleRMHADuringSubmitApplicationCallWithSavedApplicationState

Error Message:
test timed out after 5000 milliseconds

Stack Trace:
java.lang.Exception: test timed out after 5000 milliseconds
	at java.io.FileOutputStream.writeBytes(Native Method)
	at java.io.FileOutputStream.write(FileOutputStream.java:307)
	at java.io.BufferedOutputStream.flushBuffer(BufferedOutputStream.java:82)
	at java.io.BufferedOutputStream.flush(BufferedOutputStream.java:140)
	at java.io.PrintStream.write(PrintStream.java:482)
	at org.apache.maven.surefire.booter.ForkingRunListener.writeTestOutput(ForkingRunListener.java:178)
	at org.apache.maven.surefire.report.ConsoleOutputCapture$ForwardingPrintStream.write(ConsoleOutputCapture.java:58)
	at sun.nio.cs.StreamEncoder.writeBytes(StreamEncoder.java:221)
	at sun.nio.cs.StreamEncoder.implFlushBuffer(StreamEncoder.java:291)
	at sun.nio.cs.StreamEncoder.implFlush(StreamEncoder.java:295)
	at sun.nio.cs.StreamEncoder.flush(StreamEncoder.java:141)
	at java.io.OutputStreamWriter.flush(OutputStreamWriter.java:229)
	at org.apache.log4j.helpers.QuietWriter.flush(QuietWriter.java:59)
	at org.apache.log4j.WriterAppender.subAppend(WriterAppender.java:324)
	at org.apache.log4j.WriterAppender.append(WriterAppender.java:162)
	at org.apache.log4j.AppenderSkeleton.doAppend(AppenderSkeleton.java:251)
	at org.apache.log4j.helpers.AppenderAttachableImpl.appendLoopOnAppenders(AppenderAttachableImpl.java:66)
	at org.apache.log4j.Category.callAppenders(Category.java:206)
	at org.apache.log4j.Category.forcedLog(Category.java:391)
	at org.apache.log4j.Category.log(Category.java:856)
	at org.apache.commons.logging.impl.Log4JLogger.debug(Log4JLogger.java:155)
	at org.apache.hadoop.yarn.server.resourcemanager.scheduler.capacity.CapacitySchedulerConfiguration.getMaximumAllocationPerQueue(CapacitySchedulerConfiguration.java:640)
	at org.apache.hadoop.yarn.server.resourcemanager.scheduler.capacity.AbstractCSQueue.setupQueueConfigs(AbstractCSQueue.java:256)
	at org.apache.hadoop.yarn.server.resourcemanager.scheduler.capacity.ParentQueue.setupQueueConfigs(ParentQueue.java:111)
	at org.apache.hadoop.yarn.server.resourcemanager.scheduler.capacity.ParentQueue.reinitialize(ParentQueue.java:254)
	at org.apache.hadoop.yarn.server.resourcemanager.scheduler.capacity.CapacityScheduler.reinitializeQueues(CapacityScheduler.java:522)
	at org.apache.hadoop.yarn.server.resourcemanager.scheduler.capacity.CapacityScheduler.reinitialize(CapacityScheduler.java:364)
	at org.apache.hadoop.yarn.server.resourcemanager.AdminService.refreshQueues(AdminService.java:394)
	at org.apache.hadoop.yarn.server.resourcemanager.AdminService.refreshAll(AdminService.java:672)
	at org.apache.hadoop.yarn.server.resourcemanager.AdminService.transitionToActive(AdminService.java:329)
	at org.apache.hadoop.yarn.server.resourcemanager.RMHATestBase.explicitFailover(RMHATestBase.java:184)
	at org.apache.hadoop.yarn.server.resourcemanager.TestSubmitApplicationWithRMHA.testHandleRMHADuringSubmitApplicationCallWithSavedApplicationState(TestSubmitApplicationWithRMHA.java:241)


FAILED:  org.apache.hadoop.yarn.server.resourcemanager.ahs.TestRMApplicationHistoryWriter.testRMWritingMassiveHistoryForCapacitySche

Error Message:
expected:<10000> but was:<9791>

Stack Trace:
java.lang.AssertionError: expected:<10000> but was:<9791>
	at org.junit.Assert.fail(Assert.java:88)
	at org.junit.Assert.failNotEquals(Assert.java:743)
	at org.junit.Assert.assertEquals(Assert.java:118)
	at org.junit.Assert.assertEquals(Assert.java:555)
	at org.junit.Assert.assertEquals(Assert.java:542)
	at org.apache.hadoop.yarn.server.resourcemanager.ahs.TestRMApplicationHistoryWriter.testRMWritingMassiveHistory(TestRMApplicationHistoryWriter.java:470)
	at org.apache.hadoop.yarn.server.resourcemanager.ahs.TestRMApplicationHistoryWriter.testRMWritingMassiveHistory(TestRMApplicationHistoryWriter.java:431)
	at org.apache.hadoop.yarn.server.resourcemanager.ahs.TestRMApplicationHistoryWriter.testRMWritingMassiveHistoryForCapacitySche(TestRMApplicationHistoryWriter.java:383)


FAILED:  org.apache.hadoop.yarn.server.resourcemanager.applicationsmanager.TestAMRestart.testShouldNotCountFailureToMaxAttemptRetry

Error Message:
Attempt state is not correct (timedout): expected: SCHEDULED actual: ALLOCATED for the application
attempt appattempt_1448490536983_0001_000005

Stack Trace:
java.lang.AssertionError: Attempt state is not correct (timedout): expected: SCHEDULED actual:
ALLOCATED for the application attempt appattempt_1448490536983_0001_000005
	at org.junit.Assert.fail(Assert.java:88)
	at org.apache.hadoop.yarn.server.resourcemanager.MockRM.waitForState(MockRM.java:197)
	at org.apache.hadoop.yarn.server.resourcemanager.MockRM.waitForState(MockRM.java:172)
	at org.apache.hadoop.yarn.server.resourcemanager.MockRM.waitForAttemptScheduled(MockRM.java:830)
	at org.apache.hadoop.yarn.server.resourcemanager.MockRM.launchAM(MockRM.java:817)
	at org.apache.hadoop.yarn.server.resourcemanager.MockRM.launchAndRegisterAM(MockRM.java:836)
	at org.apache.hadoop.yarn.server.resourcemanager.MockRM.waitForNewAMToLaunchAndRegister(MockRM.java:254)
	at org.apache.hadoop.yarn.server.resourcemanager.applicationsmanager.TestAMRestart.testShouldNotCountFailureToMaxAttemptRetry(TestAMRestart.java:632)


FAILED:  org.apache.hadoop.yarn.server.resourcemanager.rmapp.TestRMAppTransitions.testAppRunningKill[0]

Error Message:
application finish time is not greater then 0

Stack Trace:
java.lang.AssertionError: application finish time is not greater then 0
	at org.junit.Assert.fail(Assert.java:88)
	at org.junit.Assert.assertTrue(Assert.java:41)
	at org.apache.hadoop.yarn.server.resourcemanager.rmapp.TestRMAppTransitions.assertTimesAtFinish(TestRMAppTransitions.java:321)
	at org.apache.hadoop.yarn.server.resourcemanager.rmapp.TestRMAppTransitions.assertKilled(TestRMAppTransitions.java:338)
	at org.apache.hadoop.yarn.server.resourcemanager.rmapp.TestRMAppTransitions.testAppRunningKill(TestRMAppTransitions.java:762)


FAILED:  org.apache.hadoop.yarn.server.resourcemanager.rmapp.TestRMAppTransitions.testAppRunningKill[1]

Error Message:
application finish time is not greater then 0

Stack Trace:
java.lang.AssertionError: application finish time is not greater then 0
	at org.junit.Assert.fail(Assert.java:88)
	at org.junit.Assert.assertTrue(Assert.java:41)
	at org.apache.hadoop.yarn.server.resourcemanager.rmapp.TestRMAppTransitions.assertTimesAtFinish(TestRMAppTransitions.java:321)
	at org.apache.hadoop.yarn.server.resourcemanager.rmapp.TestRMAppTransitions.assertKilled(TestRMAppTransitions.java:338)
	at org.apache.hadoop.yarn.server.resourcemanager.rmapp.TestRMAppTransitions.testAppRunningKill(TestRMAppTransitions.java:762)


FAILED:  org.apache.hadoop.yarn.server.resourcemanager.scheduler.fair.TestSchedulingPolicy.testIsApplicableTo

Error Message:
test timed out after 1000 milliseconds

Stack Trace:
java.lang.Exception: test timed out after 1000 milliseconds
	at java.util.Arrays.copyOf(Arrays.java:3326)
	at java.lang.AbstractStringBuilder.expandCapacity(AbstractStringBuilder.java:137)
	at java.lang.AbstractStringBuilder.ensureCapacityInternal(AbstractStringBuilder.java:121)
	at java.lang.AbstractStringBuilder.append(AbstractStringBuilder.java:421)
	at java.lang.StringBuilder.append(StringBuilder.java:136)
	at java.net.URLStreamHandler.parseURL(URLStreamHandler.java:249)
	at sun.net.www.protocol.file.Handler.parseURL(Handler.java:67)
	at java.net.URL.<init>(URL.java:615)
	at java.net.URL.<init>(URL.java:483)
	at sun.misc.URLClassPath$FileLoader.getResource(URLClassPath.java:1058)
	at sun.misc.URLClassPath.getResource(URLClassPath.java:199)
	at java.net.URLClassLoader$1.run(URLClassLoader.java:364)
	at java.net.URLClassLoader$1.run(URLClassLoader.java:361)
	at java.security.AccessController.doPrivileged(Native Method)
	at java.net.URLClassLoader.findClass(URLClassLoader.java:360)
	at java.lang.ClassLoader.loadClass(ClassLoader.java:424)
	at sun.misc.Launcher$AppClassLoader.loadClass(Launcher.java:308)
	at java.lang.ClassLoader.loadClass(ClassLoader.java:357)
	at org.mockito.internal.util.MockUtil.createMock(MockUtil.java:41)
	at org.mockito.internal.MockitoCore.mock(MockitoCore.java:45)
	at org.mockito.Mockito.mock(Mockito.java:921)
	at org.mockito.Mockito.mock(Mockito.java:816)
	at org.apache.hadoop.yarn.server.resourcemanager.scheduler.fair.TestSchedulingPolicy.testIsApplicableTo(TestSchedulingPolicy.java:116)



Mime
  • Unnamed multipart/mixed (inline, None, 0 bytes)
View raw message