hadoop-yarn-dev mailing list archives

Site index · List index
Message view « Date » · « Thread »
Top « Date » · « Thread »
From Apache Jenkins Server <jenk...@builds.apache.org>
Subject Hadoop-Yarn-trunk-Java8 - Build # 732 - Still Failing
Date Wed, 25 Nov 2015 11:04:09 GMT
See https://builds.apache.org/job/Hadoop-Yarn-trunk-Java8/732/

###################################################################################
########################## LAST 60 LINES OF THE CONSOLE ###########################
[...truncated 5420 lines...]

Results :

Failed tests: 
  TestRMApplicationHistoryWriter.testRMWritingMassiveHistoryForCapacitySche:383->testRMWritingMassiveHistory:431->testRMWritingMassiveHistory:470
expected:<10000> but was:<9245>

Tests in error: 
  TestSubmitApplicationWithRMHA.testHandleRMHADuringSubmitApplicationCallWithSavedApplicationState:241->RMHATestBase.explicitFailover:184->Object.wait:502->Object.wait:-2
» 
  TestSchedulingPolicy.testIsApplicableTo:116 »  test timed out after 1000 milli...

Tests run: 1266, Failures: 1, Errors: 2, Skipped: 2

[INFO] ------------------------------------------------------------------------
[INFO] Reactor Summary:
[INFO] 
[INFO] Apache Hadoop YARN ................................ SUCCESS [  9.891 s]
[INFO] Apache Hadoop YARN API ............................ SUCCESS [02:59 min]
[INFO] Apache Hadoop YARN Common ......................... SUCCESS [04:42 min]
[INFO] Apache Hadoop YARN Server ......................... SUCCESS [  0.149 s]
[INFO] Apache Hadoop YARN Server Common .................. SUCCESS [01:16 min]
[INFO] Apache Hadoop YARN NodeManager .................... SUCCESS [14:20 min]
[INFO] Apache Hadoop YARN Web Proxy ...................... SUCCESS [ 40.324 s]
[INFO] Apache Hadoop YARN ApplicationHistoryService ...... SUCCESS [06:39 min]
[INFO] Apache Hadoop YARN ResourceManager ................ FAILURE [  01:28 h]
[INFO] Apache Hadoop YARN Server Tests ................... SKIPPED
[INFO] Apache Hadoop YARN Client ......................... SKIPPED
[INFO] Apache Hadoop YARN SharedCacheManager ............. SKIPPED
[INFO] Apache Hadoop YARN Applications ................... SKIPPED
[INFO] Apache Hadoop YARN DistributedShell ............... SKIPPED
[INFO] Apache Hadoop YARN Unmanaged Am Launcher .......... SKIPPED
[INFO] Apache Hadoop YARN Site ........................... SKIPPED
[INFO] Apache Hadoop YARN Registry ....................... SKIPPED
[INFO] Apache Hadoop YARN Project ........................ SKIPPED
[INFO] ------------------------------------------------------------------------
[INFO] BUILD FAILURE
[INFO] ------------------------------------------------------------------------
[INFO] Total time: 01:59 h
[INFO] Finished at: 2015-11-25T11:03:34+00:00
[INFO] Final Memory: 62M/1104M
[INFO] ------------------------------------------------------------------------
[ERROR] Failed to execute goal org.apache.maven.plugins:maven-surefire-plugin:2.17:test (default-test)
on project hadoop-yarn-server-resourcemanager: There are test failures.
[ERROR] 
[ERROR] Please refer to /home/jenkins/jenkins-slave/workspace/Hadoop-Yarn-trunk-Java8/hadoop-yarn-project/hadoop-yarn/hadoop-yarn-server/hadoop-yarn-server-resourcemanager/target/surefire-reports
for the individual test results.
[ERROR] -> [Help 1]
[ERROR] 
[ERROR] To see the full stack trace of the errors, re-run Maven with the -e switch.
[ERROR] Re-run Maven using the -X switch to enable full debug logging.
[ERROR] 
[ERROR] For more information about the errors and possible solutions, please read the following
articles:
[ERROR] [Help 1] http://cwiki.apache.org/confluence/display/MAVEN/MojoFailureException
[ERROR] 
[ERROR] After correcting the problems, you can resume the build with the command
[ERROR]   mvn <goals> -rf :hadoop-yarn-server-resourcemanager
Build step 'Execute shell' marked build as failure
Archiving artifacts
Recording test results
Sending e-mails to: yarn-dev@hadoop.apache.org
Email was triggered for: Failure - Any
Sending email for trigger: Failure - Any



###################################################################################
############################## FAILED TESTS (if any) ##############################
3 tests failed.
FAILED:  org.apache.hadoop.yarn.server.resourcemanager.TestSubmitApplicationWithRMHA.testHandleRMHADuringSubmitApplicationCallWithSavedApplicationState

Error Message:
test timed out after 5000 milliseconds

Stack Trace:
java.lang.Exception: test timed out after 5000 milliseconds
	at java.lang.Object.wait(Native Method)
	at java.lang.Object.wait(Object.java:502)
	at org.apache.zookeeper.ClientCnxn.submitRequest(ClientCnxn.java:1342)
	at org.apache.zookeeper.ZooKeeper.setACL(ZooKeeper.java:1397)
	at org.apache.curator.framework.imps.SetACLBuilderImpl$2.call(SetACLBuilderImpl.java:160)
	at org.apache.curator.framework.imps.SetACLBuilderImpl$2.call(SetACLBuilderImpl.java:156)
	at org.apache.curator.RetryLoop.callWithRetry(RetryLoop.java:107)
	at org.apache.curator.framework.imps.SetACLBuilderImpl.pathInForeground(SetACLBuilderImpl.java:153)
	at org.apache.curator.framework.imps.SetACLBuilderImpl.forPath(SetACLBuilderImpl.java:119)
	at org.apache.curator.framework.imps.SetACLBuilderImpl.forPath(SetACLBuilderImpl.java:35)
	at org.apache.hadoop.yarn.server.resourcemanager.recovery.ZKRMStateStore.setRootNodeAcls(ZKRMStateStore.java:319)
	at org.apache.hadoop.yarn.server.resourcemanager.recovery.ZKRMStateStore.startInternal(ZKRMStateStore.java:285)
	at org.apache.hadoop.yarn.server.resourcemanager.recovery.RMStateStore.serviceStart(RMStateStore.java:644)
	at org.apache.hadoop.service.AbstractService.start(AbstractService.java:193)
	at org.apache.hadoop.yarn.server.resourcemanager.ResourceManager$RMActiveServices.serviceStart(ResourceManager.java:575)
	at org.apache.hadoop.service.AbstractService.start(AbstractService.java:193)
	at org.apache.hadoop.yarn.server.resourcemanager.ResourceManager.startActiveServices(ResourceManager.java:989)
	at org.apache.hadoop.yarn.server.resourcemanager.ResourceManager$1.run(ResourceManager.java:1030)
	at org.apache.hadoop.yarn.server.resourcemanager.ResourceManager$1.run(ResourceManager.java:1026)
	at java.security.AccessController.doPrivileged(Native Method)
	at javax.security.auth.Subject.doAs(Subject.java:422)
	at org.apache.hadoop.security.UserGroupInformation.doAs(UserGroupInformation.java:1669)
	at org.apache.hadoop.yarn.server.resourcemanager.ResourceManager.transitionToActive(ResourceManager.java:1026)
	at org.apache.hadoop.yarn.server.resourcemanager.AdminService.transitionToActive(AdminService.java:319)
	at org.apache.hadoop.yarn.server.resourcemanager.RMHATestBase.explicitFailover(RMHATestBase.java:184)
	at org.apache.hadoop.yarn.server.resourcemanager.TestSubmitApplicationWithRMHA.testHandleRMHADuringSubmitApplicationCallWithSavedApplicationState(TestSubmitApplicationWithRMHA.java:241)


FAILED:  org.apache.hadoop.yarn.server.resourcemanager.ahs.TestRMApplicationHistoryWriter.testRMWritingMassiveHistoryForCapacitySche

Error Message:
expected:<10000> but was:<9245>

Stack Trace:
java.lang.AssertionError: expected:<10000> but was:<9245>
	at org.junit.Assert.fail(Assert.java:88)
	at org.junit.Assert.failNotEquals(Assert.java:743)
	at org.junit.Assert.assertEquals(Assert.java:118)
	at org.junit.Assert.assertEquals(Assert.java:555)
	at org.junit.Assert.assertEquals(Assert.java:542)
	at org.apache.hadoop.yarn.server.resourcemanager.ahs.TestRMApplicationHistoryWriter.testRMWritingMassiveHistory(TestRMApplicationHistoryWriter.java:470)
	at org.apache.hadoop.yarn.server.resourcemanager.ahs.TestRMApplicationHistoryWriter.testRMWritingMassiveHistory(TestRMApplicationHistoryWriter.java:431)
	at org.apache.hadoop.yarn.server.resourcemanager.ahs.TestRMApplicationHistoryWriter.testRMWritingMassiveHistoryForCapacitySche(TestRMApplicationHistoryWriter.java:383)


FAILED:  org.apache.hadoop.yarn.server.resourcemanager.scheduler.fair.TestSchedulingPolicy.testIsApplicableTo

Error Message:
test timed out after 1000 milliseconds

Stack Trace:
java.lang.Exception: test timed out after 1000 milliseconds
	at org.mockito.asm.ClassWriter.get(ClassWriter.java:1299)
	at org.mockito.asm.ClassWriter.newMethodItem(ClassWriter.java:1021)
	at org.mockito.asm.MethodWriter.visitMethodInsn(MethodWriter.java:808)
	at org.mockito.cglib.core.CodeEmitter.emit_invoke(CodeEmitter.java:501)
	at org.mockito.cglib.core.CodeEmitter.invoke_virtual(CodeEmitter.java:512)
	at org.mockito.cglib.core.EmitUtils.not_equals_helper(EmitUtils.java:515)
	at org.mockito.cglib.core.EmitUtils.access$200(EmitUtils.java:25)
	at org.mockito.cglib.core.EmitUtils$8.processElement(EmitUtils.java:483)
	at org.mockito.cglib.core.EmitUtils.not_equals(EmitUtils.java:481)
	at org.mockito.cglib.core.KeyFactory$Generator.generateClass(KeyFactory.java:227)
	at org.mockito.cglib.core.DefaultGeneratorStrategy.generate(DefaultGeneratorStrategy.java:25)
	at org.mockito.cglib.core.AbstractClassGenerator.create(AbstractClassGenerator.java:217)
	at org.mockito.cglib.core.KeyFactory$Generator.create(KeyFactory.java:145)
	at org.mockito.cglib.core.KeyFactory.create(KeyFactory.java:117)
	at org.mockito.cglib.core.KeyFactory.create(KeyFactory.java:109)
	at org.mockito.cglib.core.KeyFactory.create(KeyFactory.java:105)
	at org.mockito.cglib.core.MethodWrapper.<clinit>(MethodWrapper.java:22)
	at org.mockito.cglib.proxy.Enhancer.getMethods(Enhancer.java:433)
	at org.mockito.cglib.proxy.Enhancer.generateClass(Enhancer.java:457)
	at org.mockito.cglib.core.DefaultGeneratorStrategy.generate(DefaultGeneratorStrategy.java:25)
	at org.mockito.cglib.core.AbstractClassGenerator.create(AbstractClassGenerator.java:217)
	at org.mockito.cglib.proxy.Enhancer.createHelper(Enhancer.java:378)
	at org.mockito.cglib.proxy.Enhancer.createClass(Enhancer.java:318)
	at org.mockito.internal.creation.jmock.ClassImposterizer.createProxyClass(ClassImposterizer.java:93)
	at org.mockito.internal.creation.jmock.ClassImposterizer.imposterise(ClassImposterizer.java:50)
	at org.mockito.internal.util.MockUtil.createMock(MockUtil.java:54)
	at org.mockito.internal.MockitoCore.mock(MockitoCore.java:45)
	at org.mockito.Mockito.mock(Mockito.java:921)
	at org.mockito.Mockito.mock(Mockito.java:816)
	at org.apache.hadoop.yarn.server.resourcemanager.scheduler.fair.TestSchedulingPolicy.testIsApplicableTo(TestSchedulingPolicy.java:116)



Mime
  • Unnamed multipart/mixed (inline, None, 0 bytes)
View raw message