hadoop-yarn-dev mailing list archives

Site index · List index
Message view « Date » · « Thread »
Top « Date » · « Thread »
From Apache Jenkins Server <jenk...@builds.apache.org>
Subject Hadoop-Yarn-trunk - Build # 1333 - Still Failing
Date Thu, 29 Oct 2015 00:57:00 GMT
See https://builds.apache.org/job/Hadoop-Yarn-trunk/1333/

###################################################################################
########################## LAST 60 LINES OF THE CONSOLE ###########################
[...truncated 13802 lines...]
        at java.util.concurrent.locks.LockSuppo

Results :

Tests in error: 
  TestDistributedShell.testDSShellWithoutDomain:151->testDSShell:218 »  test tim...
  TestDistributedShell.testDSAttemptFailuresValidityIntervalFailed:437 »  test t...
  TestDistributedShell.testDSAttemptFailuresValidityIntervalSucess:399 »  test t...
  TestDistributedShell.testDSShellWithDomain:146->testDSShell:218 »  test timed ...
  TestDistributedShellWithNodeLabels.testDSShellWithNodeLabelExpression:118 »  t...

Tests run: 3, Failures: 0, Errors: 1, Skipped: 0

[INFO] ------------------------------------------------------------------------
[INFO] Reactor Summary:
[INFO] 
[INFO] Apache Hadoop YARN ................................ SUCCESS [  7.739 s]
[INFO] Apache Hadoop YARN API ............................ SUCCESS [04:11 min]
[INFO] Apache Hadoop YARN Common ......................... SUCCESS [03:00 min]
[INFO] Apache Hadoop YARN Server ......................... SUCCESS [  0.097 s]
[INFO] Apache Hadoop YARN Server Common .................. SUCCESS [ 47.354 s]
[INFO] Apache Hadoop YARN NodeManager .................... SUCCESS [09:26 min]
[INFO] Apache Hadoop YARN Web Proxy ...................... SUCCESS [ 26.066 s]
[INFO] Apache Hadoop YARN ApplicationHistoryService ...... SUCCESS [03:25 min]
[INFO] Apache Hadoop YARN ResourceManager ................ SUCCESS [  01:00 h]
[INFO] Apache Hadoop YARN Server Tests ................... SUCCESS [01:49 min]
[INFO] Apache Hadoop YARN Client ......................... SUCCESS [07:11 min]
[INFO] Apache Hadoop YARN SharedCacheManager ............. SUCCESS [ 26.197 s]
[INFO] Apache Hadoop YARN Applications ................... SUCCESS [  0.048 s]
[INFO] Apache Hadoop YARN DistributedShell ............... FAILURE [16:43 min]
[INFO] Apache Hadoop YARN Unmanaged Am Launcher .......... SKIPPED
[INFO] Apache Hadoop YARN Site ........................... SKIPPED
[INFO] Apache Hadoop YARN Registry ....................... SKIPPED
[INFO] Apache Hadoop YARN Project ........................ SKIPPED
[INFO] ------------------------------------------------------------------------
[INFO] BUILD FAILURE
[INFO] ------------------------------------------------------------------------
[INFO] Total time: 01:48 h
[INFO] Finished at: 2015-10-29T00:56:51+00:00
[INFO] Final Memory: 76M/715M
[INFO] ------------------------------------------------------------------------
[ERROR] Failed to execute goal org.apache.maven.plugins:maven-surefire-plugin:2.17:test (default-test)
on project hadoop-yarn-applications-distributedshell: There was a timeout or other error in
the fork -> [Help 1]
[ERROR] 
[ERROR] To see the full stack trace of the errors, re-run Maven with the -e switch.
[ERROR] Re-run Maven using the -X switch to enable full debug logging.
[ERROR] 
[ERROR] For more information about the errors and possible solutions, please read the following
articles:
[ERROR] [Help 1] http://cwiki.apache.org/confluence/display/MAVEN/MojoFailureException
[ERROR] 
[ERROR] After correcting the problems, you can resume the build with the command
[ERROR]   mvn <goals> -rf :hadoop-yarn-applications-distributedshell
Build step 'Execute shell' marked build as failure
Archiving artifacts
Recording test results
Updating HDFS-9168
Updating HDFS-9295
Sending e-mails to: yarn-dev@hadoop.apache.org
Email was triggered for: Failure - Any
Sending email for trigger: Failure - Any



###################################################################################
############################## FAILED TESTS (if any) ##############################
1 tests failed.
FAILED:  org.apache.hadoop.yarn.applications.distributedshell.TestDistributedShellWithNodeLabels.testDSShellWithNodeLabelExpression

Error Message:
test timed out after 90000 milliseconds

Stack Trace:
java.lang.Exception: test timed out after 90000 milliseconds
	at java.lang.Thread.sleep(Native Method)
	at org.apache.hadoop.yarn.applications.distributedshell.Client.monitorApplication(Client.java:734)
	at org.apache.hadoop.yarn.applications.distributedshell.Client.run(Client.java:715)
	at org.apache.hadoop.yarn.applications.distributedshell.TestDistributedShellWithNodeLabels.testDSShellWithNodeLabelExpression(TestDistributedShellWithNodeLabels.java:118)



Mime
  • Unnamed multipart/mixed (inline, None, 0 bytes)
View raw message