hadoop-yarn-dev mailing list archives

Site index · List index
Message view « Date » · « Thread »
Top « Date » · « Thread »
From Apache Jenkins Server <jenk...@builds.apache.org>
Subject Hadoop-Yarn-trunk - Build # 1254 - Still Failing
Date Tue, 13 Oct 2015 14:26:01 GMT
See https://builds.apache.org/job/Hadoop-Yarn-trunk/1254/

###################################################################################
########################## LAST 60 LINES OF THE CONSOLE ###########################
[...truncated 10708 lines...]
Tests run: 7, Failures: 0, Errors: 0, Skipped: 0, Time elapsed: 3.236 sec - in org.apache.hadoop.yarn.client.TestResourceManagerAdministrationProtocolPBClientImpl
Running org.apache.hadoop.yarn.client.TestApplicationMasterServiceProtocolOnHA
Tests run: 3, Failures: 0, Errors: 0, Skipped: 0, Time elapsed: 18.327 sec - in org.apache.hadoop.yarn.client.TestApplicationMasterServiceProtocolOnHA

Results :

Tests in error: 
  TestAMRMClientOnRMRestart.testAMRMClientResendsRequestsOnRMRestart:187 ยป NullPointer

Tests run: 168, Failures: 0, Errors: 1, Skipped: 0

[INFO] ------------------------------------------------------------------------
[INFO] Reactor Summary:
[INFO] 
[INFO] Apache Hadoop YARN ................................ SUCCESS [  3.311 s]
[INFO] Apache Hadoop YARN API ............................ SUCCESS [04:11 min]
[INFO] Apache Hadoop YARN Common ......................... SUCCESS [03:04 min]
[INFO] Apache Hadoop YARN Server ......................... SUCCESS [  0.090 s]
[INFO] Apache Hadoop YARN Server Common .................. SUCCESS [ 47.595 s]
[INFO] Apache Hadoop YARN NodeManager .................... SUCCESS [09:09 min]
[INFO] Apache Hadoop YARN Web Proxy ...................... SUCCESS [ 26.345 s]
[INFO] Apache Hadoop YARN ApplicationHistoryService ...... SUCCESS [03:20 min]
[INFO] Apache Hadoop YARN ResourceManager ................ SUCCESS [58:02 min]
[INFO] Apache Hadoop YARN Server Tests ................... SUCCESS [01:51 min]
[INFO] Apache Hadoop YARN Client ......................... FAILURE [06:41 min]
[INFO] Apache Hadoop YARN SharedCacheManager ............. SKIPPED
[INFO] Apache Hadoop YARN Applications ................... SKIPPED
[INFO] Apache Hadoop YARN DistributedShell ............... SKIPPED
[INFO] Apache Hadoop YARN Unmanaged Am Launcher .......... SKIPPED
[INFO] Apache Hadoop YARN Site ........................... SKIPPED
[INFO] Apache Hadoop YARN Registry ....................... SKIPPED
[INFO] Apache Hadoop YARN Project ........................ SKIPPED
[INFO] ------------------------------------------------------------------------
[INFO] BUILD FAILURE
[INFO] ------------------------------------------------------------------------
[INFO] Total time: 01:27 h
[INFO] Finished at: 2015-10-13T14:26:36+00:00
[INFO] Final Memory: 72M/776M
[INFO] ------------------------------------------------------------------------
[ERROR] Failed to execute goal org.apache.maven.plugins:maven-surefire-plugin:2.17:test (default-test)
on project hadoop-yarn-client: There are test failures.
[ERROR] 
[ERROR] Please refer to /home/jenkins/jenkins-slave/workspace/Hadoop-Yarn-trunk/hadoop-yarn-project/hadoop-yarn/hadoop-yarn-client/target/surefire-reports
for the individual test results.
[ERROR] -> [Help 1]
[ERROR] 
[ERROR] To see the full stack trace of the errors, re-run Maven with the -e switch.
[ERROR] Re-run Maven using the -X switch to enable full debug logging.
[ERROR] 
[ERROR] For more information about the errors and possible solutions, please read the following
articles:
[ERROR] [Help 1] http://cwiki.apache.org/confluence/display/MAVEN/MojoFailureException
[ERROR] 
[ERROR] After correcting the problems, you can resume the build with the command
[ERROR]   mvn <goals> -rf :hadoop-yarn-client
Build step 'Execute shell' marked build as failure
Archiving artifacts
Recording test results
Updating HDFS-9160
Sending e-mails to: yarn-dev@hadoop.apache.org
Email was triggered for: Failure - Any
Sending email for trigger: Failure - Any



###################################################################################
############################## FAILED TESTS (if any) ##############################
1 tests failed.
FAILED:  org.apache.hadoop.yarn.client.api.impl.TestAMRMClientOnRMRestart.testAMRMClientResendsRequestsOnRMRestart

Error Message:
null

Stack Trace:
java.lang.NullPointerException: null
	at org.apache.hadoop.yarn.server.resourcemanager.scheduler.AppSchedulingInfo.isRequestLabelChanged(AppSchedulingInfo.java:420)
	at org.apache.hadoop.yarn.server.resourcemanager.scheduler.AppSchedulingInfo.updateResourceRequests(AppSchedulingInfo.java:341)
	at org.apache.hadoop.yarn.server.resourcemanager.scheduler.SchedulerApplicationAttempt.updateResourceRequests(SchedulerApplicationAttempt.java:300)
	at org.apache.hadoop.yarn.server.resourcemanager.scheduler.fifo.FifoScheduler.allocate(FifoScheduler.java:350)
	at org.apache.hadoop.yarn.client.api.impl.TestAMRMClientOnRMRestart$MyFifoScheduler.allocate(TestAMRMClientOnRMRestart.java:544)
	at org.apache.hadoop.yarn.server.resourcemanager.ApplicationMasterService.allocate(ApplicationMasterService.java:506)
	at org.apache.hadoop.yarn.client.api.impl.AMRMClientImpl.allocate(AMRMClientImpl.java:277)
	at org.apache.hadoop.yarn.client.api.impl.TestAMRMClientOnRMRestart.testAMRMClientResendsRequestsOnRMRestart(TestAMRMClientOnRMRestart.java:187)



Mime
  • Unnamed multipart/mixed (inline, None, 0 bytes)
View raw message