hadoop-yarn-dev mailing list archives

Site index · List index
Message view « Date » · « Thread »
Top « Date » · « Thread »
From Apache Jenkins Server <jenk...@builds.apache.org>
Subject Hadoop-Yarn-trunk-Java8 - Build # 603 - Failure
Date Tue, 27 Oct 2015 16:41:19 GMT
See https://builds.apache.org/job/Hadoop-Yarn-trunk-Java8/603/

###################################################################################
########################## LAST 60 LINES OF THE CONSOLE ###########################
[...truncated 4845 lines...]
Java HotSpot(TM) 64-Bit Server VM warning: ignoring option MaxPermSize=768m; support was removed
in 8.0
Running org.apache.hadoop.yarn.server.timeline.TestRollingLevelDBTimelineStore
Tests run: 16, Failures: 0, Errors: 0, Skipped: 0, Time elapsed: 18.631 sec - in org.apache.hadoop.yarn.server.timeline.TestRollingLevelDBTimelineStore

Results :

Tests in error: 
  TestFileSystemApplicationHistoryStore.testMassiveWriteContainerHistoryData:237 ยป NoClassDefFound

Tests run: 193, Failures: 0, Errors: 1, Skipped: 0

[INFO] ------------------------------------------------------------------------
[INFO] Reactor Summary:
[INFO] 
[INFO] Apache Hadoop YARN ................................ SUCCESS [  3.343 s]
[INFO] Apache Hadoop YARN API ............................ SUCCESS [01:32 min]
[INFO] Apache Hadoop YARN Common ......................... SUCCESS [02:44 min]
[INFO] Apache Hadoop YARN Server ......................... SUCCESS [  0.076 s]
[INFO] Apache Hadoop YARN Server Common .................. SUCCESS [ 46.163 s]
[INFO] Apache Hadoop YARN NodeManager .................... SUCCESS [10:22 min]
[INFO] Apache Hadoop YARN Web Proxy ...................... SUCCESS [ 18.780 s]
[INFO] Apache Hadoop YARN ApplicationHistoryService ...... FAILURE [02:43 min]
[INFO] Apache Hadoop YARN ResourceManager ................ SKIPPED
[INFO] Apache Hadoop YARN Server Tests ................... SKIPPED
[INFO] Apache Hadoop YARN Client ......................... SKIPPED
[INFO] Apache Hadoop YARN SharedCacheManager ............. SKIPPED
[INFO] Apache Hadoop YARN Applications ................... SKIPPED
[INFO] Apache Hadoop YARN DistributedShell ............... SKIPPED
[INFO] Apache Hadoop YARN Unmanaged Am Launcher .......... SKIPPED
[INFO] Apache Hadoop YARN Site ........................... SKIPPED
[INFO] Apache Hadoop YARN Registry ....................... SKIPPED
[INFO] Apache Hadoop YARN Project ........................ SKIPPED
[INFO] ------------------------------------------------------------------------
[INFO] BUILD FAILURE
[INFO] ------------------------------------------------------------------------
[INFO] Total time: 18:32 min
[INFO] Finished at: 2015-10-27T16:42:12+00:00
[INFO] Final Memory: 95M/1091M
[INFO] ------------------------------------------------------------------------
[ERROR] Failed to execute goal org.apache.maven.plugins:maven-surefire-plugin:2.17:test (default-test)
on project hadoop-yarn-server-applicationhistoryservice: There are test failures.
[ERROR] 
[ERROR] Please refer to /home/jenkins/jenkins-slave/workspace/Hadoop-Yarn-trunk-Java8/hadoop-yarn-project/hadoop-yarn/hadoop-yarn-server/hadoop-yarn-server-applicationhistoryservice/target/surefire-reports
for the individual test results.
[ERROR] -> [Help 1]
[ERROR] 
[ERROR] To see the full stack trace of the errors, re-run Maven with the -e switch.
[ERROR] Re-run Maven using the -X switch to enable full debug logging.
[ERROR] 
[ERROR] For more information about the errors and possible solutions, please read the following
articles:
[ERROR] [Help 1] http://cwiki.apache.org/confluence/display/MAVEN/MojoFailureException
[ERROR] 
[ERROR] After correcting the problems, you can resume the build with the command
[ERROR]   mvn <goals> -rf :hadoop-yarn-server-applicationhistoryservice
Build step 'Execute shell' marked build as failure
Archiving artifacts
Recording test results
Updating YARN-4302
Sending e-mails to: yarn-dev@hadoop.apache.org
Email was triggered for: Failure - Any
Sending email for trigger: Failure - Any



###################################################################################
############################## FAILED TESTS (if any) ##############################
1 tests failed.
FAILED:  org.apache.hadoop.yarn.server.applicationhistoryservice.TestFileSystemApplicationHistoryStore.testMassiveWriteContainerHistoryData

Error Message:
org/apache/hadoop/fs/ContentSummary$Builder

Stack Trace:
java.lang.NoClassDefFoundError: org/apache/hadoop/fs/ContentSummary$Builder
	at java.net.URLClassLoader$1.run(URLClassLoader.java:372)
	at java.net.URLClassLoader$1.run(URLClassLoader.java:361)
	at java.security.AccessController.doPrivileged(Native Method)
	at java.net.URLClassLoader.findClass(URLClassLoader.java:360)
	at java.lang.ClassLoader.loadClass(ClassLoader.java:424)
	at sun.misc.Launcher$AppClassLoader.loadClass(Launcher.java:308)
	at java.lang.ClassLoader.loadClass(ClassLoader.java:357)
	at org.apache.hadoop.fs.FileSystem.getContentSummary(FileSystem.java:1483)
	at org.apache.hadoop.fs.FileSystem.getContentSummary(FileSystem.java:1476)
	at org.apache.hadoop.yarn.server.applicationhistoryservice.TestFileSystemApplicationHistoryStore.testMassiveWriteContainerHistoryData(TestFileSystemApplicationHistoryStore.java:237)



Mime
  • Unnamed multipart/mixed (inline, None, 0 bytes)
View raw message