hadoop-yarn-dev mailing list archives

Site index · List index
Message view « Date » · « Thread »
Top « Date » · « Thread »
From Apache Jenkins Server <jenk...@builds.apache.org>
Subject Build failed in Jenkins: Hadoop-Yarn-trunk #1332
Date Wed, 28 Oct 2015 19:39:00 GMT
See <https://builds.apache.org/job/Hadoop-Yarn-trunk/1332/changes>

Changes:

[cnauroth] HADOOP-12519. hadoop-azure tests should avoid creating a metrics

[kihwal] HDFS-9279. Decomissioned capacity should not be considered for

[xgong] YARN-2859. ApplicationHistoryServer binds to default port 8188 in

------------------------------------------
[...truncated 8727 lines...]
[INFO] --- maven-surefire-plugin:2.17:test (default-test) @ hadoop-yarn-server-applicationhistoryservice
---
[INFO] Surefire report directory: <https://builds.apache.org/job/Hadoop-Yarn-trunk/ws/hadoop-yarn-project/hadoop-yarn/hadoop-yarn-server/hadoop-yarn-server-applicationhistoryservice/target/surefire-reports>

-------------------------------------------------------
 T E S T S
-------------------------------------------------------

-------------------------------------------------------
 T E S T S
-------------------------------------------------------
Running org.apache.hadoop.yarn.server.applicationhistoryservice.webapp.TestAHSWebApp
Tests run: 6, Failures: 0, Errors: 0, Skipped: 0, Time elapsed: 6.815 sec - in org.apache.hadoop.yarn.server.applicationhistoryservice.webapp.TestAHSWebApp
Running org.apache.hadoop.yarn.server.applicationhistoryservice.webapp.TestAHSWebServices
Tests run: 26, Failures: 0, Errors: 0, Skipped: 0, Time elapsed: 12.738 sec - in org.apache.hadoop.yarn.server.applicationhistoryservice.webapp.TestAHSWebServices
Running org.apache.hadoop.yarn.server.applicationhistoryservice.TestMemoryApplicationHistoryStore
Tests run: 4, Failures: 0, Errors: 0, Skipped: 0, Time elapsed: 2.09 sec - in org.apache.hadoop.yarn.server.applicationhistoryservice.TestMemoryApplicationHistoryStore
Running org.apache.hadoop.yarn.server.applicationhistoryservice.TestApplicationHistoryClientService
Tests run: 9, Failures: 0, Errors: 0, Skipped: 0, Time elapsed: 1.45 sec - in org.apache.hadoop.yarn.server.applicationhistoryservice.TestApplicationHistoryClientService
Running org.apache.hadoop.yarn.server.applicationhistoryservice.TestFileSystemApplicationHistoryStore
Tests run: 7, Failures: 0, Errors: 0, Skipped: 0, Time elapsed: 25.475 sec - in org.apache.hadoop.yarn.server.applicationhistoryservice.TestFileSystemApplicationHistoryStore
Running org.apache.hadoop.yarn.server.applicationhistoryservice.TestApplicationHistoryManagerOnTimelineStore
Tests run: 40, Failures: 0, Errors: 0, Skipped: 0, Time elapsed: 2.875 sec - in org.apache.hadoop.yarn.server.applicationhistoryservice.TestApplicationHistoryManagerOnTimelineStore
Running org.apache.hadoop.yarn.server.applicationhistoryservice.TestApplicationHistoryServer
====> TEST TIMED OUT. PRINTING THREAD DUMP. <====
Timestamp: 2015-10-28 07:36:54,656
"Timer for 'ApplicationHistoryServer' metrics system" daemon prio=5 tid=131 timed_waiting
java.lang.Thread.State: TIMED_WAITING
        at java.lang.Object.wait(Native Method)
        at java.util.TimerThread.mainLoop(Timer.java:552)
        at java.util.TimerThread.run(Timer.java:505)
"Timer-5" daemon prio=5 tid=152 timed_waiting
java.lang.Thread.State: TIMED_WAITING
        at java.lang.Object.wait(Native Method)
        at java.util.TimerThread.mainLoop(Timer.java:552)
        at java.util.TimerThread.run(Timer.java:505)
"IPC Server handler 3 on 10200" daemon prio=5 tid=142 timed_waiting
java.lang.Thread.State: TIMED_WAITING
        at sun.misc.Unsafe.park(Native Method)
        at java.util.concurrent.locks.LockSupport.parkNanos(LockSupport.java:226)
        at java.util.concurrent.locks.AbstractQueuedSynchronizer$ConditionObject.awaitNanos(AbstractQueuedSynchronizer.java:2082)
        at java.util.concurrent.LinkedBlockingQueue.poll(LinkedBlockingQueue.java:467)
        at org.apache.hadoop.ipc.CallQueueManager.take(CallQueueManager.java:129)
        at org.apache.hadoop.ipc.Server$Handler.run(Server.java:2269)
"473014324@qtp-1103515703-1 - Acceptor0 SelectChannelConnector@localhost:52214" daemon prio=5
tid=151 blocked
java.lang.Thread.State: BLOCKED
        at org.mortbay.io.nio.SelectorManager$SelectSet.doSelect(SelectorManager.java:464)
        at org.mortbay.io.nio.SelectorManager.doSelect(SelectorManager.java:192)
        at org.mortbay.jetty.nio.SelectChannelConnector.accept(SelectChannelConnector.java:124)
        at org.mortbay.jetty.AbstractConnector$Acceptor.run(AbstractConnector.java:708)
        at org.mortbay.thread.QueuedThreadPool$PoolThread.run(QueuedThreadPool.java:582)
"Reference Handler" daemon prio=10 tid=2 in Object.wait()
java.lang.Thread.State: WAITING (on object monitor)
        at java.lang.Object.wait(Native Method)
        at java.lang.Object.wait(Object.java:503)
        at java.lang.ref.Reference$ReferenceHandler.run(Reference.java:133)
"IPC Server Responder" daemon prio=5 tid=138 runnable
java.lang.Thread.State: RUNNABLE
        at sun.nio.ch.EPollArrayWrapper.epollWait(Native Method)
        at sun.nio.ch.EPollArrayWrapper.poll(EPollArrayWrapper.java:269)
        at sun.nio.ch.EPollSelectorImpl.doSelect(EPollSelectorImpl.java:79)
        at sun.nio.ch.SelectorImpl.lockAndDoSelect(SelectorImpl.java:87)
        at sun.nio.ch.SelectorImpl.select(SelectorImpl.java:98)
        at org.apache.hadoop.ipc.Server$Responder.doRunLoop(Server.java:977)
        at org.apache.hadoop.ipc.Server$Responder.run(Server.java:960)
"IPC Server handler 9 on 10200" daemon prio=5 tid=148 timed_waiting
java.lang.Thread.State: TIMED_WAITING
        at sun.misc.Unsafe.park(Native Method)
        at java.util.concurrent.locks.LockSupport.parkNanos(LockSupport.java:226)
        at java.util.concurrent.locks.AbstractQueuedSynchronizer$ConditionObject.awaitNanos(AbstractQueuedSynchronizer.java:2082)
        at java.util.concurrent.LinkedBlockingQueue.poll(LinkedBlockingQueue.java:467)
        at org.apache.hadoop.ipc.CallQueueManager.take(CallQueueManager.java:129)
        at org.apache.hadoop.ipc.Server$Handler.run(Server.java:2269)
"Finalizer" daemon prio=8 tid=3 in Object.wait()
java.lang.Thread.State: WAITING (on object monitor)
        at java.lang.Object.wait(Native Method)
        at java.lang.ref.ReferenceQueue.remove(ReferenceQueue.java:135)
        at java.lang.ref.ReferenceQueue.remove(ReferenceQueue.java:151)
        at java.lang.ref.Finalizer$FinalizerThread.run(Finalizer.java:189)
"1828438737@qtp-1103515703-0" daemon prio=5 tid=150 timed_waiting
java.lang.Thread.State: TIMED_WAITING
        at java.lang.Object.wait(Native Method)
        at org.mortbay.thread.QueuedThreadPool$PoolThread.run(QueuedThreadPool.java:626)
"IPC Server handler 8 on 10200" daemon prio=5 tid=147 timed_waiting
java.lang.Thread.State: TIMED_WAITING
        at sun.misc.Unsafe.park(Native Method)
        at java.util.concurrent.locks.LockSupport.parkNanos(LockSupport.java:226)
        at java.util.concurrent.locks.AbstractQueuedSynchronizer$ConditionObject.awaitNanos(AbstractQueuedSynchronizer.java:2082)
        at java.util.concurrent.LinkedBlockingQueue.poll(LinkedBlockingQueue.java:467)
        at org.apache.hadoop.ipc.CallQueueManager.take(CallQueueManager.java:129)
        at org.apache.hadoop.ipc.Server$Handler.run(Server.java:2269)
"IPC Server handler 1 on 10200" daemon prio=5 tid=140 timed_waiting
java.lang.Thread.State: TIMED_WAITING
        at sun.misc.Unsafe.park(Native Method)
        at java.util.concurrent.locks.LockSupport.parkNanos(LockSupport.java:226)
        at java.util.concurrent.locks.AbstractQueuedSynchronizer$ConditionObject.awaitNanos(AbstractQueuedSynchronizer.java:2082)
        at java.util.concurrent.LinkedBlockingQueue.poll(LinkedBlockingQueue.java:467)
        at org.apache.hadoop.ipc.CallQueueManager.take(CallQueueManager.java:129)
        at org.apache.hadoop.ipc.Server$Handler.run(Server.java:2269)
"com.google.inject.internal.util.$Finalizer" daemon prio=5 tid=33 in Object.wait()
java.lang.Thread.State: WAITING (on object monitor)
        at java.lang.Object.wait(Native Method)
        at java.lang.ref.ReferenceQueue.remove(ReferenceQueue.java:135)
        at java.lang.ref.ReferenceQueue.remove(ReferenceQueue.java:151)
        at com.google.inject.internal.util.$Finalizer.run(Finalizer.java:114)
"IPC Server handler 7 on 10200" daemon prio=5 tid=146 timed_waiting
java.lang.Thread.State: TIMED_WAITING
        at sun.misc.Unsafe.park(Native Method)
        at java.util.concurrent.locks.LockSupport.parkNanos(LockSupport.java:226)
        at java.util.concurrent.locks.AbstractQueuedSynchronizer$ConditionObject.awaitNanos(AbstractQueuedSynchronizer.java:2082)
        at java.util.concurrent.LinkedBlockingQueue.poll(LinkedBlockingQueue.java:467)
        at org.apache.hadoop.ipc.CallQueueManager.take(CallQueueManager.java:129)
        at org.apache.hadoop.ipc.Server$Handler.run(Server.java:2269)
"IPC Server idle connection scanner for port 10200" daemon prio=5 tid=137 timed_waiting
java.lang.Thread.State: TIMED_WAITING
        at java.lang.Object.wait(Native Method)
        at java.util.TimerThread.mainLoop(Timer.java:552)
        at java.util.TimerThread.run(Timer.java:505)
"Thread[Thread-113,5,main]" daemon prio=5 tid=134 timed_waiting
java.lang.Thread.State: TIMED_WAITING
        at java.lang.Thread.sleep(Native Method)
        at org.apache.hadoop.security.token.delegation.AbstractDelegationTokenSecretManager$ExpiredTokenRemover.run(AbstractDelegationTokenSecretManager.java:668)
        at java.lang.Thread.run(Thread.java:745)
"org.apache.hadoop.fs.FileSystem$Statistics$StatisticsDataReferenceCleaner" daemon prio=5
tid=47 in Object.wait()
java.lang.Thread.State: WAITING (on object monitor)
        at java.lang.Object.wait(Native Method)
        at java.lang.ref.ReferenceQueue.remove(ReferenceQueue.java:135)
        at java.lang.ref.ReferenceQueue.remove(ReferenceQueue.java:151)
        at org.apache.hadoop.fs.FileSystem$Statistics$StatisticsDataReferenceCleaner.run(FileSystem.java:3108)
        at java.lang.Thread.run(Thread.java:745)
"IPC Server handler 5 on 10200" daemon prio=5 tid=144 timed_waiting
java.lang.Thread.State: TIMED_WAITING
        at sun.misc.Unsafe.park(Native Method)
        at java.util.concurrent.locks.LockSupport.parkNanos(LockSupport.java:226)
        at java.util.concurrent.locks.AbstractQueuedSynchronizer$ConditionObject.awaitNanos(AbstractQueuedSynchronizer.java:2082)
        at java.util.concurrent.LinkedBlockingQueue.poll(LinkedBlockingQueue.java:467)
        at org.apache.hadoop.ipc.CallQueueManager.take(CallQueueManager.java:129)
        at org.apache.hadoop.ipc.Server$Handler.run(Server.java:2269)
"IPC Server listener on 10200" daemon prio=5 tid=135 runnable
java.lang.Thread.State: RUNNABLE
        at sun.nio.ch.EPollArrayWrapper.epollWait(Native Method)
        at sun.nio.ch.EPollArrayWrapper.poll(EPollArrayWrapper.java:269)
        at sun.nio.ch.EPollSelectorImpl.doSelect(EPollSelectorImpl.java:79)
Tests run: 5, Failures: 1, Errors: 1, Skipped: 0, Time elapsed: 245.949 sec <<< FAILURE!
- in org.apache.hadoop.yarn.server.applicationhistoryservice.TestApplicationHistoryServer
testFilterOverrides(org.apache.hadoop.yarn.server.applicationhistoryservice.TestApplicationHistoryServer)
 Time elapsed: 240.014 sec  <<< ERROR!
java.lang.Exception: test timed out after 240000 milliseconds
	at org.mortbay.io.nio.SelectorManager$SelectSet.stop(SelectorManager.java:879)
	at org.mortbay.io.nio.SelectorManager.doStop(SelectorManager.java:240)
	at org.mortbay.component.AbstractLifeCycle.stop(AbstractLifeCycle.java:76)
	at org.mortbay.jetty.nio.SelectChannelConnector.close(SelectChannelConnector.java:136)
	at org.apache.hadoop.http.HttpServer2.stop(HttpServer2.java:909)
	at org.apache.hadoop.yarn.webapp.WebApp.stop(WebApp.java:97)
	at org.apache.hadoop.yarn.server.applicationhistoryservice.ApplicationHistoryServer.serviceStop(ApplicationHistoryServer.java:129)
	at org.apache.hadoop.service.AbstractService.stop(AbstractService.java:221)
	at org.apache.hadoop.yarn.server.applicationhistoryservice.TestApplicationHistoryServer.testFilterOverrides(TestApplicationHistoryServer.java:175)

testLaunch(org.apache.hadoop.yarn.server.applicationhistoryservice.TestApplicationHistoryServer)
 Time elapsed: 0.034 sec  <<< FAILURE!
java.lang.AssertionError: expected:<0> but was:<-1>
	at org.junit.Assert.fail(Assert.java:88)
	at org.junit.Assert.failNotEquals(Assert.java:743)
	at org.junit.Assert.assertEquals(Assert.java:118)
	at org.junit.Assert.assertEquals(Assert.java:555)
	at org.junit.Assert.assertEquals(Assert.java:542)
	at org.apache.hadoop.yarn.server.applicationhistoryservice.TestApplicationHistoryServer.testLaunch(TestApplicationHistoryServer.java:103)

     
Running org.apache.hadoop.yarn.server.applicationhistoryservice.TestApplicationHistoryManagerImpl
Tests run: 1, Failures: 0, Errors: 0, Skipped: 0, Time elapsed: 0.768 sec - in org.apache.hadoop.yarn.server.applicationhistoryservice.TestApplicationHistoryManagerImpl
Running org.apache.hadoop.yarn.server.timeline.webapp.TestTimelineWebServicesWithSSL
Tests run: 1, Failures: 0, Errors: 0, Skipped: 0, Time elapsed: 4.923 sec - in org.apache.hadoop.yarn.server.timeline.webapp.TestTimelineWebServicesWithSSL
Running org.apache.hadoop.yarn.server.timeline.webapp.TestTimelineWebServices
Tests run: 27, Failures: 0, Errors: 0, Skipped: 0, Time elapsed: 38.775 sec - in org.apache.hadoop.yarn.server.timeline.webapp.TestTimelineWebServices
Running org.apache.hadoop.yarn.server.timeline.recovery.TestLeveldbTimelineStateStore
Tests run: 2, Failures: 0, Errors: 0, Skipped: 0, Time elapsed: 1.247 sec - in org.apache.hadoop.yarn.server.timeline.recovery.TestLeveldbTimelineStateStore
Running org.apache.hadoop.yarn.server.timeline.TestTimelineDataManager
Tests run: 4, Failures: 0, Errors: 0, Skipped: 0, Time elapsed: 5.704 sec - in org.apache.hadoop.yarn.server.timeline.TestTimelineDataManager
Running org.apache.hadoop.yarn.server.timeline.TestGenericObjectMapper
Tests run: 2, Failures: 0, Errors: 0, Skipped: 0, Time elapsed: 0.489 sec - in org.apache.hadoop.yarn.server.timeline.TestGenericObjectMapper
Running org.apache.hadoop.yarn.server.timeline.TestRollingLevelDB
Tests run: 2, Failures: 0, Errors: 0, Skipped: 0, Time elapsed: 1.31 sec - in org.apache.hadoop.yarn.server.timeline.TestRollingLevelDB
Running org.apache.hadoop.yarn.server.timeline.TestLeveldbTimelineStore
Tests run: 19, Failures: 0, Errors: 0, Skipped: 0, Time elapsed: 21.919 sec - in org.apache.hadoop.yarn.server.timeline.TestLeveldbTimelineStore
Running org.apache.hadoop.yarn.server.timeline.security.TestTimelineACLsManager
Tests run: 6, Failures: 0, Errors: 0, Skipped: 0, Time elapsed: 1.121 sec - in org.apache.hadoop.yarn.server.timeline.security.TestTimelineACLsManager
Running org.apache.hadoop.yarn.server.timeline.security.TestTimelineAuthenticationFilter
Tests run: 6, Failures: 0, Errors: 0, Skipped: 0, Time elapsed: 11.168 sec - in org.apache.hadoop.yarn.server.timeline.security.TestTimelineAuthenticationFilter
Running org.apache.hadoop.yarn.server.timeline.security.TestTimelineAuthenticationFilterInitializer
Tests run: 1, Failures: 0, Errors: 0, Skipped: 0, Time elapsed: 0.867 sec - in org.apache.hadoop.yarn.server.timeline.security.TestTimelineAuthenticationFilterInitializer
Running org.apache.hadoop.yarn.server.timeline.TestRollingLevelDBTimelineStore
Tests run: 16, Failures: 0, Errors: 0, Skipped: 0, Time elapsed: 19.229 sec - in org.apache.hadoop.yarn.server.timeline.TestRollingLevelDBTimelineStore
Running org.apache.hadoop.yarn.server.timeline.TestMemoryTimelineStore
Tests run: 9, Failures: 0, Errors: 0, Skipped: 0, Time elapsed: 9.304 sec - in org.apache.hadoop.yarn.server.timeline.TestMemoryTimelineStore

Results :

Failed tests: 
  TestApplicationHistoryServer.testLaunch:103 expected:<0> but was:<-1>

Tests in error: 
  TestApplicationHistoryServer.testFilterOverrides:175 ยป  test timed out after 2...

Tests run: 193, Failures: 1, Errors: 1, Skipped: 0

[INFO] ------------------------------------------------------------------------
[INFO] Reactor Summary:
[INFO] 
[INFO] Apache Hadoop YARN ................................ SUCCESS [  4.161 s]
[INFO] Apache Hadoop YARN API ............................ SUCCESS [04:48 min]
[INFO] Apache Hadoop YARN Common ......................... SUCCESS [03:24 min]
[INFO] Apache Hadoop YARN Server ......................... SUCCESS [  0.104 s]
[INFO] Apache Hadoop YARN Server Common .................. SUCCESS [ 56.366 s]
[INFO] Apache Hadoop YARN NodeManager .................... SUCCESS [10:28 min]
[INFO] Apache Hadoop YARN Web Proxy ...................... SUCCESS [ 35.613 s]
[INFO] Apache Hadoop YARN ApplicationHistoryService ...... FAILURE [07:02 min]
[INFO] Apache Hadoop YARN ResourceManager ................ SKIPPED
[INFO] Apache Hadoop YARN Server Tests ................... SKIPPED
[INFO] Apache Hadoop YARN Client ......................... SKIPPED
[INFO] Apache Hadoop YARN SharedCacheManager ............. SKIPPED
[INFO] Apache Hadoop YARN Applications ................... SKIPPED
[INFO] Apache Hadoop YARN DistributedShell ............... SKIPPED
[INFO] Apache Hadoop YARN Unmanaged Am Launcher .......... SKIPPED
[INFO] Apache Hadoop YARN Site ........................... SKIPPED
[INFO] Apache Hadoop YARN Registry ....................... SKIPPED
[INFO] Apache Hadoop YARN Project ........................ SKIPPED
[INFO] ------------------------------------------------------------------------
[INFO] BUILD FAILURE
[INFO] ------------------------------------------------------------------------
[INFO] Total time: 27:22 min
[INFO] Finished at: 2015-10-28T19:38:55+00:00
[INFO] Final Memory: 86M/871M
[INFO] ------------------------------------------------------------------------
[ERROR] Failed to execute goal org.apache.maven.plugins:maven-surefire-plugin:2.17:test (default-test)
on project hadoop-yarn-server-applicationhistoryservice: There are test failures.
[ERROR] 
[ERROR] Please refer to <https://builds.apache.org/job/Hadoop-Yarn-trunk/ws/hadoop-yarn-project/hadoop-yarn/hadoop-yarn-server/hadoop-yarn-server-applicationhistoryservice/target/surefire-reports>
for the individual test results.
[ERROR] -> [Help 1]
[ERROR] 
[ERROR] To see the full stack trace of the errors, re-run Maven with the -e switch.
[ERROR] Re-run Maven using the -X switch to enable full debug logging.
[ERROR] 
[ERROR] For more information about the errors and possible solutions, please read the following
articles:
[ERROR] [Help 1] http://cwiki.apache.org/confluence/display/MAVEN/MojoFailureException
[ERROR] 
[ERROR] After correcting the problems, you can resume the build with the command
[ERROR]   mvn <goals> -rf :hadoop-yarn-server-applicationhistoryservice
Build step 'Execute shell' marked build as failure
Archiving artifacts
Recording test results
Updating HADOOP-12519
Updating YARN-2859
Updating HDFS-9279

Mime
View raw message