hadoop-yarn-dev mailing list archives

Site index · List index
Message view « Date » · « Thread »
Top « Date » · « Thread »
From Apache Jenkins Server <jenk...@builds.apache.org>
Subject Hadoop-Yarn-trunk-Java8 - Build # 491 - Still Failing
Date Mon, 05 Oct 2015 22:50:21 GMT
See https://builds.apache.org/job/Hadoop-Yarn-trunk-Java8/491/

###################################################################################
########################## LAST 60 LINES OF THE CONSOLE ###########################
[...truncated 5271 lines...]

Results :

Failed tests: 
  TestRMAppTransitions.testAppKilledKilled:916->assertTimesAtFinish:321 application finish
time is not greater then 0

Tests in error: 
  TestRMWebServicesDelegationTokenAuthentication.testDoAs:357->getDelegationToken:398 ยป
IO

Tests run: 1204, Failures: 1, Errors: 1, Skipped: 1

[INFO] ------------------------------------------------------------------------
[INFO] Reactor Summary:
[INFO] 
[INFO] Apache Hadoop YARN ................................ SUCCESS [  3.304 s]
[INFO] Apache Hadoop YARN API ............................ SUCCESS [01:18 min]
[INFO] Apache Hadoop YARN Common ......................... SUCCESS [02:20 min]
[INFO] Apache Hadoop YARN Server ......................... SUCCESS [  0.056 s]
[INFO] Apache Hadoop YARN Server Common .................. SUCCESS [ 38.900 s]
[INFO] Apache Hadoop YARN NodeManager .................... SUCCESS [08:46 min]
[INFO] Apache Hadoop YARN Web Proxy ...................... SUCCESS [ 16.547 s]
[INFO] Apache Hadoop YARN ApplicationHistoryService ...... SUCCESS [03:10 min]
[INFO] Apache Hadoop YARN ResourceManager ................ FAILURE [56:02 min]
[INFO] Apache Hadoop YARN Server Tests ................... SKIPPED
[INFO] Apache Hadoop YARN Client ......................... SKIPPED
[INFO] Apache Hadoop YARN SharedCacheManager ............. SKIPPED
[INFO] Apache Hadoop YARN Applications ................... SKIPPED
[INFO] Apache Hadoop YARN DistributedShell ............... SKIPPED
[INFO] Apache Hadoop YARN Unmanaged Am Launcher .......... SKIPPED
[INFO] Apache Hadoop YARN Site ........................... SKIPPED
[INFO] Apache Hadoop YARN Registry ....................... SKIPPED
[INFO] Apache Hadoop YARN Project ........................ SKIPPED
[INFO] ------------------------------------------------------------------------
[INFO] BUILD FAILURE
[INFO] ------------------------------------------------------------------------
[INFO] Total time: 01:12 h
[INFO] Finished at: 2015-10-05T22:50:49+00:00
[INFO] Final Memory: 60M/1026M
[INFO] ------------------------------------------------------------------------
[ERROR] Failed to execute goal org.apache.maven.plugins:maven-surefire-plugin:2.17:test (default-test)
on project hadoop-yarn-server-resourcemanager: There are test failures.
[ERROR] 
[ERROR] Please refer to /home/jenkins/jenkins-slave/workspace/Hadoop-Yarn-trunk-Java8/hadoop-yarn-project/hadoop-yarn/hadoop-yarn-server/hadoop-yarn-server-resourcemanager/target/surefire-reports
for the individual test results.
[ERROR] -> [Help 1]
[ERROR] 
[ERROR] To see the full stack trace of the errors, re-run Maven with the -e switch.
[ERROR] Re-run Maven using the -X switch to enable full debug logging.
[ERROR] 
[ERROR] For more information about the errors and possible solutions, please read the following
articles:
[ERROR] [Help 1] http://cwiki.apache.org/confluence/display/MAVEN/MojoFailureException
[ERROR] 
[ERROR] After correcting the problems, you can resume the build with the command
[ERROR]   mvn <goals> -rf :hadoop-yarn-server-resourcemanager
Build step 'Execute shell' marked build as failure
Archiving artifacts
Recording test results
Updating HADOOP-10949
Sending e-mails to: yarn-dev@hadoop.apache.org
Email was triggered for: Failure - Any
Sending email for trigger: Failure - Any



###################################################################################
############################## FAILED TESTS (if any) ##############################
2 tests failed.
FAILED:  org.apache.hadoop.yarn.server.resourcemanager.rmapp.TestRMAppTransitions.testAppKilledKilled[0]

Error Message:
application finish time is not greater then 0

Stack Trace:
java.lang.AssertionError: application finish time is not greater then 0
	at org.junit.Assert.fail(Assert.java:88)
	at org.junit.Assert.assertTrue(Assert.java:41)
	at org.apache.hadoop.yarn.server.resourcemanager.rmapp.TestRMAppTransitions.assertTimesAtFinish(TestRMAppTransitions.java:321)
	at org.apache.hadoop.yarn.server.resourcemanager.rmapp.TestRMAppTransitions.testAppKilledKilled(TestRMAppTransitions.java:916)


FAILED:  org.apache.hadoop.yarn.server.resourcemanager.webapp.TestRMWebServicesDelegationTokenAuthentication.testDoAs[1]

Error Message:
Server returned HTTP response code: 403 for URL: http://localhost:8088/ws/v1/cluster/delegation-token

Stack Trace:
java.io.IOException: Server returned HTTP response code: 403 for URL: http://localhost:8088/ws/v1/cluster/delegation-token
	at sun.net.www.protocol.http.HttpURLConnection.getInputStream0(HttpURLConnection.java:1838)
	at sun.net.www.protocol.http.HttpURLConnection.getInputStream(HttpURLConnection.java:1439)
	at org.apache.hadoop.yarn.server.resourcemanager.webapp.TestRMWebServicesDelegationTokenAuthentication$3.call(TestRMWebServicesDelegationTokenAuthentication.java:407)
	at org.apache.hadoop.yarn.server.resourcemanager.webapp.TestRMWebServicesDelegationTokenAuthentication$3.call(TestRMWebServicesDelegationTokenAuthentication.java:398)
	at org.apache.hadoop.security.authentication.KerberosTestUtils$1.run(KerberosTestUtils.java:120)
	at java.security.AccessController.doPrivileged(Native Method)
	at javax.security.auth.Subject.doAs(Subject.java:422)
	at org.apache.hadoop.security.authentication.KerberosTestUtils.doAs(KerberosTestUtils.java:117)
	at org.apache.hadoop.security.authentication.KerberosTestUtils.doAsClient(KerberosTestUtils.java:133)
	at org.apache.hadoop.yarn.server.resourcemanager.webapp.TestRMWebServicesDelegationTokenAuthentication.getDelegationToken(TestRMWebServicesDelegationTokenAuthentication.java:398)
	at org.apache.hadoop.yarn.server.resourcemanager.webapp.TestRMWebServicesDelegationTokenAuthentication.testDoAs(TestRMWebServicesDelegationTokenAuthentication.java:357)



Mime
  • Unnamed multipart/mixed (inline, None, 0 bytes)
View raw message