hadoop-yarn-dev mailing list archives

Site index · List index
Message view « Date » · « Thread »
Top « Date » · « Thread »
From Apache Jenkins Server <jenk...@builds.apache.org>
Subject Hadoop-Yarn-trunk - Build # 1292 - Still Failing
Date Tue, 20 Oct 2015 05:58:31 GMT
See https://builds.apache.org/job/Hadoop-Yarn-trunk/1292/

###################################################################################
########################## LAST 60 LINES OF THE CONSOLE ###########################
[...truncated 9356 lines...]
Tests run: 11, Failures: 0, Errors: 0, Skipped: 0, Time elapsed: 2.636 sec - in org.apache.hadoop.yarn.server.resourcemanager.nodelabels.TestRMNodeLabelsManager
Running org.apache.hadoop.yarn.server.resourcemanager.applicationsmanager.TestAMRMRPCResponseId
Tests run: 1, Failures: 0, Errors: 0, Skipped: 0, Time elapsed: 5.916 sec - in org.apache.hadoop.yarn.server.resourcemanager.applicationsmanager.TestAMRMRPCResponseId
Running org.apache.hadoop.yarn.server.resourcemanager.applicationsmanager.TestAMRMRPCNodeUpdates
Tests run: 1, Failures: 0, Errors: 0, Skipped: 0, Time elapsed: 9.175 sec - in org.apache.hadoop.yarn.server.resourcemanager.applicationsmanager.TestAMRMRPCNodeUpdates
Running org.apache.hadoop.yarn.server.resourcemanager.applicationsmanager.TestAMRestart
Tests run: 8, Failures: 0, Errors: 0, Skipped: 0, Time elapsed: 161.968 sec - in org.apache.hadoop.yarn.server.resourcemanager.applicationsmanager.TestAMRestart

Results :

Tests run: 1189, Failures: 0, Errors: 0, Skipped: 1

[INFO] ------------------------------------------------------------------------
[INFO] Reactor Summary:
[INFO] 
[INFO] Apache Hadoop YARN ................................ SUCCESS [  3.382 s]
[INFO] Apache Hadoop YARN API ............................ SUCCESS [04:09 min]
[INFO] Apache Hadoop YARN Common ......................... SUCCESS [02:59 min]
[INFO] Apache Hadoop YARN Server ......................... SUCCESS [  0.094 s]
[INFO] Apache Hadoop YARN Server Common .................. SUCCESS [ 48.514 s]
[INFO] Apache Hadoop YARN NodeManager .................... SUCCESS [09:12 min]
[INFO] Apache Hadoop YARN Web Proxy ...................... SUCCESS [ 26.184 s]
[INFO] Apache Hadoop YARN ApplicationHistoryService ...... SUCCESS [03:27 min]
[INFO] Apache Hadoop YARN ResourceManager ................ FAILURE [57:29 min]
[INFO] Apache Hadoop YARN Server Tests ................... SKIPPED
[INFO] Apache Hadoop YARN Client ......................... SKIPPED
[INFO] Apache Hadoop YARN SharedCacheManager ............. SKIPPED
[INFO] Apache Hadoop YARN Applications ................... SKIPPED
[INFO] Apache Hadoop YARN DistributedShell ............... SKIPPED
[INFO] Apache Hadoop YARN Unmanaged Am Launcher .......... SKIPPED
[INFO] Apache Hadoop YARN Site ........................... SKIPPED
[INFO] Apache Hadoop YARN Registry ....................... SKIPPED
[INFO] Apache Hadoop YARN Project ........................ SKIPPED
[INFO] ------------------------------------------------------------------------
[INFO] BUILD FAILURE
[INFO] ------------------------------------------------------------------------
[INFO] Total time: 01:18 h
[INFO] Finished at: 2015-10-20T05:58:45+00:00
[INFO] Final Memory: 60M/495M
[INFO] ------------------------------------------------------------------------
[ERROR] Failed to execute goal org.apache.maven.plugins:maven-surefire-plugin:2.17:test (default-test)
on project hadoop-yarn-server-resourcemanager: ExecutionException: java.lang.RuntimeException:
The forked VM terminated without properly saying goodbye. VM crash or System.exit called?
[ERROR] Command was /bin/sh -c cd /home/jenkins/jenkins-slave/workspace/Hadoop-Yarn-trunk/hadoop-yarn-project/hadoop-yarn/hadoop-yarn-server/hadoop-yarn-server-resourcemanager
&& /home/jenkins/tools/java/jdk1.7.0_55/jre/bin/java -Xmx2048m -XX:MaxPermSize=768m
-XX:+HeapDumpOnOutOfMemoryError -jar /home/jenkins/jenkins-slave/workspace/Hadoop-Yarn-trunk/hadoop-yarn-project/hadoop-yarn/hadoop-yarn-server/hadoop-yarn-server-resourcemanager/target/surefire/surefirebooter5378434128416939952.jar
/home/jenkins/jenkins-slave/workspace/Hadoop-Yarn-trunk/hadoop-yarn-project/hadoop-yarn/hadoop-yarn-server/hadoop-yarn-server-resourcemanager/target/surefire/surefire2993078774268555489tmp
/home/jenkins/jenkins-slave/workspace/Hadoop-Yarn-trunk/hadoop-yarn-project/hadoop-yarn/hadoop-yarn-server/hadoop-yarn-server-resourcemanager/target/surefire/surefire_2146062762029090238878tmp
[ERROR] -> [Help 1]
[ERROR] 
[ERROR] To see the full stack trace of the errors, re-run Maven with the -e switch.
[ERROR] Re-run Maven using the -X switch to enable full debug logging.
[ERROR] 
[ERROR] For more information about the errors and possible solutions, please read the following
articles:
[ERROR] [Help 1] http://cwiki.apache.org/confluence/display/MAVEN/MojoFailureException
[ERROR] 
[ERROR] After correcting the problems, you can resume the build with the command
[ERROR]   mvn <goals> -rf :hadoop-yarn-server-resourcemanager
Build step 'Execute shell' marked build as failure
Archiving artifacts
Recording test results
Updating HDFS-9208
Sending e-mails to: yarn-dev@hadoop.apache.org
Email was triggered for: Failure - Any
Sending email for trigger: Failure - Any



###################################################################################
############################## FAILED TESTS (if any) ##############################
All tests passed
Mime
  • Unnamed multipart/mixed (inline, None, 0 bytes)
View raw message