hadoop-yarn-dev mailing list archives

Site index · List index
Message view « Date » · « Thread »
Top « Date » · « Thread »
From Apache Jenkins Server <jenk...@builds.apache.org>
Subject Build failed in Jenkins: Hadoop-Yarn-trunk-Java8 #494
Date Tue, 06 Oct 2015 10:50:40 GMT
See <https://builds.apache.org/job/Hadoop-Yarn-trunk-Java8/494/changes>

Changes:

[vinayakumarb] HDFS-7899. Improve EOF error message (Contributed by Jagadesh Kiran N)

------------------------------------------
[...truncated 4336 lines...]
Running org.apache.hadoop.yarn.server.nodemanager.TestRecordFactory
Tests run: 1, Failures: 0, Errors: 0, Skipped: 0, Time elapsed: 0.214 sec - in org.apache.hadoop.yarn.server.nodemanager.TestRecordFactory
Java HotSpot(TM) 64-Bit Server VM warning: ignoring option MaxPermSize=768m; support was removed
in 8.0
Running org.apache.hadoop.yarn.server.nodemanager.metrics.TestNodeManagerMetrics
Tests run: 1, Failures: 0, Errors: 0, Skipped: 0, Time elapsed: 0.719 sec - in org.apache.hadoop.yarn.server.nodemanager.metrics.TestNodeManagerMetrics
Java HotSpot(TM) 64-Bit Server VM warning: ignoring option MaxPermSize=768m; support was removed
in 8.0
Running org.apache.hadoop.yarn.server.nodemanager.security.TestNMTokenSecretManagerInNM
Tests run: 1, Failures: 0, Errors: 0, Skipped: 0, Time elapsed: 0.958 sec - in org.apache.hadoop.yarn.server.nodemanager.security.TestNMTokenSecretManagerInNM
Java HotSpot(TM) 64-Bit Server VM warning: ignoring option MaxPermSize=768m; support was removed
in 8.0
Running org.apache.hadoop.yarn.server.nodemanager.security.TestNMContainerTokenSecretManager
Tests run: 1, Failures: 0, Errors: 0, Skipped: 0, Time elapsed: 1.027 sec - in org.apache.hadoop.yarn.server.nodemanager.security.TestNMContainerTokenSecretManager
Java HotSpot(TM) 64-Bit Server VM warning: ignoring option MaxPermSize=768m; support was removed
in 8.0
Running org.apache.hadoop.yarn.server.nodemanager.TestDockerContainerExecutor
Tests run: 1, Failures: 0, Errors: 0, Skipped: 0, Time elapsed: 4.169 sec - in org.apache.hadoop.yarn.server.nodemanager.TestDockerContainerExecutor
Java HotSpot(TM) 64-Bit Server VM warning: ignoring option MaxPermSize=768m; support was removed
in 8.0
Running org.apache.hadoop.yarn.server.nodemanager.TestContainerExecutor
Tests run: 5, Failures: 0, Errors: 0, Skipped: 3, Time elapsed: 0.661 sec - in org.apache.hadoop.yarn.server.nodemanager.TestContainerExecutor
Java HotSpot(TM) 64-Bit Server VM warning: ignoring option MaxPermSize=768m; support was removed
in 8.0
Running org.apache.hadoop.yarn.server.nodemanager.TestRPCFactories
Tests run: 1, Failures: 0, Errors: 0, Skipped: 0, Time elapsed: 0.716 sec - in org.apache.hadoop.yarn.server.nodemanager.TestRPCFactories
Java HotSpot(TM) 64-Bit Server VM warning: ignoring option MaxPermSize=768m; support was removed
in 8.0
Running org.apache.hadoop.yarn.server.nodemanager.TestLinuxContainerExecutorWithMocks
Tests run: 8, Failures: 0, Errors: 0, Skipped: 0, Time elapsed: 1.101 sec - in org.apache.hadoop.yarn.server.nodemanager.TestLinuxContainerExecutorWithMocks
Java HotSpot(TM) 64-Bit Server VM warning: ignoring option MaxPermSize=768m; support was removed
in 8.0
Running org.apache.hadoop.yarn.server.nodemanager.TestContainerManagerWithLCE
Tests run: 16, Failures: 0, Errors: 0, Skipped: 0, Time elapsed: 1.637 sec - in org.apache.hadoop.yarn.server.nodemanager.TestContainerManagerWithLCE
Java HotSpot(TM) 64-Bit Server VM warning: ignoring option MaxPermSize=768m; support was removed
in 8.0
Running org.apache.hadoop.yarn.server.nodemanager.webapp.TestContainerLogsPage
Tests run: 5, Failures: 0, Errors: 0, Skipped: 1, Time elapsed: 1.171 sec - in org.apache.hadoop.yarn.server.nodemanager.webapp.TestContainerLogsPage
Java HotSpot(TM) 64-Bit Server VM warning: ignoring option MaxPermSize=768m; support was removed
in 8.0
Running org.apache.hadoop.yarn.server.nodemanager.webapp.TestNMWebServicesContainers
Tests run: 12, Failures: 0, Errors: 0, Skipped: 0, Time elapsed: 5.631 sec - in org.apache.hadoop.yarn.server.nodemanager.webapp.TestNMWebServicesContainers
Java HotSpot(TM) 64-Bit Server VM warning: ignoring option MaxPermSize=768m; support was removed
in 8.0
Running org.apache.hadoop.yarn.server.nodemanager.webapp.TestNMWebServer
Tests run: 3, Failures: 0, Errors: 0, Skipped: 0, Time elapsed: 2.213 sec - in org.apache.hadoop.yarn.server.nodemanager.webapp.TestNMWebServer
Java HotSpot(TM) 64-Bit Server VM warning: ignoring option MaxPermSize=768m; support was removed
in 8.0
Running org.apache.hadoop.yarn.server.nodemanager.webapp.TestNMWebServicesApps
Tests run: 19, Failures: 0, Errors: 0, Skipped: 0, Time elapsed: 7.236 sec - in org.apache.hadoop.yarn.server.nodemanager.webapp.TestNMWebServicesApps
Java HotSpot(TM) 64-Bit Server VM warning: ignoring option MaxPermSize=768m; support was removed
in 8.0
Running org.apache.hadoop.yarn.server.nodemanager.webapp.TestNMWebServices
Tests run: 11, Failures: 0, Errors: 0, Skipped: 0, Time elapsed: 6.798 sec - in org.apache.hadoop.yarn.server.nodemanager.webapp.TestNMWebServices
Java HotSpot(TM) 64-Bit Server VM warning: ignoring option MaxPermSize=768m; support was removed
in 8.0
Running org.apache.hadoop.yarn.server.nodemanager.TestNodeManagerReboot
Tests run: 1, Failures: 0, Errors: 0, Skipped: 0, Time elapsed: 6.581 sec - in org.apache.hadoop.yarn.server.nodemanager.TestNodeManagerReboot
Java HotSpot(TM) 64-Bit Server VM warning: ignoring option MaxPermSize=768m; support was removed
in 8.0
Running org.apache.hadoop.yarn.server.nodemanager.nodelabels.TestConfigurationNodeLabelsProvider
Tests run: 3, Failures: 0, Errors: 0, Skipped: 0, Time elapsed: 2.88 sec - in org.apache.hadoop.yarn.server.nodemanager.nodelabels.TestConfigurationNodeLabelsProvider
Java HotSpot(TM) 64-Bit Server VM warning: ignoring option MaxPermSize=768m; support was removed
in 8.0
Running org.apache.hadoop.yarn.server.nodemanager.TestLocalDirsHandlerService
Tests run: 3, Failures: 0, Errors: 0, Skipped: 0, Time elapsed: 0.836 sec - in org.apache.hadoop.yarn.server.nodemanager.TestLocalDirsHandlerService
Java HotSpot(TM) 64-Bit Server VM warning: ignoring option MaxPermSize=768m; support was removed
in 8.0
Running org.apache.hadoop.yarn.server.nodemanager.TestLinuxContainerExecutor
Tests run: 8, Failures: 0, Errors: 0, Skipped: 8, Time elapsed: 0.895 sec - in org.apache.hadoop.yarn.server.nodemanager.TestLinuxContainerExecutor
Java HotSpot(TM) 64-Bit Server VM warning: ignoring option MaxPermSize=768m; support was removed
in 8.0
Running org.apache.hadoop.yarn.server.nodemanager.api.protocolrecords.impl.pb.TestPBRecordImpl
Tests run: 4, Failures: 0, Errors: 0, Skipped: 0, Time elapsed: 0.523 sec - in org.apache.hadoop.yarn.server.nodemanager.api.protocolrecords.impl.pb.TestPBRecordImpl
Java HotSpot(TM) 64-Bit Server VM warning: ignoring option MaxPermSize=768m; support was removed
in 8.0
Running org.apache.hadoop.yarn.server.nodemanager.api.protocolrecords.impl.pb.TestPBLocalizerRPC
Tests run: 1, Failures: 0, Errors: 0, Skipped: 0, Time elapsed: 0.883 sec - in org.apache.hadoop.yarn.server.nodemanager.api.protocolrecords.impl.pb.TestPBLocalizerRPC
Java HotSpot(TM) 64-Bit Server VM warning: ignoring option MaxPermSize=768m; support was removed
in 8.0
Running org.apache.hadoop.yarn.server.nodemanager.TestNodeStatusUpdaterForLabels
Tests run: 2, Failures: 0, Errors: 0, Skipped: 0, Time elapsed: 12.232 sec - in org.apache.hadoop.yarn.server.nodemanager.TestNodeStatusUpdaterForLabels
Java HotSpot(TM) 64-Bit Server VM warning: ignoring option MaxPermSize=768m; support was removed
in 8.0
Running org.apache.hadoop.yarn.server.nodemanager.TestNMAuditLogger
Tests run: 3, Failures: 0, Errors: 0, Skipped: 0, Time elapsed: 0.962 sec - in org.apache.hadoop.yarn.server.nodemanager.TestNMAuditLogger
Java HotSpot(TM) 64-Bit Server VM warning: ignoring option MaxPermSize=768m; support was removed
in 8.0
Running org.apache.hadoop.yarn.server.nodemanager.containermanager.logaggregation.TestLogAggregationService
Tests run: 35, Failures: 0, Errors: 1, Skipped: 0, Time elapsed: 111.965 sec <<<
FAILURE! - in org.apache.hadoop.yarn.server.nodemanager.containermanager.logaggregation.TestLogAggregationService
testAddNewTokenSentFromRMForLogAggregation(org.apache.hadoop.yarn.server.nodemanager.containermanager.logaggregation.TestLogAggregationService)
 Time elapsed: 4.094 sec  <<< ERROR!
java.lang.NoClassDefFoundError: org/apache/hadoop/test/GenericTestUtils
	at java.net.URLClassLoader$1.run(URLClassLoader.java:372)
	at java.net.URLClassLoader$1.run(URLClassLoader.java:361)
	at java.security.AccessController.doPrivileged(Native Method)
	at java.net.URLClassLoader.findClass(URLClassLoader.java:360)
	at java.lang.ClassLoader.loadClass(ClassLoader.java:424)
	at sun.misc.Launcher$AppClassLoader.loadClass(Launcher.java:308)
	at java.lang.ClassLoader.loadClass(ClassLoader.java:357)
	at org.apache.hadoop.yarn.server.nodemanager.containermanager.logaggregation.TestLogAggregationService.testAddNewTokenSentFromRMForLogAggregation(TestLogAggregationService.java:2111)

Java HotSpot(TM) 64-Bit Server VM warning: ignoring option MaxPermSize=768m; support was removed
in 8.0
Running org.apache.hadoop.yarn.server.nodemanager.containermanager.linux.privileged.TestPrivilegedOperationExecutor
Tests run: 4, Failures: 0, Errors: 0, Skipped: 0, Time elapsed: 0.521 sec - in org.apache.hadoop.yarn.server.nodemanager.containermanager.linux.privileged.TestPrivilegedOperationExecutor
Java HotSpot(TM) 64-Bit Server VM warning: ignoring option MaxPermSize=768m; support was removed
in 8.0
Running org.apache.hadoop.yarn.server.nodemanager.containermanager.linux.runtime.TestDockerContainerRuntime
Tests run: 2, Failures: 0, Errors: 0, Skipped: 0, Time elapsed: 0.602 sec - in org.apache.hadoop.yarn.server.nodemanager.containermanager.linux.runtime.TestDockerContainerRuntime
Java HotSpot(TM) 64-Bit Server VM warning: ignoring option MaxPermSize=768m; support was removed
in 8.0
Running org.apache.hadoop.yarn.server.nodemanager.containermanager.linux.resources.TestTrafficController
Tests run: 5, Failures: 0, Errors: 0, Skipped: 0, Time elapsed: 0.753 sec - in org.apache.hadoop.yarn.server.nodemanager.containermanager.linux.resources.TestTrafficController
Java HotSpot(TM) 64-Bit Server VM warning: ignoring option MaxPermSize=768m; support was removed
in 8.0
Running org.apache.hadoop.yarn.server.nodemanager.containermanager.linux.resources.TestCGroupsBlkioResourceHandlerImpl
Tests run: 5, Failures: 0, Errors: 0, Skipped: 0, Time elapsed: 0.455 sec - in org.apache.hadoop.yarn.server.nodemanager.containermanager.linux.resources.TestCGroupsBlkioResourceHandlerImpl
Java HotSpot(TM) 64-Bit Server VM warning: ignoring option MaxPermSize=768m; support was removed
in 8.0
Running org.apache.hadoop.yarn.server.nodemanager.containermanager.linux.resources.TestTrafficControlBandwidthHandlerImpl
Tests run: 2, Failures: 0, Errors: 0, Skipped: 0, Time elapsed: 0.785 sec - in org.apache.hadoop.yarn.server.nodemanager.containermanager.linux.resources.TestTrafficControlBandwidthHandlerImpl
Java HotSpot(TM) 64-Bit Server VM warning: ignoring option MaxPermSize=768m; support was removed
in 8.0
Running org.apache.hadoop.yarn.server.nodemanager.containermanager.linux.resources.TestResourceHandlerModule
Tests run: 2, Failures: 0, Errors: 0, Skipped: 0, Time elapsed: 0.538 sec - in org.apache.hadoop.yarn.server.nodemanager.containermanager.linux.resources.TestResourceHandlerModule
Java HotSpot(TM) 64-Bit Server VM warning: ignoring option MaxPermSize=768m; support was removed
in 8.0
Running org.apache.hadoop.yarn.server.nodemanager.containermanager.linux.resources.TestCGroupsHandlerImpl
Tests run: 4, Failures: 0, Errors: 0, Skipped: 0, Time elapsed: 0.679 sec - in org.apache.hadoop.yarn.server.nodemanager.containermanager.linux.resources.TestCGroupsHandlerImpl
Java HotSpot(TM) 64-Bit Server VM warning: ignoring option MaxPermSize=768m; support was removed
in 8.0
Running org.apache.hadoop.yarn.server.nodemanager.containermanager.TestAuxServices
Tests run: 6, Failures: 0, Errors: 0, Skipped: 0, Time elapsed: 0.848 sec - in org.apache.hadoop.yarn.server.nodemanager.containermanager.TestAuxServices
Java HotSpot(TM) 64-Bit Server VM warning: ignoring option MaxPermSize=768m; support was removed
in 8.0
Running org.apache.hadoop.yarn.server.nodemanager.containermanager.TestContainerManagerRecovery
Tests run: 3, Failures: 0, Errors: 0, Skipped: 0, Time elapsed: 31.719 sec - in org.apache.hadoop.yarn.server.nodemanager.containermanager.TestContainerManagerRecovery
Java HotSpot(TM) 64-Bit Server VM warning: ignoring option MaxPermSize=768m; support was removed
in 8.0
Running org.apache.hadoop.yarn.server.nodemanager.containermanager.TestContainerManager
Tests run: 16, Failures: 0, Errors: 0, Skipped: 0, Time elapsed: 38.651 sec - in org.apache.hadoop.yarn.server.nodemanager.containermanager.TestContainerManager
Java HotSpot(TM) 64-Bit Server VM warning: ignoring option MaxPermSize=768m; support was removed
in 8.0
Running org.apache.hadoop.yarn.server.nodemanager.containermanager.application.TestApplication
Tests run: 8, Failures: 0, Errors: 0, Skipped: 0, Time elapsed: 5.273 sec - in org.apache.hadoop.yarn.server.nodemanager.containermanager.application.TestApplication
Java HotSpot(TM) 64-Bit Server VM warning: ignoring option MaxPermSize=768m; support was removed
in 8.0
Running org.apache.hadoop.yarn.server.nodemanager.containermanager.TestNMProxy
Tests run: 2, Failures: 0, Errors: 0, Skipped: 0, Time elapsed: 3.981 sec - in org.apache.hadoop.yarn.server.nodemanager.containermanager.TestNMProxy
Java HotSpot(TM) 64-Bit Server VM warning: ignoring option MaxPermSize=768m; support was removed
in 8.0
Running org.apache.hadoop.yarn.server.nodemanager.containermanager.monitor.TestContainerMetrics
Tests run: 3, Failures: 0, Errors: 0, Skipped: 0, Time elapsed: 1.318 sec - in org.apache.hadoop.yarn.server.nodemanager.containermanager.monitor.TestContainerMetrics
Java HotSpot(TM) 64-Bit Server VM warning: ignoring option MaxPermSize=768m; support was removed
in 8.0
Running org.apache.hadoop.yarn.server.nodemanager.containermanager.monitor.TestContainersMonitor
Tests run: 3, Failures: 0, Errors: 0, Skipped: 0, Time elapsed: 7.011 sec - in org.apache.hadoop.yarn.server.nodemanager.containermanager.monitor.TestContainersMonitor
Java HotSpot(TM) 64-Bit Server VM warning: ignoring option MaxPermSize=768m; support was removed
in 8.0
Running org.apache.hadoop.yarn.server.nodemanager.containermanager.monitor.TestContainersMonitorResourceChange
Tests run: 2, Failures: 0, Errors: 0, Skipped: 0, Time elapsed: 2.534 sec - in org.apache.hadoop.yarn.server.nodemanager.containermanager.monitor.TestContainersMonitorResourceChange
Java HotSpot(TM) 64-Bit Server VM warning: ignoring option MaxPermSize=768m; support was removed
in 8.0
Running org.apache.hadoop.yarn.server.nodemanager.containermanager.launcher.TestContainerLaunch
Tests run: 17, Failures: 0, Errors: 0, Skipped: 5, Time elapsed: 20.526 sec - in org.apache.hadoop.yarn.server.nodemanager.containermanager.launcher.TestContainerLaunch
Java HotSpot(TM) 64-Bit Server VM warning: ignoring option MaxPermSize=768m; support was removed
in 8.0
Running org.apache.hadoop.yarn.server.nodemanager.containermanager.loghandler.TestNonAggregatingLogHandler
Tests run: 6, Failures: 0, Errors: 0, Skipped: 0, Time elapsed: 1.506 sec - in org.apache.hadoop.yarn.server.nodemanager.containermanager.loghandler.TestNonAggregatingLogHandler
Java HotSpot(TM) 64-Bit Server VM warning: ignoring option MaxPermSize=768m; support was removed
in 8.0
Running org.apache.hadoop.yarn.server.nodemanager.containermanager.container.TestContainer
Tests run: 18, Failures: 0, Errors: 0, Skipped: 0, Time elapsed: 2.409 sec - in org.apache.hadoop.yarn.server.nodemanager.containermanager.container.TestContainer
Java HotSpot(TM) 64-Bit Server VM warning: ignoring option MaxPermSize=768m; support was removed
in 8.0
Running org.apache.hadoop.yarn.server.nodemanager.containermanager.localizer.TestLocalCacheDirectoryManager
Tests run: 5, Failures: 0, Errors: 0, Skipped: 0, Time elapsed: 1.42 sec - in org.apache.hadoop.yarn.server.nodemanager.containermanager.localizer.TestLocalCacheDirectoryManager
Java HotSpot(TM) 64-Bit Server VM warning: ignoring option MaxPermSize=768m; support was removed
in 8.0
Running org.apache.hadoop.yarn.server.nodemanager.containermanager.localizer.TestResourceLocalizationService
Tests run: 13, Failures: 0, Errors: 0, Skipped: 0, Time elapsed: 6.879 sec - in org.apache.hadoop.yarn.server.nodemanager.containermanager.localizer.TestResourceLocalizationService
Java HotSpot(TM) 64-Bit Server VM warning: ignoring option MaxPermSize=768m; support was removed
in 8.0
Running org.apache.hadoop.yarn.server.nodemanager.containermanager.localizer.TestLocalResourcesTrackerImpl
Tests run: 10, Failures: 0, Errors: 0, Skipped: 0, Time elapsed: 1.286 sec - in org.apache.hadoop.yarn.server.nodemanager.containermanager.localizer.TestLocalResourcesTrackerImpl
Java HotSpot(TM) 64-Bit Server VM warning: ignoring option MaxPermSize=768m; support was removed
in 8.0
Running org.apache.hadoop.yarn.server.nodemanager.containermanager.localizer.TestLocalizedResource
Tests run: 1, Failures: 0, Errors: 0, Skipped: 0, Time elapsed: 0.611 sec - in org.apache.hadoop.yarn.server.nodemanager.containermanager.localizer.TestLocalizedResource
Java HotSpot(TM) 64-Bit Server VM warning: ignoring option MaxPermSize=768m; support was removed
in 8.0
Running org.apache.hadoop.yarn.server.nodemanager.containermanager.localizer.sharedcache.TestSharedCacheUploadService
Tests run: 2, Failures: 0, Errors: 0, Skipped: 0, Time elapsed: 0.852 sec - in org.apache.hadoop.yarn.server.nodemanager.containermanager.localizer.sharedcache.TestSharedCacheUploadService
Java HotSpot(TM) 64-Bit Server VM warning: ignoring option MaxPermSize=768m; support was removed
in 8.0
Running org.apache.hadoop.yarn.server.nodemanager.containermanager.localizer.sharedcache.TestSharedCacheUploader
Tests run: 6, Failures: 0, Errors: 0, Skipped: 0, Time elapsed: 1.014 sec - in org.apache.hadoop.yarn.server.nodemanager.containermanager.localizer.sharedcache.TestSharedCacheUploader
Java HotSpot(TM) 64-Bit Server VM warning: ignoring option MaxPermSize=768m; support was removed
in 8.0
Running org.apache.hadoop.yarn.server.nodemanager.containermanager.localizer.TestContainerLocalizer
Tests run: 3, Failures: 0, Errors: 0, Skipped: 0, Time elapsed: 1.436 sec - in org.apache.hadoop.yarn.server.nodemanager.containermanager.localizer.TestContainerLocalizer
Java HotSpot(TM) 64-Bit Server VM warning: ignoring option MaxPermSize=768m; support was removed
in 8.0
Running org.apache.hadoop.yarn.server.nodemanager.containermanager.localizer.TestLocalResource
Tests run: 2, Failures: 0, Errors: 0, Skipped: 0, Time elapsed: 0.459 sec - in org.apache.hadoop.yarn.server.nodemanager.containermanager.localizer.TestLocalResource
Java HotSpot(TM) 64-Bit Server VM warning: ignoring option MaxPermSize=768m; support was removed
in 8.0
Running org.apache.hadoop.yarn.server.nodemanager.containermanager.localizer.TestResourceRetention
Tests run: 1, Failures: 0, Errors: 0, Skipped: 0, Time elapsed: 0.893 sec - in org.apache.hadoop.yarn.server.nodemanager.containermanager.localizer.TestResourceRetention
Java HotSpot(TM) 64-Bit Server VM warning: ignoring option MaxPermSize=768m; support was removed
in 8.0
Running org.apache.hadoop.yarn.server.nodemanager.TestNodeStatusUpdater
Tests run: 16, Failures: 0, Errors: 0, Skipped: 0, Time elapsed: 69.781 sec - in org.apache.hadoop.yarn.server.nodemanager.TestNodeStatusUpdater
Java HotSpot(TM) 64-Bit Server VM warning: ignoring option MaxPermSize=768m; support was removed
in 8.0
Running org.apache.hadoop.yarn.server.nodemanager.TestDefaultContainerExecutor
Tests run: 3, Failures: 0, Errors: 0, Skipped: 0, Time elapsed: 11.642 sec - in org.apache.hadoop.yarn.server.nodemanager.TestDefaultContainerExecutor
Java HotSpot(TM) 64-Bit Server VM warning: ignoring option MaxPermSize=768m; support was removed
in 8.0
Running org.apache.hadoop.yarn.server.nodemanager.amrmproxy.TestAMRMProxyService
Tests run: 16, Failures: 0, Errors: 0, Skipped: 0, Time elapsed: 1.647 sec - in org.apache.hadoop.yarn.server.nodemanager.amrmproxy.TestAMRMProxyService
Java HotSpot(TM) 64-Bit Server VM warning: ignoring option MaxPermSize=768m; support was removed
in 8.0
Running org.apache.hadoop.yarn.server.nodemanager.TestNodeResourceMonitor
Tests run: 1, Failures: 0, Errors: 0, Skipped: 0, Time elapsed: 1.758 sec - in org.apache.hadoop.yarn.server.nodemanager.TestNodeResourceMonitor
Java HotSpot(TM) 64-Bit Server VM warning: ignoring option MaxPermSize=768m; support was removed
in 8.0
Running org.apache.hadoop.yarn.server.nodemanager.recovery.TestNMLeveldbStateStoreService
Tests run: 12, Failures: 0, Errors: 0, Skipped: 0, Time elapsed: 8.413 sec - in org.apache.hadoop.yarn.server.nodemanager.recovery.TestNMLeveldbStateStoreService
Java HotSpot(TM) 64-Bit Server VM warning: ignoring option MaxPermSize=768m; support was removed
in 8.0
Running org.apache.hadoop.yarn.server.nodemanager.util.TestCgroupsLCEResourcesHandler
Tests run: 5, Failures: 0, Errors: 0, Skipped: 0, Time elapsed: 1.065 sec - in org.apache.hadoop.yarn.server.nodemanager.util.TestCgroupsLCEResourcesHandler
Java HotSpot(TM) 64-Bit Server VM warning: ignoring option MaxPermSize=768m; support was removed
in 8.0
Running org.apache.hadoop.yarn.server.nodemanager.util.TestProcessIdFileReader
Tests run: 3, Failures: 0, Errors: 0, Skipped: 0, Time elapsed: 0.192 sec - in org.apache.hadoop.yarn.server.nodemanager.util.TestProcessIdFileReader
Java HotSpot(TM) 64-Bit Server VM warning: ignoring option MaxPermSize=768m; support was removed
in 8.0
Running org.apache.hadoop.yarn.server.nodemanager.util.TestNodeManagerHardwareUtils
Tests run: 3, Failures: 0, Errors: 0, Skipped: 0, Time elapsed: 0.638 sec - in org.apache.hadoop.yarn.server.nodemanager.util.TestNodeManagerHardwareUtils
Java HotSpot(TM) 64-Bit Server VM warning: ignoring option MaxPermSize=768m; support was removed
in 8.0
Running org.apache.hadoop.yarn.server.nodemanager.TestDirectoryCollection
Tests run: 7, Failures: 0, Errors: 0, Skipped: 0, Time elapsed: 0.712 sec - in org.apache.hadoop.yarn.server.nodemanager.TestDirectoryCollection
Java HotSpot(TM) 64-Bit Server VM warning: ignoring option MaxPermSize=768m; support was removed
in 8.0
Running org.apache.hadoop.yarn.server.nodemanager.TestDeletionService
Tests run: 6, Failures: 0, Errors: 0, Skipped: 0, Time elapsed: 23.179 sec - in org.apache.hadoop.yarn.server.nodemanager.TestDeletionService
Java HotSpot(TM) 64-Bit Server VM warning: ignoring option MaxPermSize=768m; support was removed
in 8.0
Running org.apache.hadoop.yarn.server.nodemanager.TestDockerContainerExecutorWithMocks
Tests run: 4, Failures: 0, Errors: 0, Skipped: 0, Time elapsed: 1.188 sec - in org.apache.hadoop.yarn.server.nodemanager.TestDockerContainerExecutorWithMocks
Java HotSpot(TM) 64-Bit Server VM warning: ignoring option MaxPermSize=768m; support was removed
in 8.0
Running org.apache.hadoop.yarn.server.nodemanager.TestNodeManagerShutdown
Tests run: 2, Failures: 0, Errors: 0, Skipped: 0, Time elapsed: 6.113 sec - in org.apache.hadoop.yarn.server.nodemanager.TestNodeManagerShutdown

Results :

Tests in error: 
  TestLogAggregationService.testAddNewTokenSentFromRMForLogAggregation:2111 NoClassDefFound

Tests run: 384, Failures: 0, Errors: 1, Skipped: 17

[INFO] ------------------------------------------------------------------------
[INFO] Reactor Summary:
[INFO] 
[INFO] Apache Hadoop YARN ................................ SUCCESS [  3.243 s]
[INFO] Apache Hadoop YARN API ............................ SUCCESS [01:14 min]
[INFO] Apache Hadoop YARN Common ......................... SUCCESS [02:19 min]
[INFO] Apache Hadoop YARN Server ......................... SUCCESS [  0.059 s]
[INFO] Apache Hadoop YARN Server Common .................. SUCCESS [ 35.950 s]
[INFO] Apache Hadoop YARN NodeManager .................... FAILURE [08:36 min]
[INFO] Apache Hadoop YARN Web Proxy ...................... SKIPPED
[INFO] Apache Hadoop YARN ApplicationHistoryService ...... SKIPPED
[INFO] Apache Hadoop YARN ResourceManager ................ SKIPPED
[INFO] Apache Hadoop YARN Server Tests ................... SKIPPED
[INFO] Apache Hadoop YARN Client ......................... SKIPPED
[INFO] Apache Hadoop YARN SharedCacheManager ............. SKIPPED
[INFO] Apache Hadoop YARN Applications ................... SKIPPED
[INFO] Apache Hadoop YARN DistributedShell ............... SKIPPED
[INFO] Apache Hadoop YARN Unmanaged Am Launcher .......... SKIPPED
[INFO] Apache Hadoop YARN Site ........................... SKIPPED
[INFO] Apache Hadoop YARN Registry ....................... SKIPPED
[INFO] Apache Hadoop YARN Project ........................ SKIPPED
[INFO] ------------------------------------------------------------------------
[INFO] BUILD FAILURE
[INFO] ------------------------------------------------------------------------
[INFO] Total time: 12:50 min
[INFO] Finished at: 2015-10-06T10:51:11+00:00
[INFO] Final Memory: 89M/1108M
[INFO] ------------------------------------------------------------------------
[ERROR] Failed to execute goal org.apache.maven.plugins:maven-surefire-plugin:2.17:test (default-test)
on project hadoop-yarn-server-nodemanager: There are test failures.
[ERROR] 
[ERROR] Please refer to <https://builds.apache.org/job/Hadoop-Yarn-trunk-Java8/ws/hadoop-yarn-project/hadoop-yarn/hadoop-yarn-server/hadoop-yarn-server-nodemanager/target/surefire-reports>
for the individual test results.
[ERROR] -> [Help 1]
[ERROR] 
[ERROR] To see the full stack trace of the errors, re-run Maven with the -e switch.
[ERROR] Re-run Maven using the -X switch to enable full debug logging.
[ERROR] 
[ERROR] For more information about the errors and possible solutions, please read the following
articles:
[ERROR] [Help 1] http://cwiki.apache.org/confluence/display/MAVEN/MojoFailureException
[ERROR] 
[ERROR] After correcting the problems, you can resume the build with the command
[ERROR]   mvn <goals> -rf :hadoop-yarn-server-nodemanager
Build step 'Execute shell' marked build as failure
Archiving artifacts
Recording test results
Updating HDFS-7899

Mime
View raw message