hadoop-yarn-dev mailing list archives

Site index · List index
Message view « Date » · « Thread »
Top « Date » · « Thread »
From Apache Jenkins Server <jenk...@builds.apache.org>
Subject Hadoop-Yarn-trunk-Java8 - Build # 600 - Still Failing
Date Tue, 27 Oct 2015 02:04:08 GMT
See https://builds.apache.org/job/Hadoop-Yarn-trunk-Java8/600/

###################################################################################
########################## LAST 60 LINES OF THE CONSOLE ###########################
[...truncated 4642 lines...]


Tests run: 392, Failures: 1, Errors: 0, Skipped: 17

[INFO] ------------------------------------------------------------------------
[INFO] Reactor Summary:
[INFO] 
[INFO] Apache Hadoop YARN ................................ SUCCESS [  5.334 s]
[INFO] Apache Hadoop YARN API ............................ SUCCESS [02:00 min]
[INFO] Apache Hadoop YARN Common ......................... SUCCESS [03:20 min]
[INFO] Apache Hadoop YARN Server ......................... SUCCESS [  0.223 s]
[INFO] Apache Hadoop YARN Server Common .................. SUCCESS [ 56.596 s]
[INFO] Apache Hadoop YARN NodeManager .................... FAILURE [10:19 min]
[INFO] Apache Hadoop YARN Web Proxy ...................... SKIPPED
[INFO] Apache Hadoop YARN ApplicationHistoryService ...... SKIPPED
[INFO] Apache Hadoop YARN ResourceManager ................ SKIPPED
[INFO] Apache Hadoop YARN Server Tests ................... SKIPPED
[INFO] Apache Hadoop YARN Client ......................... SKIPPED
[INFO] Apache Hadoop YARN SharedCacheManager ............. SKIPPED
[INFO] Apache Hadoop YARN Applications ................... SKIPPED
[INFO] Apache Hadoop YARN DistributedShell ............... SKIPPED
[INFO] Apache Hadoop YARN Unmanaged Am Launcher .......... SKIPPED
[INFO] Apache Hadoop YARN Site ........................... SKIPPED
[INFO] Apache Hadoop YARN Registry ....................... SKIPPED
[INFO] Apache Hadoop YARN Project ........................ SKIPPED
[INFO] ------------------------------------------------------------------------
[INFO] BUILD FAILURE
[INFO] ------------------------------------------------------------------------
[INFO] Total time: 16:44 min
[INFO] Finished at: 2015-10-27T02:05:00+00:00
[INFO] Final Memory: 81M/1104M
[INFO] ------------------------------------------------------------------------
[ERROR] Failed to execute goal org.apache.maven.plugins:maven-surefire-plugin:2.17:test (default-test)
on project hadoop-yarn-server-nodemanager: There are test failures.
[ERROR] 
[ERROR] Please refer to /home/jenkins/jenkins-slave/workspace/Hadoop-Yarn-trunk-Java8/hadoop-yarn-project/hadoop-yarn/hadoop-yarn-server/hadoop-yarn-server-nodemanager/target/surefire-reports
for the individual test results.
[ERROR] -> [Help 1]
[ERROR] 
[ERROR] To see the full stack trace of the errors, re-run Maven with the -e switch.
[ERROR] Re-run Maven using the -X switch to enable full debug logging.
[ERROR] 
[ERROR] For more information about the errors and possible solutions, please read the following
articles:
[ERROR] [Help 1] http://cwiki.apache.org/confluence/display/MAVEN/MojoFailureException
[ERROR] 
[ERROR] After correcting the problems, you can resume the build with the command
[ERROR]   mvn <goals> -rf :hadoop-yarn-server-nodemanager
Build step 'Execute shell' marked build as failure
Archiving artifacts
Recording test results
Updating HDFS-9292
Updating HDFS-9291
Updating YARN-4169
Updating YARN-3216
Updating HDFS-9305
Updating HDFS-8945
Updating YARN-4300
Updating HDFS-9284
Sending e-mails to: yarn-dev@hadoop.apache.org
Email was triggered for: Failure - Any
Sending email for trigger: Failure - Any



###################################################################################
############################## FAILED TESTS (if any) ##############################
1 tests failed.
FAILED:  org.apache.hadoop.yarn.server.nodemanager.containermanager.localizer.TestResourceLocalizationService.testFailedDirsResourceRelease

Error Message:

Argument(s) are different! Wanted:
eventHandler.handle(
    <custom argument matcher>
);
-> at org.apache.hadoop.yarn.server.nodemanager.containermanager.localizer.TestResourceLocalizationService.testFailedDirsResourceRelease(TestResourceLocalizationService.java:2333)
Actual invocation has different arguments:
eventHandler.handle(
    EventType: APPLICATION_INITED
);
-> at org.apache.hadoop.yarn.event.AsyncDispatcher.dispatch(AsyncDispatcher.java:183)


Stack Trace:
org.mockito.exceptions.verification.junit.ArgumentsAreDifferent: 
Argument(s) are different! Wanted:
eventHandler.handle(
    <custom argument matcher>
);
-> at org.apache.hadoop.yarn.server.nodemanager.containermanager.localizer.TestResourceLocalizationService.testFailedDirsResourceRelease(TestResourceLocalizationService.java:2333)
Actual invocation has different arguments:
eventHandler.handle(
    EventType: APPLICATION_INITED
);
-> at org.apache.hadoop.yarn.event.AsyncDispatcher.dispatch(AsyncDispatcher.java:183)

	at sun.reflect.NativeConstructorAccessorImpl.newInstance0(Native Method)
	at sun.reflect.NativeConstructorAccessorImpl.newInstance(NativeConstructorAccessorImpl.java:62)
	at sun.reflect.DelegatingConstructorAccessorImpl.newInstance(DelegatingConstructorAccessorImpl.java:45)
	at java.lang.reflect.Constructor.newInstance(Constructor.java:408)
	at org.apache.hadoop.yarn.server.nodemanager.containermanager.localizer.TestResourceLocalizationService.testFailedDirsResourceRelease(TestResourceLocalizationService.java:2333)



Mime
  • Unnamed multipart/mixed (inline, None, 0 bytes)
View raw message