hadoop-yarn-dev mailing list archives

Site index · List index
Message view « Date » · « Thread »
Top « Date » · « Thread »
From Apache Jenkins Server <jenk...@builds.apache.org>
Subject Build failed in Jenkins: Hadoop-Yarn-trunk #1282
Date Sun, 18 Oct 2015 12:29:30 GMT
See <https://builds.apache.org/job/Hadoop-Yarn-trunk/1282/changes>

Changes:

[stevel] HADOOP-11628. SPNEGO auth does not work with CNAMEs in JDK8.  (Daryn

------------------------------------------
[...truncated 11210 lines...]
	at org.apache.hadoop.service.CompositeService.stop(CompositeService.java:157)
	at org.apache.hadoop.service.CompositeService.serviceStop(CompositeService.java:131)
	at org.apache.hadoop.service.AbstractService.stop(AbstractService.java:221)
	at org.apache.hadoop.yarn.applications.distributedshell.TestDistributedShell.tearDown(TestDistributedShell.java:128)

testDSAttemptFailuresValidityIntervalSucess(org.apache.hadoop.yarn.applications.distributedshell.TestDistributedShell)
 Time elapsed: 6.185 sec  <<< ERROR!
java.lang.NoClassDefFoundError: org/apache/hadoop/security/token/delegation/web/DelegationTokenAuthenticator
	at java.net.URLClassLoader$1.run(URLClassLoader.java:366)
	at java.net.URLClassLoader$1.run(URLClassLoader.java:355)
	at java.security.AccessController.doPrivileged(Native Method)
	at java.net.URLClassLoader.findClass(URLClassLoader.java:354)
	at java.lang.ClassLoader.loadClass(ClassLoader.java:425)
	at sun.misc.Launcher$AppClassLoader.loadClass(Launcher.java:308)
	at java.lang.ClassLoader.loadClass(ClassLoader.java:358)
	at org.apache.hadoop.yarn.client.api.TimelineClient.createTimelineClient(TimelineClient.java:55)
	at org.apache.hadoop.yarn.client.api.impl.YarnClientImpl.createTimelineClient(YarnClientImpl.java:187)
	at org.apache.hadoop.yarn.client.api.impl.YarnClientImpl.serviceInit(YarnClientImpl.java:174)
	at org.apache.hadoop.service.AbstractService.init(AbstractService.java:163)
	at org.apache.hadoop.yarn.applications.distributedshell.Client.<init>(Client.java:240)
	at org.apache.hadoop.yarn.applications.distributedshell.TestDistributedShell.testDSAttemptFailuresValidityIntervalSucess(TestDistributedShell.java:391)

testDSAttemptFailuresValidityIntervalSucess(org.apache.hadoop.yarn.applications.distributedshell.TestDistributedShell)
 Time elapsed: 6.185 sec  <<< ERROR!
java.lang.NoClassDefFoundError: org/apache/hadoop/service/ServiceOperations
	at org.apache.hadoop.service.CompositeService.stop(CompositeService.java:157)
	at org.apache.hadoop.service.CompositeService.serviceStop(CompositeService.java:131)
	at org.apache.hadoop.service.AbstractService.stop(AbstractService.java:221)
	at org.apache.hadoop.yarn.applications.distributedshell.TestDistributedShell.tearDown(TestDistributedShell.java:128)

testDSShellWithDomain(org.apache.hadoop.yarn.applications.distributedshell.TestDistributedShell)
 Time elapsed: 6.165 sec  <<< ERROR!
java.lang.NoClassDefFoundError: org/apache/hadoop/security/token/delegation/web/DelegationTokenAuthenticator
	at java.net.URLClassLoader$1.run(URLClassLoader.java:366)
	at java.net.URLClassLoader$1.run(URLClassLoader.java:355)
	at java.security.AccessController.doPrivileged(Native Method)
	at java.net.URLClassLoader.findClass(URLClassLoader.java:354)
	at java.lang.ClassLoader.loadClass(ClassLoader.java:425)
	at sun.misc.Launcher$AppClassLoader.loadClass(Launcher.java:308)
	at java.lang.ClassLoader.loadClass(ClassLoader.java:358)
	at org.apache.hadoop.yarn.client.api.TimelineClient.createTimelineClient(TimelineClient.java:55)
	at org.apache.hadoop.yarn.client.api.impl.YarnClientImpl.createTimelineClient(YarnClientImpl.java:187)
	at org.apache.hadoop.yarn.client.api.impl.YarnClientImpl.serviceInit(YarnClientImpl.java:174)
	at org.apache.hadoop.service.AbstractService.init(AbstractService.java:163)
	at org.apache.hadoop.yarn.applications.distributedshell.Client.<init>(Client.java:240)
	at org.apache.hadoop.yarn.applications.distributedshell.Client.<init>(Client.java:231)
	at org.apache.hadoop.yarn.applications.distributedshell.TestDistributedShell.testDSShell(TestDistributedShell.java:184)
	at org.apache.hadoop.yarn.applications.distributedshell.TestDistributedShell.testDSShellWithDomain(TestDistributedShell.java:143)

testDSShellWithDomain(org.apache.hadoop.yarn.applications.distributedshell.TestDistributedShell)
 Time elapsed: 6.166 sec  <<< ERROR!
java.lang.NoClassDefFoundError: org/apache/hadoop/service/ServiceOperations
	at org.apache.hadoop.service.CompositeService.stop(CompositeService.java:157)
	at org.apache.hadoop.service.CompositeService.serviceStop(CompositeService.java:131)
	at org.apache.hadoop.service.AbstractService.stop(AbstractService.java:221)
	at org.apache.hadoop.yarn.applications.distributedshell.TestDistributedShell.tearDown(TestDistributedShell.java:128)

testDebugFlag(org.apache.hadoop.yarn.applications.distributedshell.TestDistributedShell) 
Time elapsed: 6.223 sec  <<< ERROR!
java.lang.NoClassDefFoundError: org/apache/hadoop/security/token/delegation/web/DelegationTokenAuthenticator
	at java.net.URLClassLoader$1.run(URLClassLoader.java:366)
	at java.net.URLClassLoader$1.run(URLClassLoader.java:355)
	at java.security.AccessController.doPrivileged(Native Method)
	at java.net.URLClassLoader.findClass(URLClassLoader.java:354)
	at java.lang.ClassLoader.loadClass(ClassLoader.java:425)
	at sun.misc.Launcher$AppClassLoader.loadClass(Launcher.java:308)
	at java.lang.ClassLoader.loadClass(ClassLoader.java:358)
	at org.apache.hadoop.yarn.client.api.TimelineClient.createTimelineClient(TimelineClient.java:55)
	at org.apache.hadoop.yarn.client.api.impl.YarnClientImpl.createTimelineClient(YarnClientImpl.java:187)
	at org.apache.hadoop.yarn.client.api.impl.YarnClientImpl.serviceInit(YarnClientImpl.java:174)
	at org.apache.hadoop.service.AbstractService.init(AbstractService.java:163)
	at org.apache.hadoop.yarn.applications.distributedshell.Client.<init>(Client.java:240)
	at org.apache.hadoop.yarn.applications.distributedshell.Client.<init>(Client.java:231)
	at org.apache.hadoop.yarn.applications.distributedshell.TestDistributedShell.testDebugFlag(TestDistributedShell.java:829)

testDebugFlag(org.apache.hadoop.yarn.applications.distributedshell.TestDistributedShell) 
Time elapsed: 6.223 sec  <<< ERROR!
java.lang.NoClassDefFoundError: org/apache/hadoop/service/ServiceOperations
	at org.apache.hadoop.service.CompositeService.stop(CompositeService.java:157)
	at org.apache.hadoop.service.CompositeService.serviceStop(CompositeService.java:131)
	at org.apache.hadoop.service.AbstractService.stop(AbstractService.java:221)
	at org.apache.hadoop.yarn.applications.distributedshell.TestDistributedShell.tearDown(TestDistributedShell.java:128)

testDSShellWithShellScript(org.apache.hadoop.yarn.applications.distributedshell.TestDistributedShell)
 Time elapsed: 6.197 sec  <<< ERROR!
java.lang.NoClassDefFoundError: org/apache/hadoop/security/token/delegation/web/DelegationTokenAuthenticator
	at java.net.URLClassLoader$1.run(URLClassLoader.java:366)
	at java.net.URLClassLoader$1.run(URLClassLoader.java:355)
	at java.security.AccessController.doPrivileged(Native Method)
	at java.net.URLClassLoader.findClass(URLClassLoader.java:354)
	at java.lang.ClassLoader.loadClass(ClassLoader.java:425)
	at sun.misc.Launcher$AppClassLoader.loadClass(Launcher.java:308)
	at java.lang.ClassLoader.loadClass(ClassLoader.java:358)
	at org.apache.hadoop.yarn.client.api.TimelineClient.createTimelineClient(TimelineClient.java:55)
	at org.apache.hadoop.yarn.client.api.impl.YarnClientImpl.createTimelineClient(YarnClientImpl.java:187)
	at org.apache.hadoop.yarn.client.api.impl.YarnClientImpl.serviceInit(YarnClientImpl.java:174)
	at org.apache.hadoop.service.AbstractService.init(AbstractService.java:163)
	at org.apache.hadoop.yarn.applications.distributedshell.Client.<init>(Client.java:240)
	at org.apache.hadoop.yarn.applications.distributedshell.Client.<init>(Client.java:231)
	at org.apache.hadoop.yarn.applications.distributedshell.TestDistributedShell.testDSShellWithShellScript(TestDistributedShell.java:606)

testDSShellWithShellScript(org.apache.hadoop.yarn.applications.distributedshell.TestDistributedShell)
 Time elapsed: 6.198 sec  <<< ERROR!
java.lang.NoClassDefFoundError: org/apache/hadoop/service/ServiceOperations
	at org.apache.hadoop.service.CompositeService.stop(CompositeService.java:157)
	at org.apache.hadoop.service.CompositeService.serviceStop(CompositeService.java:131)
	at org.apache.hadoop.service.AbstractService.stop(AbstractService.java:221)
	at org.apache.hadoop.yarn.applications.distributedshell.TestDistributedShell.tearDown(TestDistributedShell.java:128)

testDSRestartWithPreviousRunningContainers(org.apache.hadoop.yarn.applications.distributedshell.TestDistributedShell)
 Time elapsed: 6.22 sec  <<< ERROR!
java.lang.NoClassDefFoundError: org/apache/hadoop/security/token/delegation/web/DelegationTokenAuthenticator
	at java.net.URLClassLoader$1.run(URLClassLoader.java:366)
	at java.net.URLClassLoader$1.run(URLClassLoader.java:355)
	at java.security.AccessController.doPrivileged(Native Method)
	at java.net.URLClassLoader.findClass(URLClassLoader.java:354)
	at java.lang.ClassLoader.loadClass(ClassLoader.java:425)
	at sun.misc.Launcher$AppClassLoader.loadClass(Launcher.java:308)
	at java.lang.ClassLoader.loadClass(ClassLoader.java:358)
	at org.apache.hadoop.yarn.client.api.TimelineClient.createTimelineClient(TimelineClient.java:55)
	at org.apache.hadoop.yarn.client.api.impl.YarnClientImpl.createTimelineClient(YarnClientImpl.java:187)
	at org.apache.hadoop.yarn.client.api.impl.YarnClientImpl.serviceInit(YarnClientImpl.java:174)
	at org.apache.hadoop.service.AbstractService.init(AbstractService.java:163)
	at org.apache.hadoop.yarn.applications.distributedshell.Client.<init>(Client.java:240)
	at org.apache.hadoop.yarn.applications.distributedshell.TestDistributedShell.testDSRestartWithPreviousRunningContainers(TestDistributedShell.java:353)

testDSRestartWithPreviousRunningContainers(org.apache.hadoop.yarn.applications.distributedshell.TestDistributedShell)
 Time elapsed: 6.22 sec  <<< ERROR!
java.lang.NoClassDefFoundError: org/apache/hadoop/service/ServiceOperations
	at org.apache.hadoop.service.CompositeService.stop(CompositeService.java:157)
	at org.apache.hadoop.service.CompositeService.serviceStop(CompositeService.java:131)
	at org.apache.hadoop.service.AbstractService.stop(AbstractService.java:221)
	at org.apache.hadoop.yarn.applications.distributedshell.TestDistributedShell.tearDown(TestDistributedShell.java:128)

testDSShellWithCustomLogPropertyFile(org.apache.hadoop.yarn.applications.distributedshell.TestDistributedShell)
 Time elapsed: 6.253 sec  <<< ERROR!
java.lang.NoClassDefFoundError: org/apache/hadoop/security/token/delegation/web/DelegationTokenAuthenticator
	at java.net.URLClassLoader$1.run(URLClassLoader.java:366)
	at java.net.URLClassLoader$1.run(URLClassLoader.java:355)
	at java.security.AccessController.doPrivileged(Native Method)
	at java.net.URLClassLoader.findClass(URLClassLoader.java:354)
	at java.lang.ClassLoader.loadClass(ClassLoader.java:425)
	at sun.misc.Launcher$AppClassLoader.loadClass(Launcher.java:308)
	at java.lang.ClassLoader.loadClass(ClassLoader.java:358)
	at org.apache.hadoop.yarn.client.api.TimelineClient.createTimelineClient(TimelineClient.java:55)
	at org.apache.hadoop.yarn.client.api.impl.YarnClientImpl.createTimelineClient(YarnClientImpl.java:187)
	at org.apache.hadoop.yarn.client.api.impl.YarnClientImpl.serviceInit(YarnClientImpl.java:174)
	at org.apache.hadoop.service.AbstractService.init(AbstractService.java:163)
	at org.apache.hadoop.yarn.applications.distributedshell.Client.<init>(Client.java:240)
	at org.apache.hadoop.yarn.applications.distributedshell.Client.<init>(Client.java:231)
	at org.apache.hadoop.yarn.applications.distributedshell.TestDistributedShell.testDSShellWithCustomLogPropertyFile(TestDistributedShell.java:489)

testDSShellWithCustomLogPropertyFile(org.apache.hadoop.yarn.applications.distributedshell.TestDistributedShell)
 Time elapsed: 6.253 sec  <<< ERROR!
java.lang.NoClassDefFoundError: org/apache/hadoop/service/ServiceOperations
	at org.apache.hadoop.service.CompositeService.stop(CompositeService.java:157)
	at org.apache.hadoop.service.CompositeService.serviceStop(CompositeService.java:131)
	at org.apache.hadoop.service.AbstractService.stop(AbstractService.java:221)
	at org.apache.hadoop.yarn.applications.distributedshell.TestDistributedShell.tearDown(TestDistributedShell.java:128)

testContainerLaunchFailureHandling(org.apache.hadoop.yarn.applications.distributedshell.TestDistributedShell)
 Time elapsed: 6.261 sec  <<< ERROR!
java.lang.NoClassDefFoundError: org/apache/hadoop/security/token/delegation/web/DelegationTokenAuthenticator
	at java.net.URLClassLoader$1.run(URLClassLoader.java:366)
	at java.net.URLClassLoader$1.run(URLClassLoader.java:355)
	at java.security.AccessController.doPrivileged(Native Method)
	at java.net.URLClassLoader.findClass(URLClassLoader.java:354)
	at java.lang.ClassLoader.loadClass(ClassLoader.java:425)
	at sun.misc.Launcher$AppClassLoader.loadClass(Launcher.java:308)
	at java.lang.ClassLoader.loadClass(ClassLoader.java:358)
	at org.apache.hadoop.yarn.client.api.TimelineClient.createTimelineClient(TimelineClient.java:55)
	at org.apache.hadoop.yarn.client.api.impl.YarnClientImpl.createTimelineClient(YarnClientImpl.java:187)
	at org.apache.hadoop.yarn.client.api.impl.YarnClientImpl.serviceInit(YarnClientImpl.java:174)
	at org.apache.hadoop.service.AbstractService.init(AbstractService.java:163)
	at org.apache.hadoop.yarn.applications.distributedshell.Client.<init>(Client.java:240)
	at org.apache.hadoop.yarn.applications.distributedshell.TestDistributedShell.testContainerLaunchFailureHandling(TestDistributedShell.java:796)

testContainerLaunchFailureHandling(org.apache.hadoop.yarn.applications.distributedshell.TestDistributedShell)
 Time elapsed: 6.261 sec  <<< ERROR!
java.lang.NoClassDefFoundError: org/apache/hadoop/service/ServiceOperations
	at org.apache.hadoop.service.CompositeService.stop(CompositeService.java:157)
	at org.apache.hadoop.service.CompositeService.serviceStop(CompositeService.java:131)
	at org.apache.hadoop.service.AbstractService.stop(AbstractService.java:221)
	at org.apache.hadoop.yarn.applications.distributedshell.TestDistributedShell.tearDown(TestDistributedShell.java:128)

Running org.apache.hadoop.yarn.applications.distributedshell.TestDistributedShellWithNodeLabels
Tests run: 1, Failures: 0, Errors: 0, Skipped: 0, Time elapsed: 37.044 sec - in org.apache.hadoop.yarn.applications.distributedshell.TestDistributedShellWithNodeLabels
Running org.apache.hadoop.yarn.applications.distributedshell.TestDSAppMaster
Tests run: 2, Failures: 0, Errors: 0, Skipped: 0, Time elapsed: 2.403 sec - in org.apache.hadoop.yarn.applications.distributedshell.TestDSAppMaster

Results :

Tests in error: 
  TestDistributedShell.testDSShellWithInvalidArgs:620 » NoClassDefFound org/apac...
  TestDistributedShell.tearDown:128 » NoClassDefFound org/apache/hadoop/service/...
  TestDistributedShell.testDSShellWithoutDomain:148->testDSShell:184 » NoClassDefFound
  TestDistributedShell.tearDown:128 » NoClassDefFound org/apache/hadoop/service/...
  TestDistributedShell.testDSAttemptFailuresValidityIntervalFailed:429 » NoClassDefFound
  TestDistributedShell.tearDown:128 » NoClassDefFound org/apache/hadoop/service/...
  TestDistributedShell.testDSShellWithMultipleArgs:558 » NoClassDefFound org/apa...
  TestDistributedShell.tearDown:128 » NoClassDefFound org/apache/hadoop/service/...
  TestDistributedShell.testDSAttemptFailuresValidityIntervalSucess:391 » NoClassDefFound
  TestDistributedShell.tearDown:128 » NoClassDefFound org/apache/hadoop/service/...
  TestDistributedShell.testDSShellWithDomain:143->testDSShell:184 » NoClassDefFound
  TestDistributedShell.tearDown:128 » NoClassDefFound org/apache/hadoop/service/...
  TestDistributedShell.testDebugFlag:829 » NoClassDefFound org/apache/hadoop/sec...
  TestDistributedShell.tearDown:128 » NoClassDefFound org/apache/hadoop/service/...
  TestDistributedShell.testDSShellWithShellScript:606 » NoClassDefFound org/apac...
  TestDistributedShell.tearDown:128 » NoClassDefFound org/apache/hadoop/service/...
  TestDistributedShell.testDSRestartWithPreviousRunningContainers:353 » NoClassDefFound
  TestDistributedShell.tearDown:128 » NoClassDefFound org/apache/hadoop/service/...
  TestDistributedShell.testDSShellWithCustomLogPropertyFile:489 » NoClassDefFound
  TestDistributedShell.tearDown:128 » NoClassDefFound org/apache/hadoop/service/...
  TestDistributedShell.testContainerLaunchFailureHandling:796 » NoClassDefFound ...
  TestDistributedShell.tearDown:128 » NoClassDefFound org/apache/hadoop/service/...

Tests run: 25, Failures: 0, Errors: 22, Skipped: 0

[INFO] ------------------------------------------------------------------------
[INFO] Reactor Summary:
[INFO] 
[INFO] Apache Hadoop YARN ................................ SUCCESS [  3.918 s]
[INFO] Apache Hadoop YARN API ............................ SUCCESS [04:10 min]
[INFO] Apache Hadoop YARN Common ......................... SUCCESS [03:01 min]
[INFO] Apache Hadoop YARN Server ......................... SUCCESS [  0.091 s]
[INFO] Apache Hadoop YARN Server Common .................. SUCCESS [ 46.385 s]
[INFO] Apache Hadoop YARN NodeManager .................... SUCCESS [09:13 min]
[INFO] Apache Hadoop YARN Web Proxy ...................... SUCCESS [ 25.743 s]
[INFO] Apache Hadoop YARN ApplicationHistoryService ...... SUCCESS [03:22 min]
[INFO] Apache Hadoop YARN ResourceManager ................ SUCCESS [58:41 min]
[INFO] Apache Hadoop YARN Server Tests ................... SUCCESS [01:54 min]
[INFO] Apache Hadoop YARN Client ......................... SUCCESS [07:06 min]
[INFO] Apache Hadoop YARN SharedCacheManager ............. SUCCESS [ 27.158 s]
[INFO] Apache Hadoop YARN Applications ................... SUCCESS [  0.054 s]
[INFO] Apache Hadoop YARN DistributedShell ............... FAILURE [01:52 min]
[INFO] Apache Hadoop YARN Unmanaged Am Launcher .......... SKIPPED
[INFO] Apache Hadoop YARN Site ........................... SKIPPED
[INFO] Apache Hadoop YARN Registry ....................... SKIPPED
[INFO] Apache Hadoop YARN Project ........................ SKIPPED
[INFO] ------------------------------------------------------------------------
[INFO] BUILD FAILURE
[INFO] ------------------------------------------------------------------------
[INFO] Total time: 01:31 h
[INFO] Finished at: 2015-10-18T12:30:13+00:00
[INFO] Final Memory: 83M/826M
[INFO] ------------------------------------------------------------------------
[ERROR] Failed to execute goal org.apache.maven.plugins:maven-surefire-plugin:2.17:test (default-test)
on project hadoop-yarn-applications-distributedshell: There are test failures.
[ERROR] 
[ERROR] Please refer to <https://builds.apache.org/job/Hadoop-Yarn-trunk/ws/hadoop-yarn-project/hadoop-yarn/hadoop-yarn-applications/hadoop-yarn-applications-distributedshell/target/surefire-reports>
for the individual test results.
[ERROR] -> [Help 1]
[ERROR] 
[ERROR] To see the full stack trace of the errors, re-run Maven with the -e switch.
[ERROR] Re-run Maven using the -X switch to enable full debug logging.
[ERROR] 
[ERROR] For more information about the errors and possible solutions, please read the following
articles:
[ERROR] [Help 1] http://cwiki.apache.org/confluence/display/MAVEN/MojoFailureException
[ERROR] 
[ERROR] After correcting the problems, you can resume the build with the command
[ERROR]   mvn <goals> -rf :hadoop-yarn-applications-distributedshell
Build step 'Execute shell' marked build as failure
Archiving artifacts
Recording test results
Updating HADOOP-11628

Mime
View raw message