hadoop-yarn-dev mailing list archives

Site index · List index
Message view « Date » · « Thread »
Top « Date » · « Thread »
From Apache Jenkins Server <jenk...@builds.apache.org>
Subject Build failed in Jenkins: Hadoop-Yarn-trunk #1344
Date Fri, 30 Oct 2015 21:55:24 GMT
See <https://builds.apache.org/job/Hadoop-Yarn-trunk/1344/changes>

Changes:

[aw] HADOOP-12133 Add schemas to Maven Assembly XMLs

[kihwal] MAPREDUCE-6451. DistCp has incorrect chunkFilePath for multiple jobs

------------------------------------------
[...truncated 10113 lines...]
[INFO] 
[INFO] --- findbugs-maven-plugin:3.0.0:findbugs (default-cli) @ hadoop-yarn-applications ---
[INFO]                                                                         
[INFO] ------------------------------------------------------------------------
[INFO] Building Apache Hadoop YARN DistributedShell 3.0.0-SNAPSHOT
[INFO] ------------------------------------------------------------------------
[INFO] 
[INFO] --- maven-clean-plugin:2.5:clean (default-clean) @ hadoop-yarn-applications-distributedshell
---
[INFO] Deleting <https://builds.apache.org/job/Hadoop-Yarn-trunk/ws/hadoop-yarn-project/hadoop-yarn/hadoop-yarn-applications/hadoop-yarn-applications-distributedshell/target>
[INFO] 
[INFO] --- maven-antrun-plugin:1.7:run (create-testdirs) @ hadoop-yarn-applications-distributedshell
---
[INFO] Executing tasks

main:
    [mkdir] Created dir: <https://builds.apache.org/job/Hadoop-Yarn-trunk/ws/hadoop-yarn-project/hadoop-yarn/hadoop-yarn-applications/hadoop-yarn-applications-distributedshell/target/test-dir>
[INFO] Executed tasks
[INFO] 
[INFO] --- maven-resources-plugin:2.6:resources (default-resources) @ hadoop-yarn-applications-distributedshell
---
[INFO] Using 'UTF-8' encoding to copy filtered resources.
[INFO] skip non existing resourceDirectory <https://builds.apache.org/job/Hadoop-Yarn-trunk/ws/hadoop-yarn-project/hadoop-yarn/hadoop-yarn-applications/hadoop-yarn-applications-distributedshell/src/main/resources>
[INFO] 
[INFO] --- maven-compiler-plugin:3.1:compile (default-compile) @ hadoop-yarn-applications-distributedshell
---
[INFO] Changes detected - recompiling the module!
[INFO] Compiling 4 source files to <https://builds.apache.org/job/Hadoop-Yarn-trunk/ws/hadoop-yarn-project/hadoop-yarn/hadoop-yarn-applications/hadoop-yarn-applications-distributedshell/target/classes>
[INFO] 
[INFO] --- maven-resources-plugin:2.6:testResources (default-testResources) @ hadoop-yarn-applications-distributedshell
---
[INFO] Using 'UTF-8' encoding to copy filtered resources.
[INFO] Copying 2 resources
[INFO] 
[INFO] --- maven-compiler-plugin:3.1:testCompile (default-testCompile) @ hadoop-yarn-applications-distributedshell
---
[INFO] Changes detected - recompiling the module!
[INFO] Compiling 6 source files to <https://builds.apache.org/job/Hadoop-Yarn-trunk/ws/hadoop-yarn-project/hadoop-yarn/hadoop-yarn-applications/hadoop-yarn-applications-distributedshell/target/test-classes>
[INFO] 
[INFO] --- maven-jar-plugin:2.5:jar (default) @ hadoop-yarn-applications-distributedshell
---
[INFO] Building jar: <https://builds.apache.org/job/Hadoop-Yarn-trunk/ws/hadoop-yarn-project/hadoop-yarn/hadoop-yarn-applications/hadoop-yarn-applications-distributedshell/target/hadoop-yarn-applications-distributedshell-3.0.0-SNAPSHOT.jar>
[INFO] 
[INFO] --- maven-surefire-plugin:2.17:test (default-test) @ hadoop-yarn-applications-distributedshell
---
[INFO] Surefire report directory: <https://builds.apache.org/job/Hadoop-Yarn-trunk/ws/hadoop-yarn-project/hadoop-yarn/hadoop-yarn-applications/hadoop-yarn-applications-distributedshell/target/surefire-reports>

-------------------------------------------------------
 T E S T S
-------------------------------------------------------

-------------------------------------------------------
 T E S T S
-------------------------------------------------------
Running org.apache.hadoop.yarn.applications.distributedshell.TestDistributedShell
Tests run: 11, Failures: 0, Errors: 11, Skipped: 0, Time elapsed: 20.959 sec <<<
FAILURE! - in org.apache.hadoop.yarn.applications.distributedshell.TestDistributedShell
testDSShellWithInvalidArgs(org.apache.hadoop.yarn.applications.distributedshell.TestDistributedShell)
 Time elapsed: 3.924 sec  <<< ERROR!
org.apache.hadoop.yarn.exceptions.YarnRuntimeException: java.io.IOException: ResourceManager
failed to start. Final state is STOPPED
	at org.apache.hadoop.yarn.server.MiniYARNCluster.startResourceManager(MiniYARNCluster.java:331)
	at org.apache.hadoop.yarn.server.MiniYARNCluster.access$500(MiniYARNCluster.java:99)
	at org.apache.hadoop.yarn.server.MiniYARNCluster$ResourceManagerWrapper.serviceStart(MiniYARNCluster.java:457)
	at org.apache.hadoop.service.AbstractService.start(AbstractService.java:193)
	at org.apache.hadoop.service.CompositeService.serviceStart(CompositeService.java:120)
	at org.apache.hadoop.service.AbstractService.start(AbstractService.java:193)
	at org.apache.hadoop.yarn.applications.distributedshell.TestDistributedShell.setupInternal(TestDistributedShell.java:94)
	at org.apache.hadoop.yarn.applications.distributedshell.TestDistributedShell.setup(TestDistributedShell.java:72)

testDSShellWithoutDomain(org.apache.hadoop.yarn.applications.distributedshell.TestDistributedShell)
 Time elapsed: 1.765 sec  <<< ERROR!
org.apache.hadoop.yarn.exceptions.YarnRuntimeException: java.io.IOException: ResourceManager
failed to start. Final state is STOPPED
	at org.apache.hadoop.yarn.server.MiniYARNCluster.startResourceManager(MiniYARNCluster.java:331)
	at org.apache.hadoop.yarn.server.MiniYARNCluster.access$500(MiniYARNCluster.java:99)
	at org.apache.hadoop.yarn.server.MiniYARNCluster$ResourceManagerWrapper.serviceStart(MiniYARNCluster.java:457)
	at org.apache.hadoop.service.AbstractService.start(AbstractService.java:193)
	at org.apache.hadoop.service.CompositeService.serviceStart(CompositeService.java:120)
	at org.apache.hadoop.service.AbstractService.start(AbstractService.java:193)
	at org.apache.hadoop.yarn.applications.distributedshell.TestDistributedShell.setupInternal(TestDistributedShell.java:94)
	at org.apache.hadoop.yarn.applications.distributedshell.TestDistributedShell.setup(TestDistributedShell.java:72)

testDSAttemptFailuresValidityIntervalFailed(org.apache.hadoop.yarn.applications.distributedshell.TestDistributedShell)
 Time elapsed: 1.673 sec  <<< ERROR!
org.apache.hadoop.yarn.exceptions.YarnRuntimeException: java.io.IOException: ResourceManager
failed to start. Final state is STOPPED
	at org.apache.hadoop.yarn.server.MiniYARNCluster.startResourceManager(MiniYARNCluster.java:331)
	at org.apache.hadoop.yarn.server.MiniYARNCluster.access$500(MiniYARNCluster.java:99)
	at org.apache.hadoop.yarn.server.MiniYARNCluster$ResourceManagerWrapper.serviceStart(MiniYARNCluster.java:457)
	at org.apache.hadoop.service.AbstractService.start(AbstractService.java:193)
	at org.apache.hadoop.service.CompositeService.serviceStart(CompositeService.java:120)
	at org.apache.hadoop.service.AbstractService.start(AbstractService.java:193)
	at org.apache.hadoop.yarn.applications.distributedshell.TestDistributedShell.setupInternal(TestDistributedShell.java:94)
	at org.apache.hadoop.yarn.applications.distributedshell.TestDistributedShell.setup(TestDistributedShell.java:72)

testDSShellWithMultipleArgs(org.apache.hadoop.yarn.applications.distributedshell.TestDistributedShell)
 Time elapsed: 1.646 sec  <<< ERROR!
org.apache.hadoop.yarn.exceptions.YarnRuntimeException: java.io.IOException: ResourceManager
failed to start. Final state is STOPPED
	at org.apache.hadoop.yarn.server.MiniYARNCluster.startResourceManager(MiniYARNCluster.java:331)
	at org.apache.hadoop.yarn.server.MiniYARNCluster.access$500(MiniYARNCluster.java:99)
	at org.apache.hadoop.yarn.server.MiniYARNCluster$ResourceManagerWrapper.serviceStart(MiniYARNCluster.java:457)
	at org.apache.hadoop.service.AbstractService.start(AbstractService.java:193)
	at org.apache.hadoop.service.CompositeService.serviceStart(CompositeService.java:120)
	at org.apache.hadoop.service.AbstractService.start(AbstractService.java:193)
	at org.apache.hadoop.yarn.applications.distributedshell.TestDistributedShell.setupInternal(TestDistributedShell.java:94)
	at org.apache.hadoop.yarn.applications.distributedshell.TestDistributedShell.setup(TestDistributedShell.java:72)

testDSAttemptFailuresValidityIntervalSucess(org.apache.hadoop.yarn.applications.distributedshell.TestDistributedShell)
 Time elapsed: 1.679 sec  <<< ERROR!
org.apache.hadoop.yarn.exceptions.YarnRuntimeException: java.io.IOException: ResourceManager
failed to start. Final state is STOPPED
	at org.apache.hadoop.yarn.server.MiniYARNCluster.startResourceManager(MiniYARNCluster.java:331)
	at org.apache.hadoop.yarn.server.MiniYARNCluster.access$500(MiniYARNCluster.java:99)
	at org.apache.hadoop.yarn.server.MiniYARNCluster$ResourceManagerWrapper.serviceStart(MiniYARNCluster.java:457)
	at org.apache.hadoop.service.AbstractService.start(AbstractService.java:193)
	at org.apache.hadoop.service.CompositeService.serviceStart(CompositeService.java:120)
	at org.apache.hadoop.service.AbstractService.start(AbstractService.java:193)
	at org.apache.hadoop.yarn.applications.distributedshell.TestDistributedShell.setupInternal(TestDistributedShell.java:94)
	at org.apache.hadoop.yarn.applications.distributedshell.TestDistributedShell.setup(TestDistributedShell.java:72)

testDSShellWithDomain(org.apache.hadoop.yarn.applications.distributedshell.TestDistributedShell)
 Time elapsed: 1.661 sec  <<< ERROR!
org.apache.hadoop.yarn.exceptions.YarnRuntimeException: java.io.IOException: ResourceManager
failed to start. Final state is STOPPED
	at org.apache.hadoop.yarn.server.MiniYARNCluster.startResourceManager(MiniYARNCluster.java:331)
	at org.apache.hadoop.yarn.server.MiniYARNCluster.access$500(MiniYARNCluster.java:99)
	at org.apache.hadoop.yarn.server.MiniYARNCluster$ResourceManagerWrapper.serviceStart(MiniYARNCluster.java:457)
	at org.apache.hadoop.service.AbstractService.start(AbstractService.java:193)
	at org.apache.hadoop.service.CompositeService.serviceStart(CompositeService.java:120)
	at org.apache.hadoop.service.AbstractService.start(AbstractService.java:193)
	at org.apache.hadoop.yarn.applications.distributedshell.TestDistributedShell.setupInternal(TestDistributedShell.java:94)
	at org.apache.hadoop.yarn.applications.distributedshell.TestDistributedShell.setup(TestDistributedShell.java:72)

testDebugFlag(org.apache.hadoop.yarn.applications.distributedshell.TestDistributedShell) 
Time elapsed: 1.641 sec  <<< ERROR!
org.apache.hadoop.yarn.exceptions.YarnRuntimeException: java.io.IOException: ResourceManager
failed to start. Final state is STOPPED
	at org.apache.hadoop.yarn.server.MiniYARNCluster.startResourceManager(MiniYARNCluster.java:331)
	at org.apache.hadoop.yarn.server.MiniYARNCluster.access$500(MiniYARNCluster.java:99)
	at org.apache.hadoop.yarn.server.MiniYARNCluster$ResourceManagerWrapper.serviceStart(MiniYARNCluster.java:457)
	at org.apache.hadoop.service.AbstractService.start(AbstractService.java:193)
	at org.apache.hadoop.service.CompositeService.serviceStart(CompositeService.java:120)
	at org.apache.hadoop.service.AbstractService.start(AbstractService.java:193)
	at org.apache.hadoop.yarn.applications.distributedshell.TestDistributedShell.setupInternal(TestDistributedShell.java:94)
	at org.apache.hadoop.yarn.applications.distributedshell.TestDistributedShell.setup(TestDistributedShell.java:72)

testDSShellWithShellScript(org.apache.hadoop.yarn.applications.distributedshell.TestDistributedShell)
 Time elapsed: 1.679 sec  <<< ERROR!
org.apache.hadoop.yarn.exceptions.YarnRuntimeException: java.io.IOException: ResourceManager
failed to start. Final state is STOPPED
	at org.apache.hadoop.yarn.server.MiniYARNCluster.startResourceManager(MiniYARNCluster.java:331)
	at org.apache.hadoop.yarn.server.MiniYARNCluster.access$500(MiniYARNCluster.java:99)
	at org.apache.hadoop.yarn.server.MiniYARNCluster$ResourceManagerWrapper.serviceStart(MiniYARNCluster.java:457)
	at org.apache.hadoop.service.AbstractService.start(AbstractService.java:193)
	at org.apache.hadoop.service.CompositeService.serviceStart(CompositeService.java:120)
	at org.apache.hadoop.service.AbstractService.start(AbstractService.java:193)
	at org.apache.hadoop.yarn.applications.distributedshell.TestDistributedShell.setupInternal(TestDistributedShell.java:94)
	at org.apache.hadoop.yarn.applications.distributedshell.TestDistributedShell.setup(TestDistributedShell.java:72)

testDSRestartWithPreviousRunningContainers(org.apache.hadoop.yarn.applications.distributedshell.TestDistributedShell)
 Time elapsed: 1.664 sec  <<< ERROR!
org.apache.hadoop.yarn.exceptions.YarnRuntimeException: java.io.IOException: ResourceManager
failed to start. Final state is STOPPED
	at org.apache.hadoop.yarn.server.MiniYARNCluster.startResourceManager(MiniYARNCluster.java:331)
	at org.apache.hadoop.yarn.server.MiniYARNCluster.access$500(MiniYARNCluster.java:99)
	at org.apache.hadoop.yarn.server.MiniYARNCluster$ResourceManagerWrapper.serviceStart(MiniYARNCluster.java:457)
	at org.apache.hadoop.service.AbstractService.start(AbstractService.java:193)
	at org.apache.hadoop.service.CompositeService.serviceStart(CompositeService.java:120)
	at org.apache.hadoop.service.AbstractService.start(AbstractService.java:193)
	at org.apache.hadoop.yarn.applications.distributedshell.TestDistributedShell.setupInternal(TestDistributedShell.java:94)
	at org.apache.hadoop.yarn.applications.distributedshell.TestDistributedShell.setup(TestDistributedShell.java:72)

testDSShellWithCustomLogPropertyFile(org.apache.hadoop.yarn.applications.distributedshell.TestDistributedShell)
 Time elapsed: 1.633 sec  <<< ERROR!
org.apache.hadoop.yarn.exceptions.YarnRuntimeException: java.io.IOException: ResourceManager
failed to start. Final state is STOPPED
	at org.apache.hadoop.yarn.server.MiniYARNCluster.startResourceManager(MiniYARNCluster.java:331)
	at org.apache.hadoop.yarn.server.MiniYARNCluster.access$500(MiniYARNCluster.java:99)
	at org.apache.hadoop.yarn.server.MiniYARNCluster$ResourceManagerWrapper.serviceStart(MiniYARNCluster.java:457)
	at org.apache.hadoop.service.AbstractService.start(AbstractService.java:193)
	at org.apache.hadoop.service.CompositeService.serviceStart(CompositeService.java:120)
	at org.apache.hadoop.service.AbstractService.start(AbstractService.java:193)
	at org.apache.hadoop.yarn.applications.distributedshell.TestDistributedShell.setupInternal(TestDistributedShell.java:94)
	at org.apache.hadoop.yarn.applications.distributedshell.TestDistributedShell.setup(TestDistributedShell.java:72)

testContainerLaunchFailureHandling(org.apache.hadoop.yarn.applications.distributedshell.TestDistributedShell)
 Time elapsed: 1.626 sec  <<< ERROR!
org.apache.hadoop.yarn.exceptions.YarnRuntimeException: java.io.IOException: ResourceManager
failed to start. Final state is STOPPED
	at org.apache.hadoop.yarn.server.MiniYARNCluster.startResourceManager(MiniYARNCluster.java:331)
	at org.apache.hadoop.yarn.server.MiniYARNCluster.access$500(MiniYARNCluster.java:99)
	at org.apache.hadoop.yarn.server.MiniYARNCluster$ResourceManagerWrapper.serviceStart(MiniYARNCluster.java:457)
	at org.apache.hadoop.service.AbstractService.start(AbstractService.java:193)
	at org.apache.hadoop.service.CompositeService.serviceStart(CompositeService.java:120)
	at org.apache.hadoop.service.AbstractService.start(AbstractService.java:193)
	at org.apache.hadoop.yarn.applications.distributedshell.TestDistributedShell.setupInternal(TestDistributedShell.java:94)
	at org.apache.hadoop.yarn.applications.distributedshell.TestDistributedShell.setup(TestDistributedShell.java:72)

Running org.apache.hadoop.yarn.applications.distributedshell.TestDistributedShellWithNodeLabels
Tests run: 1, Failures: 0, Errors: 1, Skipped: 0, Time elapsed: 3.922 sec <<< FAILURE!
- in org.apache.hadoop.yarn.applications.distributedshell.TestDistributedShellWithNodeLabels
testDSShellWithNodeLabelExpression(org.apache.hadoop.yarn.applications.distributedshell.TestDistributedShellWithNodeLabels)
 Time elapsed: 3.716 sec  <<< ERROR!
org.apache.hadoop.yarn.exceptions.YarnRuntimeException: java.io.IOException: ResourceManager
failed to start. Final state is STOPPED
	at org.apache.hadoop.yarn.server.MiniYARNCluster.startResourceManager(MiniYARNCluster.java:331)
	at org.apache.hadoop.yarn.server.MiniYARNCluster.access$500(MiniYARNCluster.java:99)
	at org.apache.hadoop.yarn.server.MiniYARNCluster$ResourceManagerWrapper.serviceStart(MiniYARNCluster.java:457)
	at org.apache.hadoop.service.AbstractService.start(AbstractService.java:193)
	at org.apache.hadoop.service.CompositeService.serviceStart(CompositeService.java:120)
	at org.apache.hadoop.service.AbstractService.start(AbstractService.java:193)
	at org.apache.hadoop.yarn.applications.distributedshell.TestDistributedShell.setupInternal(TestDistributedShell.java:94)
	at org.apache.hadoop.yarn.applications.distributedshell.TestDistributedShellWithNodeLabels.setup(TestDistributedShellWithNodeLabels.java:47)

Running org.apache.hadoop.yarn.applications.distributedshell.TestDSAppMaster
Tests run: 2, Failures: 0, Errors: 0, Skipped: 0, Time elapsed: 2.826 sec - in org.apache.hadoop.yarn.applications.distributedshell.TestDSAppMaster

Results :

Tests in error: 
  TestDistributedShell.setup:72->setupInternal:94 » YarnRuntime java.io.IOExcept...
  TestDistributedShell.setup:72->setupInternal:94 » YarnRuntime java.io.IOExcept...
  TestDistributedShell.setup:72->setupInternal:94 » YarnRuntime java.io.IOExcept...
  TestDistributedShell.setup:72->setupInternal:94 » YarnRuntime java.io.IOExcept...
  TestDistributedShell.setup:72->setupInternal:94 » YarnRuntime java.io.IOExcept...
  TestDistributedShell.setup:72->setupInternal:94 » YarnRuntime java.io.IOExcept...
  TestDistributedShell.setup:72->setupInternal:94 » YarnRuntime java.io.IOExcept...
  TestDistributedShell.setup:72->setupInternal:94 » YarnRuntime java.io.IOExcept...
  TestDistributedShell.setup:72->setupInternal:94 » YarnRuntime java.io.IOExcept...
  TestDistributedShell.setup:72->setupInternal:94 » YarnRuntime java.io.IOExcept...
  TestDistributedShell.setup:72->setupInternal:94 » YarnRuntime java.io.IOExcept...
  TestDistributedShellWithNodeLabels.setup:47 » YarnRuntime java.io.IOException:...

Tests run: 14, Failures: 0, Errors: 12, Skipped: 0

[INFO] ------------------------------------------------------------------------
[INFO] Reactor Summary:
[INFO] 
[INFO] Apache Hadoop YARN ................................ SUCCESS [  3.680 s]
[INFO] Apache Hadoop YARN API ............................ SUCCESS [04:44 min]
[INFO] Apache Hadoop YARN Common ......................... SUCCESS [03:23 min]
[INFO] Apache Hadoop YARN Server ......................... SUCCESS [  0.108 s]
[INFO] Apache Hadoop YARN Server Common .................. SUCCESS [ 53.644 s]
[INFO] Apache Hadoop YARN NodeManager .................... SUCCESS [09:55 min]
[INFO] Apache Hadoop YARN Web Proxy ...................... SUCCESS [ 29.399 s]
[INFO] Apache Hadoop YARN ApplicationHistoryService ...... SUCCESS [03:41 min]
[INFO] Apache Hadoop YARN ResourceManager ................ SUCCESS [  01:02 h]
[INFO] Apache Hadoop YARN Server Tests ................... SUCCESS [01:55 min]
[INFO] Apache Hadoop YARN Client ......................... SUCCESS [07:29 min]
[INFO] Apache Hadoop YARN SharedCacheManager ............. SUCCESS [ 35.278 s]
[INFO] Apache Hadoop YARN Applications ................... SUCCESS [  0.053 s]
[INFO] Apache Hadoop YARN DistributedShell ............... FAILURE [ 30.291 s]
[INFO] Apache Hadoop YARN Unmanaged Am Launcher .......... SKIPPED
[INFO] Apache Hadoop YARN Site ........................... SKIPPED
[INFO] Apache Hadoop YARN Registry ....................... SKIPPED
[INFO] Apache Hadoop YARN Project ........................ SKIPPED
[INFO] ------------------------------------------------------------------------
[INFO] BUILD FAILURE
[INFO] ------------------------------------------------------------------------
[INFO] Total time: 01:36 h
[INFO] Finished at: 2015-10-30T21:55:18+00:00
[INFO] Final Memory: 78M/770M
[INFO] ------------------------------------------------------------------------
[ERROR] Failed to execute goal org.apache.maven.plugins:maven-surefire-plugin:2.17:test (default-test)
on project hadoop-yarn-applications-distributedshell: There are test failures.
[ERROR] 
[ERROR] Please refer to <https://builds.apache.org/job/Hadoop-Yarn-trunk/ws/hadoop-yarn-project/hadoop-yarn/hadoop-yarn-applications/hadoop-yarn-applications-distributedshell/target/surefire-reports>
for the individual test results.
[ERROR] -> [Help 1]
[ERROR] 
[ERROR] To see the full stack trace of the errors, re-run Maven with the -e switch.
[ERROR] Re-run Maven using the -X switch to enable full debug logging.
[ERROR] 
[ERROR] For more information about the errors and possible solutions, please read the following
articles:
[ERROR] [Help 1] http://cwiki.apache.org/confluence/display/MAVEN/MojoFailureException
[ERROR] 
[ERROR] After correcting the problems, you can resume the build with the command
[ERROR]   mvn <goals> -rf :hadoop-yarn-applications-distributedshell
Build step 'Execute shell' marked build as failure
Archiving artifacts
Recording test results
Updating HADOOP-12133
Updating MAPREDUCE-6451

Mime
View raw message