hadoop-yarn-dev mailing list archives

Site index · List index
Message view « Date » · « Thread »
Top « Date » · « Thread »
From Apache Jenkins Server <jenk...@builds.apache.org>
Subject Hadoop-Yarn-trunk - Build # 1271 - Failure
Date Thu, 15 Oct 2015 11:18:23 GMT
See https://builds.apache.org/job/Hadoop-Yarn-trunk/1271/

###################################################################################
########################## LAST 60 LINES OF THE CONSOLE ###########################
[...truncated 7798 lines...]
Tests run: 5, Failures: 0, Errors: 0, Skipped: 1, Time elapsed: 1.904 sec - in org.apache.hadoop.yarn.server.nodemanager.webapp.TestContainerLogsPage

Results :

Tests in error: 
  TestContainerManagerRecovery.<init>:111->BaseContainerManagerTest.<init>:110
» NoClassDefFound
  TestContainerManagerRecovery.<init>:111->BaseContainerManagerTest.<init>:110
» NoClassDefFound
  TestContainerManagerRecovery.<init>:111->BaseContainerManagerTest.<init>:110
» NoClassDefFound

Tests run: 384, Failures: 0, Errors: 3, Skipped: 17

[INFO] ------------------------------------------------------------------------
[INFO] Reactor Summary:
[INFO] 
[INFO] Apache Hadoop YARN ................................ SUCCESS [  5.846 s]
[INFO] Apache Hadoop YARN API ............................ SUCCESS [05:15 min]
[INFO] Apache Hadoop YARN Common ......................... SUCCESS [03:56 min]
[INFO] Apache Hadoop YARN Server ......................... SUCCESS [  0.109 s]
[INFO] Apache Hadoop YARN Server Common .................. SUCCESS [01:02 min]
[INFO] Apache Hadoop YARN NodeManager .................... FAILURE [08:58 min]
[INFO] Apache Hadoop YARN Web Proxy ...................... SKIPPED
[INFO] Apache Hadoop YARN ApplicationHistoryService ...... SKIPPED
[INFO] Apache Hadoop YARN ResourceManager ................ SKIPPED
[INFO] Apache Hadoop YARN Server Tests ................... SKIPPED
[INFO] Apache Hadoop YARN Client ......................... SKIPPED
[INFO] Apache Hadoop YARN SharedCacheManager ............. SKIPPED
[INFO] Apache Hadoop YARN Applications ................... SKIPPED
[INFO] Apache Hadoop YARN DistributedShell ............... SKIPPED
[INFO] Apache Hadoop YARN Unmanaged Am Launcher .......... SKIPPED
[INFO] Apache Hadoop YARN Site ........................... SKIPPED
[INFO] Apache Hadoop YARN Registry ....................... SKIPPED
[INFO] Apache Hadoop YARN Project ........................ SKIPPED
[INFO] ------------------------------------------------------------------------
[INFO] BUILD FAILURE
[INFO] ------------------------------------------------------------------------
[INFO] Total time: 19:20 min
[INFO] Finished at: 2015-10-15T11:19:04+00:00
[INFO] Final Memory: 77M/975M
[INFO] ------------------------------------------------------------------------
[ERROR] Failed to execute goal org.apache.maven.plugins:maven-surefire-plugin:2.17:test (default-test)
on project hadoop-yarn-server-nodemanager: There are test failures.
[ERROR] 
[ERROR] Please refer to /home/jenkins/jenkins-slave/workspace/Hadoop-Yarn-trunk/hadoop-yarn-project/hadoop-yarn/hadoop-yarn-server/hadoop-yarn-server-nodemanager/target/surefire-reports
for the individual test results.
[ERROR] -> [Help 1]
[ERROR] 
[ERROR] To see the full stack trace of the errors, re-run Maven with the -e switch.
[ERROR] Re-run Maven using the -X switch to enable full debug logging.
[ERROR] 
[ERROR] For more information about the errors and possible solutions, please read the following
articles:
[ERROR] [Help 1] http://cwiki.apache.org/confluence/display/MAVEN/MojoFailureException
[ERROR] 
[ERROR] After correcting the problems, you can resume the build with the command
[ERROR]   mvn <goals> -rf :hadoop-yarn-server-nodemanager
Build step 'Execute shell' marked build as failure
Archiving artifacts
Recording test results
Updating HDFS-9205
Sending e-mails to: yarn-dev@hadoop.apache.org
Email was triggered for: Failure - Any
Sending email for trigger: Failure - Any



###################################################################################
############################## FAILED TESTS (if any) ##############################
3 tests failed.
FAILED:  org.apache.hadoop.yarn.server.nodemanager.containermanager.TestContainerManagerRecovery.testApplicationRecovery

Error Message:
org/apache/hadoop/util/PlatformName

Stack Trace:
java.lang.NoClassDefFoundError: org/apache/hadoop/util/PlatformName
	at java.net.URLClassLoader$1.run(URLClassLoader.java:366)
	at java.net.URLClassLoader$1.run(URLClassLoader.java:355)
	at java.security.AccessController.doPrivileged(Native Method)
	at java.net.URLClassLoader.findClass(URLClassLoader.java:354)
	at java.lang.ClassLoader.loadClass(ClassLoader.java:425)
	at sun.misc.Launcher$AppClassLoader.loadClass(Launcher.java:308)
	at java.lang.ClassLoader.loadClass(ClassLoader.java:358)
	at org.apache.hadoop.security.UserGroupInformation.getOSLoginModuleName(UserGroupInformation.java:378)
	at org.apache.hadoop.security.UserGroupInformation.<clinit>(UserGroupInformation.java:423)
	at org.apache.hadoop.yarn.security.AdminACLsManager.<init>(AdminACLsManager.java:70)
	at org.apache.hadoop.yarn.server.security.ApplicationACLsManager.<init>(ApplicationACLsManager.java:60)
	at org.apache.hadoop.yarn.server.nodemanager.containermanager.BaseContainerManagerTest.<init>(BaseContainerManagerTest.java:110)
	at org.apache.hadoop.yarn.server.nodemanager.containermanager.TestContainerManagerRecovery.<init>(TestContainerManagerRecovery.java:111)


FAILED:  org.apache.hadoop.yarn.server.nodemanager.containermanager.TestContainerManagerRecovery.testContainerCleanupOnShutdown

Error Message:
Could not initialize class org.apache.hadoop.security.UserGroupInformation

Stack Trace:
java.lang.NoClassDefFoundError: Could not initialize class org.apache.hadoop.security.UserGroupInformation
	at org.apache.hadoop.yarn.security.AdminACLsManager.<init>(AdminACLsManager.java:70)
	at org.apache.hadoop.yarn.server.security.ApplicationACLsManager.<init>(ApplicationACLsManager.java:60)
	at org.apache.hadoop.yarn.server.nodemanager.containermanager.BaseContainerManagerTest.<init>(BaseContainerManagerTest.java:110)
	at org.apache.hadoop.yarn.server.nodemanager.containermanager.TestContainerManagerRecovery.<init>(TestContainerManagerRecovery.java:111)


FAILED:  org.apache.hadoop.yarn.server.nodemanager.containermanager.TestContainerManagerRecovery.testContainerResizeRecovery

Error Message:
Could not initialize class org.apache.hadoop.security.UserGroupInformation

Stack Trace:
java.lang.NoClassDefFoundError: Could not initialize class org.apache.hadoop.security.UserGroupInformation
	at org.apache.hadoop.yarn.security.AdminACLsManager.<init>(AdminACLsManager.java:70)
	at org.apache.hadoop.yarn.server.security.ApplicationACLsManager.<init>(ApplicationACLsManager.java:60)
	at org.apache.hadoop.yarn.server.nodemanager.containermanager.BaseContainerManagerTest.<init>(BaseContainerManagerTest.java:110)
	at org.apache.hadoop.yarn.server.nodemanager.containermanager.TestContainerManagerRecovery.<init>(TestContainerManagerRecovery.java:111)



Mime
  • Unnamed multipart/mixed (inline, None, 0 bytes)
View raw message