hadoop-yarn-dev mailing list archives

Site index · List index
Message view « Date » · « Thread »
Top « Date » · « Thread »
From Apache Jenkins Server <jenk...@builds.apache.org>
Subject Failed: YARN-4131 PreCommit Build #9077
Date Thu, 10 Sep 2015 14:54:28 GMT
Jira: https://issues.apache.org/jira/browse/YARN-4131
Build: https://builds.apache.org/job/PreCommit-YARN-Build/9077/

###################################################################################
########################## LAST 60 LINES OF THE CONSOLE ###########################
[...truncated 471 lines...]
|      |                     |            | hadoop-yarn-server-resourcemanager.
|      |                     |  233m 37s  | 


             Reason | Tests
 Failed unit tests  |  hadoop.yarn.logaggregation.TestAggregatedLogsBlock 
                    |  hadoop.yarn.server.resourcemanager.scheduler.fair.TestAllocationFileLoaderService

                    |  hadoop.yarn.server.resourcemanager.TestApplicationMasterLauncher 
                    |  hadoop.yarn.server.resourcemanager.TestApplicationACLs 
                    |  hadoop.yarn.server.resourcemanager.recovery.TestZKRMStateStore 
                    |  hadoop.yarn.server.resourcemanager.scheduler.fair.TestContinuousScheduling



|| Subsystem || Report/Notes ||
============================================================================
| Patch URL | http://issues.apache.org/jira/secure/attachment/12754928/YARN-4131-v1.2.patch
|
| Optional Tests | javadoc javac unit findbugs checkstyle |
| git revision | trunk / 7b5b2c5 |
| hadoop-mapreduce-client-jobclient test log | /home/jenkins/jenkins-slave/workspace/PreCommit-YARN-Build@2/patchprocess/testrun_hadoop-mapreduce-client-jobclient.txt
|
| hadoop-yarn-api test log | /home/jenkins/jenkins-slave/workspace/PreCommit-YARN-Build@2/patchprocess/testrun_hadoop-yarn-api.txt
|
| hadoop-yarn-client test log | /home/jenkins/jenkins-slave/workspace/PreCommit-YARN-Build@2/patchprocess/testrun_hadoop-yarn-client.txt
|
| hadoop-yarn-common test log | /home/jenkins/jenkins-slave/workspace/PreCommit-YARN-Build@2/patchprocess/testrun_hadoop-yarn-common.txt
|
| hadoop-yarn-server-nodemanager test log | /home/jenkins/jenkins-slave/workspace/PreCommit-YARN-Build@2/patchprocess/testrun_hadoop-yarn-server-nodemanager.txt
|
| hadoop-yarn-server-resourcemanager test log | /home/jenkins/jenkins-slave/workspace/PreCommit-YARN-Build@2/patchprocess/testrun_hadoop-yarn-server-resourcemanager.txt
|
| Test Results | https://builds.apache.org/job/PreCommit-YARN-Build/9077/testReport/ |
| Java | 1.7.0_55 |
| uname | Linux asf905.gq1.ygridcore.net 3.13.0-36-lowlatency #63-Ubuntu SMP PREEMPT Wed Sep
3 21:56:12 UTC 2014 x86_64 x86_64 x86_64 GNU/Linux |


============================================================================
============================================================================
                          Adding comment to JIRA
============================================================================
============================================================================


Comment added.
2b8a3e2eab799e79db9e5498272143721cb1b8d9 logged out


============================================================================
============================================================================
                              Finished build.
============================================================================
============================================================================


Build step 'Execute shell' marked build as failure
Archiving artifacts
Sending artifact delta relative to PreCommit-YARN-Build #9074
Archived 99 artifacts
Archive block size is 32768
Received 9 blocks and 34498166 bytes
Compression is 0.8%
Took 8 sec
[description-setter] Could not determine description.
Recording test results
Email was triggered for: Failure
Sending email for trigger: Failure



###################################################################################
############################## FAILED TESTS (if any) ##############################
11 tests failed.
FAILED:  org.apache.hadoop.yarn.logaggregation.TestAggregatedLogsBlock.testAggregatedLogsBlockHar

Error Message:
Source '/home/jenkins/jenkins-slave/workspace/PreCommit-YARN-Build%402/hadoop-yarn-project/hadoop-yarn/hadoop-yarn-common/target/test-classes/application_1440536969523_0001.har'
does not exist

Stack Trace:
java.io.FileNotFoundException: Source '/home/jenkins/jenkins-slave/workspace/PreCommit-YARN-Build%402/hadoop-yarn-project/hadoop-yarn/hadoop-yarn-common/target/test-classes/application_1440536969523_0001.har'
does not exist
	at org.apache.commons.io.FileUtils.copyDirectory(FileUtils.java:1368)
	at org.apache.commons.io.FileUtils.copyDirectory(FileUtils.java:1261)
	at org.apache.commons.io.FileUtils.copyDirectory(FileUtils.java:1230)
	at org.apache.hadoop.yarn.logaggregation.TestAggregatedLogsBlock.testAggregatedLogsBlockHar(TestAggregatedLogsBlock.java:168)


FAILED:  org.apache.hadoop.yarn.server.resourcemanager.TestApplicationACLs.org.apache.hadoop.yarn.server.resourcemanager.TestApplicationACLs

Error Message:
java.lang.ClassNotFoundException: org.apache.hadoop.yarn.factories.impl.pb.RpcClientFactoryPBImpl

Stack Trace:
org.apache.hadoop.yarn.exceptions.YarnRuntimeException: java.lang.ClassNotFoundException:
org.apache.hadoop.yarn.factories.impl.pb.RpcClientFactoryPBImpl
	at java.net.URLClassLoader$1.run(URLClassLoader.java:366)
	at java.net.URLClassLoader$1.run(URLClassLoader.java:355)
	at java.security.AccessController.doPrivileged(Native Method)
	at java.net.URLClassLoader.findClass(URLClassLoader.java:354)
	at java.lang.ClassLoader.loadClass(ClassLoader.java:425)
	at sun.misc.Launcher$AppClassLoader.loadClass(Launcher.java:308)
	at java.lang.ClassLoader.loadClass(ClassLoader.java:358)
	at java.lang.Class.forName0(Native Method)
	at java.lang.Class.forName(Class.java:190)
	at org.apache.hadoop.yarn.factory.providers.RpcFactoryProvider.getFactoryClassInstance(RpcFactoryProvider.java:61)
	at org.apache.hadoop.yarn.factory.providers.RpcFactoryProvider.getClientFactory(RpcFactoryProvider.java:56)
	at org.apache.hadoop.yarn.ipc.HadoopYarnProtoRPC.getProxy(HadoopYarnProtoRPC.java:48)
	at org.apache.hadoop.yarn.server.resourcemanager.TestApplicationACLs$3.run(TestApplicationACLs.java:155)
	at org.apache.hadoop.yarn.server.resourcemanager.TestApplicationACLs$3.run(TestApplicationACLs.java:152)
	at java.security.AccessController.doPrivileged(Native Method)
	at javax.security.auth.Subject.doAs(Subject.java:415)
	at org.apache.hadoop.security.UserGroupInformation.doAs(UserGroupInformation.java:1667)
	at org.apache.hadoop.yarn.server.resourcemanager.TestApplicationACLs.setup(TestApplicationACLs.java:152)


FAILED:  org.apache.hadoop.yarn.server.resourcemanager.TestApplicationMasterLauncher.testallocateBeforeAMRegistration

Error Message:
org/apache/hadoop/security/token/Token

Stack Trace:
java.lang.NoClassDefFoundError: org/apache/hadoop/security/token/Token
	at java.net.URLClassLoader$1.run(URLClassLoader.java:366)
	at java.net.URLClassLoader$1.run(URLClassLoader.java:355)
	at java.security.AccessController.doPrivileged(Native Method)
	at java.net.URLClassLoader.findClass(URLClassLoader.java:354)
	at java.lang.ClassLoader.loadClass(ClassLoader.java:425)
	at sun.misc.Launcher$AppClassLoader.loadClass(Launcher.java:308)
	at java.lang.ClassLoader.loadClass(ClassLoader.java:358)
	at org.apache.hadoop.yarn.server.resourcemanager.security.AMRMTokenSecretManager.createAndGetAMRMToken(AMRMTokenSecretManager.java:201)
	at org.apache.hadoop.yarn.server.resourcemanager.MockRM.sendAMLaunched(MockRM.java:575)
	at org.apache.hadoop.yarn.server.resourcemanager.TestApplicationMasterLauncher.testallocateBeforeAMRegistration(TestApplicationMasterLauncher.java:201)


FAILED:  org.apache.hadoop.yarn.server.resourcemanager.TestApplicationMasterLauncher.testAMLaunchAndCleanup

Error Message:
null

Stack Trace:
java.lang.AssertionError: null
	at org.junit.Assert.fail(Assert.java:86)
	at org.junit.Assert.assertTrue(Assert.java:41)
	at org.junit.Assert.assertTrue(Assert.java:52)
	at org.apache.hadoop.yarn.server.resourcemanager.TestApplicationMasterLauncher.testAMLaunchAndCleanup(TestApplicationMasterLauncher.java:151)


FAILED:  org.apache.hadoop.yarn.server.resourcemanager.recovery.TestZKRMStateStore.testFencing

Error Message:
org/apache/hadoop/yarn/server/api/ResourceTracker

Stack Trace:
java.lang.NoClassDefFoundError: org/apache/hadoop/yarn/server/api/ResourceTracker
	at java.net.URLClassLoader$1.run(URLClassLoader.java:366)
	at java.net.URLClassLoader$1.run(URLClassLoader.java:355)
	at java.security.AccessController.doPrivileged(Native Method)
	at java.net.URLClassLoader.findClass(URLClassLoader.java:354)
	at java.lang.ClassLoader.loadClass(ClassLoader.java:425)
	at sun.misc.Launcher$AppClassLoader.loadClass(Launcher.java:308)
	at java.lang.ClassLoader.loadClass(ClassLoader.java:358)
	at java.lang.ClassLoader.defineClass1(Native Method)
	at java.lang.ClassLoader.defineClass(ClassLoader.java:800)
	at java.security.SecureClassLoader.defineClass(SecureClassLoader.java:142)
	at java.net.URLClassLoader.defineClass(URLClassLoader.java:449)
	at java.net.URLClassLoader.access$100(URLClassLoader.java:71)
	at java.net.URLClassLoader$1.run(URLClassLoader.java:361)
	at java.net.URLClassLoader$1.run(URLClassLoader.java:355)
	at java.security.AccessController.doPrivileged(Native Method)
	at java.net.URLClassLoader.findClass(URLClassLoader.java:354)
	at java.lang.ClassLoader.loadClass(ClassLoader.java:425)
	at sun.misc.Launcher$AppClassLoader.loadClass(Launcher.java:308)
	at java.lang.ClassLoader.loadClass(ClassLoader.java:358)
	at org.apache.hadoop.yarn.server.resourcemanager.recovery.TestZKRMStateStore.testFencing(TestZKRMStateStore.java:259)


FAILED:  org.apache.hadoop.yarn.server.resourcemanager.recovery.TestZKRMStateStore.testCheckMajorVersionChange

Error Message:
org/apache/hadoop/yarn/server/records/Version

Stack Trace:
java.lang.NoClassDefFoundError: org/apache/hadoop/yarn/server/records/Version
	at java.net.URLClassLoader$1.run(URLClassLoader.java:366)
	at java.net.URLClassLoader$1.run(URLClassLoader.java:355)
	at java.security.AccessController.doPrivileged(Native Method)
	at java.net.URLClassLoader.findClass(URLClassLoader.java:354)
	at java.lang.ClassLoader.loadClass(ClassLoader.java:425)
	at sun.misc.Launcher$AppClassLoader.loadClass(Launcher.java:308)
	at java.lang.ClassLoader.loadClass(ClassLoader.java:358)
	at org.apache.hadoop.yarn.server.resourcemanager.recovery.TestZKRMStateStore$1.<init>(TestZKRMStateStore.java:185)
	at org.apache.hadoop.yarn.server.resourcemanager.recovery.TestZKRMStateStore.testCheckMajorVersionChange(TestZKRMStateStore.java:184)


FAILED:  org.apache.hadoop.yarn.server.resourcemanager.recovery.TestZKRMStateStore.testFencedState

Error Message:
org/apache/hadoop/yarn/server/records/Version

Stack Trace:
java.lang.NoClassDefFoundError: org/apache/hadoop/yarn/server/records/Version
	at java.net.URLClassLoader$1.run(URLClassLoader.java:366)
	at java.net.URLClassLoader$1.run(URLClassLoader.java:355)
	at java.security.AccessController.doPrivileged(Native Method)
	at java.net.URLClassLoader.findClass(URLClassLoader.java:354)
	at java.lang.ClassLoader.loadClass(ClassLoader.java:425)
	at sun.misc.Launcher$AppClassLoader.loadClass(Launcher.java:308)
	at java.lang.ClassLoader.loadClass(ClassLoader.java:358)
	at org.apache.hadoop.yarn.server.resourcemanager.recovery.TestZKRMStateStore$TestZKRMStateStoreTester.getRMStateStore(TestZKRMStateStore.java:138)
	at org.apache.hadoop.yarn.server.resourcemanager.recovery.TestZKRMStateStore.testFencedState(TestZKRMStateStore.java:296)


FAILED:  org.apache.hadoop.yarn.server.resourcemanager.recovery.TestZKRMStateStore.testDuplicateRMAppDeletion

Error Message:
org/apache/hadoop/yarn/server/records/Version

Stack Trace:
java.lang.NoClassDefFoundError: org/apache/hadoop/yarn/server/records/Version
	at java.net.URLClassLoader$1.run(URLClassLoader.java:366)
	at java.net.URLClassLoader$1.run(URLClassLoader.java:355)
	at java.security.AccessController.doPrivileged(Native Method)
	at java.net.URLClassLoader.findClass(URLClassLoader.java:354)
	at java.lang.ClassLoader.loadClass(ClassLoader.java:425)
	at sun.misc.Launcher$AppClassLoader.loadClass(Launcher.java:308)
	at java.lang.ClassLoader.loadClass(ClassLoader.java:358)
	at org.apache.hadoop.yarn.server.resourcemanager.recovery.TestZKRMStateStore$TestZKRMStateStoreTester.getRMStateStore(TestZKRMStateStore.java:138)
	at org.apache.hadoop.yarn.server.resourcemanager.recovery.TestZKRMStateStore.testDuplicateRMAppDeletion(TestZKRMStateStore.java:409)


FAILED:  org.apache.hadoop.yarn.server.resourcemanager.recovery.TestZKRMStateStore.testZKRMStateStoreRealZK

Error Message:
org/apache/hadoop/yarn/server/records/Version

Stack Trace:
java.lang.NoClassDefFoundError: org/apache/hadoop/yarn/server/records/Version
	at java.net.URLClassLoader$1.run(URLClassLoader.java:366)
	at java.net.URLClassLoader$1.run(URLClassLoader.java:355)
	at java.security.AccessController.doPrivileged(Native Method)
	at java.net.URLClassLoader.findClass(URLClassLoader.java:354)
	at java.lang.ClassLoader.loadClass(ClassLoader.java:425)
	at sun.misc.Launcher$AppClassLoader.loadClass(Launcher.java:308)
	at java.lang.ClassLoader.loadClass(ClassLoader.java:358)
	at org.apache.hadoop.yarn.server.resourcemanager.recovery.TestZKRMStateStore$TestZKRMStateStoreTester.getRMStateStore(TestZKRMStateStore.java:138)
	at org.apache.hadoop.yarn.server.resourcemanager.recovery.RMStateStoreTestBase.testRMAppStateStore(RMStateStoreTestBase.java:209)
	at org.apache.hadoop.yarn.server.resourcemanager.recovery.RMStateStoreTestBase.testRMAppStateStore(RMStateStoreTestBase.java:200)
	at org.apache.hadoop.yarn.server.resourcemanager.recovery.TestZKRMStateStore.testZKRMStateStoreRealZK(TestZKRMStateStore.java:169)


FAILED:  org.apache.hadoop.yarn.server.resourcemanager.scheduler.fair.TestAllocationFileLoaderService.testGetAllocationFileFromClasspath

Error Message:
null

Stack Trace:
java.lang.AssertionError: null
	at org.junit.Assert.fail(Assert.java:86)
	at org.junit.Assert.assertTrue(Assert.java:41)
	at org.junit.Assert.assertTrue(Assert.java:52)
	at org.apache.hadoop.yarn.server.resourcemanager.scheduler.fair.TestAllocationFileLoaderService.testGetAllocationFileFromClasspath(TestAllocationFileLoaderService.java:54)


FAILED:  org.apache.hadoop.yarn.server.resourcemanager.scheduler.fair.TestContinuousScheduling.testSchedulingDelay

Error Message:
org/apache/hadoop/util/PlatformName

Stack Trace:
java.lang.NoClassDefFoundError: org/apache/hadoop/util/PlatformName
	at java.net.URLClassLoader$1.run(URLClassLoader.java:366)
	at java.net.URLClassLoader$1.run(URLClassLoader.java:355)
	at java.security.AccessController.doPrivileged(Native Method)
	at java.net.URLClassLoader.findClass(URLClassLoader.java:354)
	at java.lang.ClassLoader.loadClass(ClassLoader.java:425)
	at sun.misc.Launcher$AppClassLoader.loadClass(Launcher.java:308)
	at java.lang.ClassLoader.loadClass(ClassLoader.java:358)
	at org.apache.hadoop.security.UserGroupInformation.getOSLoginModuleName(UserGroupInformation.java:378)
	at org.apache.hadoop.security.UserGroupInformation.<clinit>(UserGroupInformation.java:423)
	at org.apache.hadoop.yarn.server.resourcemanager.ResourceManager.serviceInit(ResourceManager.java:238)
	at org.apache.hadoop.service.AbstractService.init(AbstractService.java:163)
	at org.apache.hadoop.yarn.server.resourcemanager.MockRM.<init>(MockRM.java:120)
	at org.apache.hadoop.yarn.server.resourcemanager.MockRM.<init>(MockRM.java:113)
	at org.apache.hadoop.yarn.server.resourcemanager.MockRM.<init>(MockRM.java:109)
	at org.apache.hadoop.yarn.server.resourcemanager.scheduler.fair.TestContinuousScheduling.setup(TestContinuousScheduling.java:59)



Mime
  • Unnamed multipart/mixed (inline, None, 0 bytes)
View raw message