hadoop-yarn-dev mailing list archives

Site index · List index
Message view « Date » · « Thread »
Top « Date » · « Thread »
From Apache Jenkins Server <jenk...@builds.apache.org>
Subject Hadoop-Yarn-trunk - Build # 1190 - Still Failing
Date Mon, 28 Sep 2015 16:29:28 GMT
See https://builds.apache.org/job/Hadoop-Yarn-trunk/1190/

###################################################################################
########################## LAST 60 LINES OF THE CONSOLE ###########################
[...truncated 10493 lines...]
Tests run: 26, Failures: 0, Errors: 0, Skipped: 0, Time elapsed: 2.301 sec - in org.apache.hadoop.yarn.client.cli.TestYarnCLI
Running org.apache.hadoop.yarn.client.cli.TestClusterCLI
Tests run: 4, Failures: 0, Errors: 0, Skipped: 0, Time elapsed: 1.738 sec - in org.apache.hadoop.yarn.client.cli.TestClusterCLI
Running org.apache.hadoop.yarn.client.cli.TestRMAdminCLI
Tests run: 23, Failures: 0, Errors: 0, Skipped: 0, Time elapsed: 4.252 sec - in org.apache.hadoop.yarn.client.cli.TestRMAdminCLI
Running org.apache.hadoop.yarn.client.TestResourceManagerAdministrationProtocolPBClientImpl
Tests run: 7, Failures: 0, Errors: 0, Skipped: 0, Time elapsed: 4.354 sec - in org.apache.hadoop.yarn.client.TestResourceManagerAdministrationProtocolPBClientImpl

Results :

Tests run: 149, Failures: 0, Errors: 0, Skipped: 0

[INFO] ------------------------------------------------------------------------
[INFO] Reactor Summary:
[INFO] 
[INFO] Apache Hadoop YARN ................................ SUCCESS [  3.823 s]
[INFO] Apache Hadoop YARN API ............................ SUCCESS [04:28 min]
[INFO] Apache Hadoop YARN Common ......................... SUCCESS [03:17 min]
[INFO] Apache Hadoop YARN Server ......................... SUCCESS [  0.095 s]
[INFO] Apache Hadoop YARN Server Common .................. SUCCESS [ 52.364 s]
[INFO] Apache Hadoop YARN NodeManager .................... SUCCESS [09:24 min]
[INFO] Apache Hadoop YARN Web Proxy ...................... SUCCESS [ 35.953 s]
[INFO] Apache Hadoop YARN ApplicationHistoryService ...... SUCCESS [03:37 min]
[INFO] Apache Hadoop YARN ResourceManager ................ SUCCESS [  01:01 h]
[INFO] Apache Hadoop YARN Server Tests ................... SUCCESS [01:53 min]
[INFO] Apache Hadoop YARN Client ......................... FAILURE [04:48 min]
[INFO] Apache Hadoop YARN SharedCacheManager ............. SKIPPED
[INFO] Apache Hadoop YARN Applications ................... SKIPPED
[INFO] Apache Hadoop YARN DistributedShell ............... SKIPPED
[INFO] Apache Hadoop YARN Unmanaged Am Launcher .......... SKIPPED
[INFO] Apache Hadoop YARN Site ........................... SKIPPED
[INFO] Apache Hadoop YARN Registry ....................... SKIPPED
[INFO] Apache Hadoop YARN Project ........................ SKIPPED
[INFO] ------------------------------------------------------------------------
[INFO] BUILD FAILURE
[INFO] ------------------------------------------------------------------------
[INFO] Total time: 01:30 h
[INFO] Finished at: 2015-09-28T16:29:12+00:00
[INFO] Final Memory: 71M/729M
[INFO] ------------------------------------------------------------------------
[ERROR] Failed to execute goal org.apache.maven.plugins:maven-surefire-plugin:2.17:test (default-test)
on project hadoop-yarn-client: ExecutionException: java.lang.RuntimeException: The forked
VM terminated without properly saying goodbye. VM crash or System.exit called?
[ERROR] Command was /bin/sh -c cd /home/jenkins/jenkins-slave/workspace/Hadoop-Yarn-trunk/hadoop-yarn-project/hadoop-yarn/hadoop-yarn-client
&& /home/jenkins/tools/java/jdk1.7.0_55/jre/bin/java -Xmx2048m -XX:MaxPermSize=768m
-XX:+HeapDumpOnOutOfMemoryError -jar /home/jenkins/jenkins-slave/workspace/Hadoop-Yarn-trunk/hadoop-yarn-project/hadoop-yarn/hadoop-yarn-client/target/surefire/surefirebooter708415946541862187.jar
/home/jenkins/jenkins-slave/workspace/Hadoop-Yarn-trunk/hadoop-yarn-project/hadoop-yarn/hadoop-yarn-client/target/surefire/surefire2880873675064198368tmp
/home/jenkins/jenkins-slave/workspace/Hadoop-Yarn-trunk/hadoop-yarn-project/hadoop-yarn/hadoop-yarn-client/target/surefire/surefire_3021216709370869418180tmp
[ERROR] -> [Help 1]
[ERROR] 
[ERROR] To see the full stack trace of the errors, re-run Maven with the -e switch.
[ERROR] Re-run Maven using the -X switch to enable full debug logging.
[ERROR] 
[ERROR] For more information about the errors and possible solutions, please read the following
articles:
[ERROR] [Help 1] http://cwiki.apache.org/confluence/display/MAVEN/MojoFailureException
[ERROR] 
[ERROR] After correcting the problems, you can resume the build with the command
[ERROR]   mvn <goals> -rf :hadoop-yarn-client
Build step 'Execute shell' marked build as failure
Archiving artifacts
Recording test results
Updating HDFS-9080
Sending e-mails to: yarn-dev@hadoop.apache.org
Email was triggered for: Failure
Sending email for trigger: Failure



###################################################################################
############################## FAILED TESTS (if any) ##############################
All tests passed
Mime
  • Unnamed multipart/mixed (inline, None, 0 bytes)
View raw message