hadoop-yarn-dev mailing list archives

Site index · List index
Message view « Date » · « Thread »
Top « Date » · « Thread »
From Apache Jenkins Server <jenk...@builds.apache.org>
Subject Hadoop-Yarn-trunk-Java8 - Build # 420 - Still Failing
Date Fri, 18 Sep 2015 21:11:10 GMT
See https://builds.apache.org/job/Hadoop-Yarn-trunk-Java8/420/

###################################################################################
########################## LAST 60 LINES OF THE CONSOLE ###########################
[...truncated 5867 lines...]
[INFO] Building jar: /home/jenkins/jenkins-slave/workspace/Hadoop-Yarn-trunk-Java8/hadoop-yarn-project/hadoop-yarn/hadoop-yarn-registry/target/hadoop-yarn-registry-3.0.0-SNAPSHOT-sources.jar
[INFO] 
[INFO] --- maven-source-plugin:2.3:test-jar-no-fork (hadoop-java-sources) @ hadoop-yarn-registry
---
[INFO] Building jar: /home/jenkins/jenkins-slave/workspace/Hadoop-Yarn-trunk-Java8/hadoop-yarn-project/hadoop-yarn/hadoop-yarn-registry/target/hadoop-yarn-registry-3.0.0-SNAPSHOT-test-sources.jar
[INFO] 
[INFO] --- maven-enforcer-plugin:1.3.1:enforce (dist-enforce) @ hadoop-yarn-registry ---
[INFO] 
[INFO] --- maven-site-plugin:3.4:attach-descriptor (attach-descriptor) @ hadoop-yarn-registry
---
[INFO] 
[INFO] --- maven-javadoc-plugin:2.8.1:jar (module-javadocs) @ hadoop-yarn-registry ---
[INFO] Skipping javadoc generation
[INFO] 
[INFO] --- maven-enforcer-plugin:1.3.1:enforce (depcheck) @ hadoop-yarn-registry ---
[INFO] 
[INFO] --- maven-checkstyle-plugin:2.15:checkstyle (default-cli) @ hadoop-yarn-registry ---
[INFO] ------------------------------------------------------------------------
[INFO] Reactor Summary:
[INFO] 
[INFO] Apache Hadoop YARN ................................ SUCCESS [  3.273 s]
[INFO] Apache Hadoop YARN API ............................ SUCCESS [01:26 min]
[INFO] Apache Hadoop YARN Common ......................... SUCCESS [02:32 min]
[INFO] Apache Hadoop YARN Server ......................... SUCCESS [  0.058 s]
[INFO] Apache Hadoop YARN Server Common .................. SUCCESS [ 37.889 s]
[INFO] Apache Hadoop YARN NodeManager .................... SUCCESS [07:43 min]
[INFO] Apache Hadoop YARN Web Proxy ...................... SUCCESS [ 17.731 s]
[INFO] Apache Hadoop YARN ApplicationHistoryService ...... SUCCESS [03:09 min]
[INFO] Apache Hadoop YARN ResourceManager ................ SUCCESS [55:27 min]
[INFO] Apache Hadoop YARN Server Tests ................... SUCCESS [01:53 min]
[INFO] Apache Hadoop YARN Client ......................... SUCCESS [07:01 min]
[INFO] Apache Hadoop YARN SharedCacheManager ............. SUCCESS [ 17.675 s]
[INFO] Apache Hadoop YARN Applications ................... SUCCESS [  0.032 s]
[INFO] Apache Hadoop YARN DistributedShell ............... SUCCESS [06:43 min]
[INFO] Apache Hadoop YARN Unmanaged Am Launcher .......... SUCCESS [ 30.948 s]
[INFO] Apache Hadoop YARN Site ........................... SUCCESS [  0.051 s]
[INFO] Apache Hadoop YARN Registry ....................... FAILURE [ 41.535 s]
[INFO] Apache Hadoop YARN Project ........................ SKIPPED
[INFO] ------------------------------------------------------------------------
[INFO] BUILD FAILURE
[INFO] ------------------------------------------------------------------------
[INFO] Total time: 01:28 h
[INFO] Finished at: 2015-09-18T21:11:18+00:00
[INFO] Final Memory: 99M/1037M
[INFO] ------------------------------------------------------------------------
[ERROR] Failed to execute goal org.apache.maven.plugins:maven-checkstyle-plugin:2.15:checkstyle
(default-cli) on project hadoop-yarn-registry: An error has occurred in Checkstyle report
generation. Failed during checkstyle execution: Unable to find configuration file at location:
checkstyle/checkstyle.xml: Could not find resource 'checkstyle/checkstyle.xml'. -> [Help
1]
[ERROR] 
[ERROR] To see the full stack trace of the errors, re-run Maven with the -e switch.
[ERROR] Re-run Maven using the -X switch to enable full debug logging.
[ERROR] 
[ERROR] For more information about the errors and possible solutions, please read the following
articles:
[ERROR] [Help 1] http://cwiki.apache.org/confluence/display/MAVEN/MojoExecutionException
[ERROR] 
[ERROR] After correcting the problems, you can resume the build with the command
[ERROR]   mvn <goals> -rf :hadoop-yarn-registry
Build step 'Execute shell' marked build as failure
Archiving artifacts
Recording test results
Sending e-mails to: yarn-dev@hadoop.apache.org
Email was triggered for: Failure
Sending email for trigger: Failure



###################################################################################
############################## FAILED TESTS (if any) ##############################
All tests passed
Mime
  • Unnamed multipart/mixed (inline, None, 0 bytes)
View raw message