hadoop-yarn-dev mailing list archives

Site index · List index
Message view « Date » · « Thread »
Top « Date » · « Thread »
From Apache Jenkins Server <jenk...@builds.apache.org>
Subject Failed: YARN-3591 PreCommit Build #9002
Date Thu, 03 Sep 2015 19:54:25 GMT
Jira: https://issues.apache.org/jira/browse/YARN-3591
Build: https://builds.apache.org/job/PreCommit-YARN-Build/9002/

###################################################################################
########################## LAST 60 LINES OF THE CONSOLE ###########################
[...truncated 294 lines...]
|  +1  |         whitespace  |  0m 1s     | The patch has no lines that end in 
|      |                     |            | whitespace.
|  +1  |            install  |  1m 28s    | mvn install still works. 
|  +1  |    eclipse:eclipse  |  0m 34s    | The patch built with 
|      |                     |            | eclipse:eclipse.
|  +1  |           findbugs  |  1m 15s    | The patch does not introduce any 
|      |                     |            | new Findbugs (version 3.0.0)
|      |                     |            | warnings.
|  -1  |         yarn tests  |  7m 30s    | Tests failed in 
|      |                     |            | hadoop-yarn-server-nodemanager.
|      |                     |  46m 20s   | 


             Reason | Tests
 Failed unit tests  |  hadoop.yarn.server.nodemanager.TestNodeStatusUpdaterForLabels 


|| Subsystem || Report/Notes ||
============================================================================
| Patch URL | http://issues.apache.org/jira/secure/attachment/12753942/YARN-3591.9.patch |
| Optional Tests | javadoc javac unit findbugs checkstyle |
| git revision | trunk / 53c38cc |
| checkstyle |  /home/jenkins/jenkins-slave/workspace/PreCommit-YARN-Build/patchprocess/diffcheckstylehadoop-yarn-server-nodemanager.txt
|
| hadoop-yarn-server-nodemanager test log | /home/jenkins/jenkins-slave/workspace/PreCommit-YARN-Build/patchprocess/testrun_hadoop-yarn-server-nodemanager.txt
|
| Test Results | https://builds.apache.org/job/PreCommit-YARN-Build/9002/testReport/ |
| Java | 1.7.0_55 |
| uname | Linux asf907.gq1.ygridcore.net 3.13.0-36-lowlatency #63-Ubuntu SMP PREEMPT Wed Sep
3 21:56:12 UTC 2014 x86_64 x86_64 x86_64 GNU/Linux |


============================================================================
============================================================================
                          Adding comment to JIRA
============================================================================
============================================================================


Comment added.
50ff4f295954cd31b27e56b0cc75118070adb7ac logged out


============================================================================
============================================================================
                              Finished build.
============================================================================
============================================================================


Build step 'Execute shell' marked build as failure
Archiving artifacts
Sending artifact delta relative to PreCommit-YARN-Build #8944
Archived 30 artifacts
Archive block size is 32768
Received 37 blocks and 11028586 bytes
Compression is 9.9%
Took 4.4 sec
[description-setter] Could not determine description.
Recording test results
Email was triggered for: Failure
Sending email for trigger: Failure



###################################################################################
############################## FAILED TESTS (if any) ##############################
1 tests failed.
FAILED:  org.apache.hadoop.yarn.server.nodemanager.TestNodeStatusUpdaterForLabels.testNodeStatusUpdaterForNodeLabels

Error Message:
null

Stack Trace:
java.lang.NullPointerException: null
	at java.util.HashSet.<init>(HashSet.java:116)
	at org.apache.hadoop.yarn.nodelabels.NodeLabelTestBase.assertNLCollectionEquals(NodeLabelTestBase.java:103)
	at org.apache.hadoop.yarn.server.nodemanager.TestNodeStatusUpdaterForLabels.testNodeStatusUpdaterForNodeLabels(TestNodeStatusUpdaterForLabels.java:268)



Mime
  • Unnamed multipart/mixed (inline, None, 0 bytes)
View raw message