hadoop-yarn-dev mailing list archives

Site index · List index
Message view « Date » · « Thread »
Top « Date » · « Thread »
From Apache Jenkins Server <jenk...@builds.apache.org>
Subject Build failed in Jenkins: Hadoop-Yarn-trunk-Java8 #472
Date Wed, 30 Sep 2015 15:50:22 GMT
See <https://builds.apache.org/job/Hadoop-Yarn-trunk-Java8/472/changes>

Changes:

[jlowe] YARN-3727. For better error recovery, check if the directory exists

------------------------------------------
[...truncated 4289 lines...]
Java HotSpot(TM) 64-Bit Server VM warning: ignoring option MaxPermSize=768m; support was removed
in 8.0
Running org.apache.hadoop.yarn.server.nodemanager.webapp.TestNMWebServicesContainers
Tests run: 12, Failures: 0, Errors: 0, Skipped: 0, Time elapsed: 5.796 sec - in org.apache.hadoop.yarn.server.nodemanager.webapp.TestNMWebServicesContainers
Java HotSpot(TM) 64-Bit Server VM warning: ignoring option MaxPermSize=768m; support was removed
in 8.0
Running org.apache.hadoop.yarn.server.nodemanager.webapp.TestNMWebServer
Tests run: 3, Failures: 0, Errors: 0, Skipped: 0, Time elapsed: 2.202 sec - in org.apache.hadoop.yarn.server.nodemanager.webapp.TestNMWebServer
Java HotSpot(TM) 64-Bit Server VM warning: ignoring option MaxPermSize=768m; support was removed
in 8.0
Running org.apache.hadoop.yarn.server.nodemanager.webapp.TestNMWebServicesApps
Tests run: 19, Failures: 0, Errors: 0, Skipped: 0, Time elapsed: 7.415 sec - in org.apache.hadoop.yarn.server.nodemanager.webapp.TestNMWebServicesApps
Java HotSpot(TM) 64-Bit Server VM warning: ignoring option MaxPermSize=768m; support was removed
in 8.0
Running org.apache.hadoop.yarn.server.nodemanager.recovery.TestNMLeveldbStateStoreService
Tests run: 12, Failures: 0, Errors: 0, Skipped: 0, Time elapsed: 1.734 sec - in org.apache.hadoop.yarn.server.nodemanager.recovery.TestNMLeveldbStateStoreService
Java HotSpot(TM) 64-Bit Server VM warning: ignoring option MaxPermSize=768m; support was removed
in 8.0
Running org.apache.hadoop.yarn.server.nodemanager.TestNodeManager
Tests run: 2, Failures: 0, Errors: 0, Skipped: 0, Time elapsed: 1.018 sec - in org.apache.hadoop.yarn.server.nodemanager.TestNodeManager
Java HotSpot(TM) 64-Bit Server VM warning: ignoring option MaxPermSize=768m; support was removed
in 8.0
Running org.apache.hadoop.yarn.server.nodemanager.TestNodeHealthService
Tests run: 1, Failures: 0, Errors: 0, Skipped: 0, Time elapsed: 0.899 sec - in org.apache.hadoop.yarn.server.nodemanager.TestNodeHealthService
Java HotSpot(TM) 64-Bit Server VM warning: ignoring option MaxPermSize=768m; support was removed
in 8.0
Running org.apache.hadoop.yarn.server.nodemanager.util.TestCgroupsLCEResourcesHandler
Tests run: 5, Failures: 0, Errors: 0, Skipped: 0, Time elapsed: 1.064 sec - in org.apache.hadoop.yarn.server.nodemanager.util.TestCgroupsLCEResourcesHandler
Java HotSpot(TM) 64-Bit Server VM warning: ignoring option MaxPermSize=768m; support was removed
in 8.0
Running org.apache.hadoop.yarn.server.nodemanager.util.TestNodeManagerHardwareUtils
Tests run: 3, Failures: 0, Errors: 0, Skipped: 0, Time elapsed: 0.671 sec - in org.apache.hadoop.yarn.server.nodemanager.util.TestNodeManagerHardwareUtils
Java HotSpot(TM) 64-Bit Server VM warning: ignoring option MaxPermSize=768m; support was removed
in 8.0
Running org.apache.hadoop.yarn.server.nodemanager.util.TestProcessIdFileReader
Tests run: 3, Failures: 0, Errors: 0, Skipped: 0, Time elapsed: 0.184 sec - in org.apache.hadoop.yarn.server.nodemanager.util.TestProcessIdFileReader
Java HotSpot(TM) 64-Bit Server VM warning: ignoring option MaxPermSize=768m; support was removed
in 8.0
Running org.apache.hadoop.yarn.server.nodemanager.TestNodeStatusUpdaterForLabels
Tests run: 2, Failures: 0, Errors: 0, Skipped: 0, Time elapsed: 4.759 sec - in org.apache.hadoop.yarn.server.nodemanager.TestNodeStatusUpdaterForLabels
Java HotSpot(TM) 64-Bit Server VM warning: ignoring option MaxPermSize=768m; support was removed
in 8.0
Running org.apache.hadoop.yarn.server.nodemanager.api.protocolrecords.impl.pb.TestPBLocalizerRPC
Tests run: 1, Failures: 0, Errors: 0, Skipped: 0, Time elapsed: 0.934 sec - in org.apache.hadoop.yarn.server.nodemanager.api.protocolrecords.impl.pb.TestPBLocalizerRPC
Java HotSpot(TM) 64-Bit Server VM warning: ignoring option MaxPermSize=768m; support was removed
in 8.0
Running org.apache.hadoop.yarn.server.nodemanager.api.protocolrecords.impl.pb.TestPBRecordImpl
Tests run: 4, Failures: 0, Errors: 0, Skipped: 0, Time elapsed: 0.53 sec - in org.apache.hadoop.yarn.server.nodemanager.api.protocolrecords.impl.pb.TestPBRecordImpl
Java HotSpot(TM) 64-Bit Server VM warning: ignoring option MaxPermSize=768m; support was removed
in 8.0
Running org.apache.hadoop.yarn.server.nodemanager.TestNodeStatusUpdater
Tests run: 15, Failures: 0, Errors: 0, Skipped: 0, Time elapsed: 65.591 sec - in org.apache.hadoop.yarn.server.nodemanager.TestNodeStatusUpdater
Java HotSpot(TM) 64-Bit Server VM warning: ignoring option MaxPermSize=768m; support was removed
in 8.0
Running org.apache.hadoop.yarn.server.nodemanager.TestContainerExecutor
Tests run: 5, Failures: 0, Errors: 0, Skipped: 3, Time elapsed: 0.671 sec - in org.apache.hadoop.yarn.server.nodemanager.TestContainerExecutor
Java HotSpot(TM) 64-Bit Server VM warning: ignoring option MaxPermSize=768m; support was removed
in 8.0
Running org.apache.hadoop.yarn.server.nodemanager.TestDockerContainerExecutor
Tests run: 1, Failures: 0, Errors: 0, Skipped: 0, Time elapsed: 4.655 sec - in org.apache.hadoop.yarn.server.nodemanager.TestDockerContainerExecutor
Java HotSpot(TM) 64-Bit Server VM warning: ignoring option MaxPermSize=768m; support was removed
in 8.0
Running org.apache.hadoop.yarn.server.nodemanager.nodelabels.TestConfigurationNodeLabelsProvider
Tests run: 3, Failures: 0, Errors: 0, Skipped: 0, Time elapsed: 2.679 sec - in org.apache.hadoop.yarn.server.nodemanager.nodelabels.TestConfigurationNodeLabelsProvider
Java HotSpot(TM) 64-Bit Server VM warning: ignoring option MaxPermSize=768m; support was removed
in 8.0
Running org.apache.hadoop.yarn.server.nodemanager.TestContainerManagerWithLCE
Tests run: 14, Failures: 0, Errors: 0, Skipped: 0, Time elapsed: 1.628 sec - in org.apache.hadoop.yarn.server.nodemanager.TestContainerManagerWithLCE
Java HotSpot(TM) 64-Bit Server VM warning: ignoring option MaxPermSize=768m; support was removed
in 8.0
Running org.apache.hadoop.yarn.server.nodemanager.TestNMAuditLogger
Tests run: 3, Failures: 0, Errors: 0, Skipped: 0, Time elapsed: 0.881 sec - in org.apache.hadoop.yarn.server.nodemanager.TestNMAuditLogger
Java HotSpot(TM) 64-Bit Server VM warning: ignoring option MaxPermSize=768m; support was removed
in 8.0
Running org.apache.hadoop.yarn.server.nodemanager.TestNodeResourceMonitor
Tests run: 1, Failures: 0, Errors: 0, Skipped: 0, Time elapsed: 1.247 sec - in org.apache.hadoop.yarn.server.nodemanager.TestNodeResourceMonitor
Java HotSpot(TM) 64-Bit Server VM warning: ignoring option MaxPermSize=768m; support was removed
in 8.0
Running org.apache.hadoop.yarn.server.nodemanager.containermanager.application.TestApplication
Tests run: 8, Failures: 0, Errors: 0, Skipped: 0, Time elapsed: 5.336 sec - in org.apache.hadoop.yarn.server.nodemanager.containermanager.application.TestApplication
Java HotSpot(TM) 64-Bit Server VM warning: ignoring option MaxPermSize=768m; support was removed
in 8.0
Running org.apache.hadoop.yarn.server.nodemanager.containermanager.TestNMProxy
Tests run: 2, Failures: 0, Errors: 0, Skipped: 0, Time elapsed: 3.892 sec - in org.apache.hadoop.yarn.server.nodemanager.containermanager.TestNMProxy
Java HotSpot(TM) 64-Bit Server VM warning: ignoring option MaxPermSize=768m; support was removed
in 8.0
Running org.apache.hadoop.yarn.server.nodemanager.containermanager.linux.privileged.TestPrivilegedOperationExecutor
Tests run: 4, Failures: 0, Errors: 0, Skipped: 0, Time elapsed: 0.464 sec - in org.apache.hadoop.yarn.server.nodemanager.containermanager.linux.privileged.TestPrivilegedOperationExecutor
Java HotSpot(TM) 64-Bit Server VM warning: ignoring option MaxPermSize=768m; support was removed
in 8.0
Running org.apache.hadoop.yarn.server.nodemanager.containermanager.linux.runtime.TestDockerContainerRuntime
Tests run: 2, Failures: 0, Errors: 0, Skipped: 0, Time elapsed: 0.659 sec - in org.apache.hadoop.yarn.server.nodemanager.containermanager.linux.runtime.TestDockerContainerRuntime
Java HotSpot(TM) 64-Bit Server VM warning: ignoring option MaxPermSize=768m; support was removed
in 8.0
Running org.apache.hadoop.yarn.server.nodemanager.containermanager.linux.resources.TestCGroupsBlkioResourceHandlerImpl
Tests run: 5, Failures: 0, Errors: 0, Skipped: 0, Time elapsed: 0.486 sec - in org.apache.hadoop.yarn.server.nodemanager.containermanager.linux.resources.TestCGroupsBlkioResourceHandlerImpl
Java HotSpot(TM) 64-Bit Server VM warning: ignoring option MaxPermSize=768m; support was removed
in 8.0
Running org.apache.hadoop.yarn.server.nodemanager.containermanager.linux.resources.TestTrafficController
Tests run: 5, Failures: 0, Errors: 0, Skipped: 0, Time elapsed: 0.738 sec - in org.apache.hadoop.yarn.server.nodemanager.containermanager.linux.resources.TestTrafficController
Java HotSpot(TM) 64-Bit Server VM warning: ignoring option MaxPermSize=768m; support was removed
in 8.0
Running org.apache.hadoop.yarn.server.nodemanager.containermanager.linux.resources.TestCGroupsHandlerImpl
Tests run: 4, Failures: 0, Errors: 0, Skipped: 0, Time elapsed: 0.693 sec - in org.apache.hadoop.yarn.server.nodemanager.containermanager.linux.resources.TestCGroupsHandlerImpl
Java HotSpot(TM) 64-Bit Server VM warning: ignoring option MaxPermSize=768m; support was removed
in 8.0
Running org.apache.hadoop.yarn.server.nodemanager.containermanager.linux.resources.TestTrafficControlBandwidthHandlerImpl
Tests run: 2, Failures: 0, Errors: 0, Skipped: 0, Time elapsed: 0.73 sec - in org.apache.hadoop.yarn.server.nodemanager.containermanager.linux.resources.TestTrafficControlBandwidthHandlerImpl
Java HotSpot(TM) 64-Bit Server VM warning: ignoring option MaxPermSize=768m; support was removed
in 8.0
Running org.apache.hadoop.yarn.server.nodemanager.containermanager.linux.resources.TestResourceHandlerModule
Tests run: 2, Failures: 0, Errors: 0, Skipped: 0, Time elapsed: 0.539 sec - in org.apache.hadoop.yarn.server.nodemanager.containermanager.linux.resources.TestResourceHandlerModule
Java HotSpot(TM) 64-Bit Server VM warning: ignoring option MaxPermSize=768m; support was removed
in 8.0
Running org.apache.hadoop.yarn.server.nodemanager.containermanager.monitor.TestContainersMonitorResourceChange
Tests run: 2, Failures: 0, Errors: 0, Skipped: 0, Time elapsed: 2.599 sec - in org.apache.hadoop.yarn.server.nodemanager.containermanager.monitor.TestContainersMonitorResourceChange
Java HotSpot(TM) 64-Bit Server VM warning: ignoring option MaxPermSize=768m; support was removed
in 8.0
Running org.apache.hadoop.yarn.server.nodemanager.containermanager.monitor.TestContainersMonitor
Tests run: 3, Failures: 0, Errors: 0, Skipped: 0, Time elapsed: 7.117 sec - in org.apache.hadoop.yarn.server.nodemanager.containermanager.monitor.TestContainersMonitor
Java HotSpot(TM) 64-Bit Server VM warning: ignoring option MaxPermSize=768m; support was removed
in 8.0
Running org.apache.hadoop.yarn.server.nodemanager.containermanager.monitor.TestContainerMetrics
Tests run: 2, Failures: 0, Errors: 0, Skipped: 0, Time elapsed: 0.864 sec - in org.apache.hadoop.yarn.server.nodemanager.containermanager.monitor.TestContainerMetrics
Java HotSpot(TM) 64-Bit Server VM warning: ignoring option MaxPermSize=768m; support was removed
in 8.0
Running org.apache.hadoop.yarn.server.nodemanager.containermanager.logaggregation.TestLogAggregationService
Tests run: 35, Failures: 1, Errors: 0, Skipped: 0, Time elapsed: 106.495 sec <<<
FAILURE! - in org.apache.hadoop.yarn.server.nodemanager.containermanager.logaggregation.TestLogAggregationService
testLogAggregationServiceWithInterval(org.apache.hadoop.yarn.server.nodemanager.containermanager.logaggregation.TestLogAggregationService)
 Time elapsed: 6.629 sec  <<< FAILURE!
java.lang.AssertionError: expected:<-1> but was:<1>
	at org.junit.Assert.fail(Assert.java:88)
	at org.junit.Assert.failNotEquals(Assert.java:743)
	at org.junit.Assert.assertEquals(Assert.java:118)
	at org.junit.Assert.assertEquals(Assert.java:555)
	at org.junit.Assert.assertEquals(Assert.java:542)
	at org.apache.hadoop.yarn.server.nodemanager.containermanager.logaggregation.TestLogAggregationService.testLogAggregationService(TestLogAggregationService.java:2012)
	at org.apache.hadoop.yarn.server.nodemanager.containermanager.logaggregation.TestLogAggregationService.testLogAggregationServiceWithInterval(TestLogAggregationService.java:1906)

Java HotSpot(TM) 64-Bit Server VM warning: ignoring option MaxPermSize=768m; support was removed
in 8.0
Running org.apache.hadoop.yarn.server.nodemanager.containermanager.localizer.TestLocalCacheDirectoryManager
Tests run: 5, Failures: 0, Errors: 0, Skipped: 0, Time elapsed: 1.147 sec - in org.apache.hadoop.yarn.server.nodemanager.containermanager.localizer.TestLocalCacheDirectoryManager
Java HotSpot(TM) 64-Bit Server VM warning: ignoring option MaxPermSize=768m; support was removed
in 8.0
Running org.apache.hadoop.yarn.server.nodemanager.containermanager.localizer.TestLocalResource
Tests run: 2, Failures: 0, Errors: 0, Skipped: 0, Time elapsed: 0.348 sec - in org.apache.hadoop.yarn.server.nodemanager.containermanager.localizer.TestLocalResource
Java HotSpot(TM) 64-Bit Server VM warning: ignoring option MaxPermSize=768m; support was removed
in 8.0
Running org.apache.hadoop.yarn.server.nodemanager.containermanager.localizer.sharedcache.TestSharedCacheUploadService
Tests run: 2, Failures: 0, Errors: 0, Skipped: 0, Time elapsed: 0.713 sec - in org.apache.hadoop.yarn.server.nodemanager.containermanager.localizer.sharedcache.TestSharedCacheUploadService
Java HotSpot(TM) 64-Bit Server VM warning: ignoring option MaxPermSize=768m; support was removed
in 8.0
Running org.apache.hadoop.yarn.server.nodemanager.containermanager.localizer.sharedcache.TestSharedCacheUploader
Tests run: 6, Failures: 0, Errors: 0, Skipped: 0, Time elapsed: 0.954 sec - in org.apache.hadoop.yarn.server.nodemanager.containermanager.localizer.sharedcache.TestSharedCacheUploader
Java HotSpot(TM) 64-Bit Server VM warning: ignoring option MaxPermSize=768m; support was removed
in 8.0
Running org.apache.hadoop.yarn.server.nodemanager.containermanager.localizer.TestLocalResourcesTrackerImpl
Tests run: 10, Failures: 0, Errors: 0, Skipped: 0, Time elapsed: 1.265 sec - in org.apache.hadoop.yarn.server.nodemanager.containermanager.localizer.TestLocalResourcesTrackerImpl
Java HotSpot(TM) 64-Bit Server VM warning: ignoring option MaxPermSize=768m; support was removed
in 8.0
Running org.apache.hadoop.yarn.server.nodemanager.containermanager.localizer.TestContainerLocalizer
Tests run: 3, Failures: 0, Errors: 0, Skipped: 0, Time elapsed: 1.256 sec - in org.apache.hadoop.yarn.server.nodemanager.containermanager.localizer.TestContainerLocalizer
Java HotSpot(TM) 64-Bit Server VM warning: ignoring option MaxPermSize=768m; support was removed
in 8.0
Running org.apache.hadoop.yarn.server.nodemanager.containermanager.localizer.TestLocalizedResource
Tests run: 1, Failures: 0, Errors: 0, Skipped: 0, Time elapsed: 0.577 sec - in org.apache.hadoop.yarn.server.nodemanager.containermanager.localizer.TestLocalizedResource
Java HotSpot(TM) 64-Bit Server VM warning: ignoring option MaxPermSize=768m; support was removed
in 8.0
Running org.apache.hadoop.yarn.server.nodemanager.containermanager.localizer.TestResourceLocalizationService
Tests run: 13, Failures: 0, Errors: 0, Skipped: 0, Time elapsed: 5.786 sec - in org.apache.hadoop.yarn.server.nodemanager.containermanager.localizer.TestResourceLocalizationService
Java HotSpot(TM) 64-Bit Server VM warning: ignoring option MaxPermSize=768m; support was removed
in 8.0
Running org.apache.hadoop.yarn.server.nodemanager.containermanager.localizer.TestResourceRetention
Tests run: 1, Failures: 0, Errors: 0, Skipped: 0, Time elapsed: 0.856 sec - in org.apache.hadoop.yarn.server.nodemanager.containermanager.localizer.TestResourceRetention
Java HotSpot(TM) 64-Bit Server VM warning: ignoring option MaxPermSize=768m; support was removed
in 8.0
Running org.apache.hadoop.yarn.server.nodemanager.containermanager.launcher.TestContainerLaunch
Tests run: 17, Failures: 0, Errors: 0, Skipped: 5, Time elapsed: 20.295 sec - in org.apache.hadoop.yarn.server.nodemanager.containermanager.launcher.TestContainerLaunch
Java HotSpot(TM) 64-Bit Server VM warning: ignoring option MaxPermSize=768m; support was removed
in 8.0
Running org.apache.hadoop.yarn.server.nodemanager.containermanager.TestContainerManager
Tests run: 14, Failures: 0, Errors: 0, Skipped: 0, Time elapsed: 33.567 sec - in org.apache.hadoop.yarn.server.nodemanager.containermanager.TestContainerManager
Java HotSpot(TM) 64-Bit Server VM warning: ignoring option MaxPermSize=768m; support was removed
in 8.0
Running org.apache.hadoop.yarn.server.nodemanager.containermanager.TestAuxServices
Tests run: 6, Failures: 0, Errors: 0, Skipped: 0, Time elapsed: 0.915 sec - in org.apache.hadoop.yarn.server.nodemanager.containermanager.TestAuxServices
Java HotSpot(TM) 64-Bit Server VM warning: ignoring option MaxPermSize=768m; support was removed
in 8.0
Running org.apache.hadoop.yarn.server.nodemanager.containermanager.loghandler.TestNonAggregatingLogHandler
Tests run: 6, Failures: 0, Errors: 0, Skipped: 0, Time elapsed: 1.336 sec - in org.apache.hadoop.yarn.server.nodemanager.containermanager.loghandler.TestNonAggregatingLogHandler
Java HotSpot(TM) 64-Bit Server VM warning: ignoring option MaxPermSize=768m; support was removed
in 8.0
Running org.apache.hadoop.yarn.server.nodemanager.containermanager.container.TestContainer
Tests run: 18, Failures: 0, Errors: 0, Skipped: 0, Time elapsed: 1.824 sec - in org.apache.hadoop.yarn.server.nodemanager.containermanager.container.TestContainer
Java HotSpot(TM) 64-Bit Server VM warning: ignoring option MaxPermSize=768m; support was removed
in 8.0
Running org.apache.hadoop.yarn.server.nodemanager.containermanager.TestContainerManagerRecovery
Tests run: 3, Failures: 0, Errors: 0, Skipped: 0, Time elapsed: 31.76 sec - in org.apache.hadoop.yarn.server.nodemanager.containermanager.TestContainerManagerRecovery
Java HotSpot(TM) 64-Bit Server VM warning: ignoring option MaxPermSize=768m; support was removed
in 8.0
Running org.apache.hadoop.yarn.server.nodemanager.TestRecordFactory
Tests run: 1, Failures: 0, Errors: 0, Skipped: 0, Time elapsed: 0.251 sec - in org.apache.hadoop.yarn.server.nodemanager.TestRecordFactory
Java HotSpot(TM) 64-Bit Server VM warning: ignoring option MaxPermSize=768m; support was removed
in 8.0
Running org.apache.hadoop.yarn.server.nodemanager.TestEventFlow
Tests run: 1, Failures: 0, Errors: 0, Skipped: 0, Time elapsed: 5.7 sec - in org.apache.hadoop.yarn.server.nodemanager.TestEventFlow
Java HotSpot(TM) 64-Bit Server VM warning: ignoring option MaxPermSize=768m; support was removed
in 8.0
Running org.apache.hadoop.yarn.server.nodemanager.security.TestNMContainerTokenSecretManager
Tests run: 1, Failures: 0, Errors: 0, Skipped: 0, Time elapsed: 1.007 sec - in org.apache.hadoop.yarn.server.nodemanager.security.TestNMContainerTokenSecretManager
Java HotSpot(TM) 64-Bit Server VM warning: ignoring option MaxPermSize=768m; support was removed
in 8.0
Running org.apache.hadoop.yarn.server.nodemanager.security.TestNMTokenSecretManagerInNM
Tests run: 1, Failures: 0, Errors: 0, Skipped: 0, Time elapsed: 1.063 sec - in org.apache.hadoop.yarn.server.nodemanager.security.TestNMTokenSecretManagerInNM
Java HotSpot(TM) 64-Bit Server VM warning: ignoring option MaxPermSize=768m; support was removed
in 8.0
Running org.apache.hadoop.yarn.server.nodemanager.TestRPCFactories
Tests run: 1, Failures: 0, Errors: 0, Skipped: 0, Time elapsed: 0.699 sec - in org.apache.hadoop.yarn.server.nodemanager.TestRPCFactories
Java HotSpot(TM) 64-Bit Server VM warning: ignoring option MaxPermSize=768m; support was removed
in 8.0
Running org.apache.hadoop.yarn.server.nodemanager.TestDeletionService
Tests run: 6, Failures: 0, Errors: 0, Skipped: 0, Time elapsed: 22.748 sec - in org.apache.hadoop.yarn.server.nodemanager.TestDeletionService
Java HotSpot(TM) 64-Bit Server VM warning: ignoring option MaxPermSize=768m; support was removed
in 8.0
Running org.apache.hadoop.yarn.server.nodemanager.amrmproxy.TestAMRMProxyService
Tests run: 16, Failures: 0, Errors: 0, Skipped: 0, Time elapsed: 1.66 sec - in org.apache.hadoop.yarn.server.nodemanager.amrmproxy.TestAMRMProxyService
Java HotSpot(TM) 64-Bit Server VM warning: ignoring option MaxPermSize=768m; support was removed
in 8.0
Running org.apache.hadoop.yarn.server.nodemanager.TestDefaultContainerExecutor
Tests run: 3, Failures: 0, Errors: 0, Skipped: 0, Time elapsed: 11.452 sec - in org.apache.hadoop.yarn.server.nodemanager.TestDefaultContainerExecutor
Java HotSpot(TM) 64-Bit Server VM warning: ignoring option MaxPermSize=768m; support was removed
in 8.0
Running org.apache.hadoop.yarn.server.nodemanager.TestNodeManagerShutdown
Tests run: 2, Failures: 0, Errors: 0, Skipped: 0, Time elapsed: 5.835 sec - in org.apache.hadoop.yarn.server.nodemanager.TestNodeManagerShutdown
Java HotSpot(TM) 64-Bit Server VM warning: ignoring option MaxPermSize=768m; support was removed
in 8.0
Running org.apache.hadoop.yarn.server.nodemanager.TestDockerContainerExecutorWithMocks
Tests run: 4, Failures: 0, Errors: 0, Skipped: 0, Time elapsed: 1.103 sec - in org.apache.hadoop.yarn.server.nodemanager.TestDockerContainerExecutorWithMocks
Java HotSpot(TM) 64-Bit Server VM warning: ignoring option MaxPermSize=768m; support was removed
in 8.0
Running org.apache.hadoop.yarn.server.nodemanager.metrics.TestNodeManagerMetrics
Tests run: 1, Failures: 0, Errors: 0, Skipped: 0, Time elapsed: 0.737 sec - in org.apache.hadoop.yarn.server.nodemanager.metrics.TestNodeManagerMetrics
Java HotSpot(TM) 64-Bit Server VM warning: ignoring option MaxPermSize=768m; support was removed
in 8.0
Running org.apache.hadoop.yarn.server.nodemanager.TestLocalDirsHandlerService
Tests run: 3, Failures: 0, Errors: 0, Skipped: 0, Time elapsed: 0.794 sec - in org.apache.hadoop.yarn.server.nodemanager.TestLocalDirsHandlerService
Java HotSpot(TM) 64-Bit Server VM warning: ignoring option MaxPermSize=768m; support was removed
in 8.0
Running org.apache.hadoop.yarn.server.nodemanager.TestNodeManagerResync
Tests run: 6, Failures: 0, Errors: 0, Skipped: 0, Time elapsed: 28.135 sec - in org.apache.hadoop.yarn.server.nodemanager.TestNodeManagerResync
Java HotSpot(TM) 64-Bit Server VM warning: ignoring option MaxPermSize=768m; support was removed
in 8.0
Running org.apache.hadoop.yarn.server.nodemanager.TestNodeManagerReboot
Tests run: 1, Failures: 0, Errors: 0, Skipped: 0, Time elapsed: 5.864 sec - in org.apache.hadoop.yarn.server.nodemanager.TestNodeManagerReboot
Java HotSpot(TM) 64-Bit Server VM warning: ignoring option MaxPermSize=768m; support was removed
in 8.0
Running org.apache.hadoop.yarn.server.nodemanager.TestLinuxContainerExecutorWithMocks
Tests run: 8, Failures: 0, Errors: 0, Skipped: 0, Time elapsed: 1.017 sec - in org.apache.hadoop.yarn.server.nodemanager.TestLinuxContainerExecutorWithMocks

Results :

Failed tests: 
  TestLogAggregationService.testLogAggregationServiceWithInterval:1906->testLogAggregationService:2012
expected:<-1> but was:<1>

Tests run: 378, Failures: 1, Errors: 0, Skipped: 17

[INFO] ------------------------------------------------------------------------
[INFO] Reactor Summary:
[INFO] 
[INFO] Apache Hadoop YARN ................................ SUCCESS [  3.110 s]
[INFO] Apache Hadoop YARN API ............................ SUCCESS [01:17 min]
[INFO] Apache Hadoop YARN Common ......................... SUCCESS [02:32 min]
[INFO] Apache Hadoop YARN Server ......................... SUCCESS [  0.051 s]
[INFO] Apache Hadoop YARN Server Common .................. SUCCESS [ 38.266 s]
[INFO] Apache Hadoop YARN NodeManager .................... FAILURE [08:01 min]
[INFO] Apache Hadoop YARN Web Proxy ...................... SKIPPED
[INFO] Apache Hadoop YARN ApplicationHistoryService ...... SKIPPED
[INFO] Apache Hadoop YARN ResourceManager ................ SKIPPED
[INFO] Apache Hadoop YARN Server Tests ................... SKIPPED
[INFO] Apache Hadoop YARN Client ......................... SKIPPED
[INFO] Apache Hadoop YARN SharedCacheManager ............. SKIPPED
[INFO] Apache Hadoop YARN Applications ................... SKIPPED
[INFO] Apache Hadoop YARN DistributedShell ............... SKIPPED
[INFO] Apache Hadoop YARN Unmanaged Am Launcher .......... SKIPPED
[INFO] Apache Hadoop YARN Site ........................... SKIPPED
[INFO] Apache Hadoop YARN Registry ....................... SKIPPED
[INFO] Apache Hadoop YARN Project ........................ SKIPPED
[INFO] ------------------------------------------------------------------------
[INFO] BUILD FAILURE
[INFO] ------------------------------------------------------------------------
[INFO] Total time: 12:34 min
[INFO] Finished at: 2015-09-30T15:50:41+00:00
[INFO] Final Memory: 80M/1038M
[INFO] ------------------------------------------------------------------------
[ERROR] Failed to execute goal org.apache.maven.plugins:maven-surefire-plugin:2.17:test (default-test)
on project hadoop-yarn-server-nodemanager: There are test failures.
[ERROR] 
[ERROR] Please refer to <https://builds.apache.org/job/Hadoop-Yarn-trunk-Java8/ws/hadoop-yarn-project/hadoop-yarn/hadoop-yarn-server/hadoop-yarn-server-nodemanager/target/surefire-reports>
for the individual test results.
[ERROR] -> [Help 1]
[ERROR] 
[ERROR] To see the full stack trace of the errors, re-run Maven with the -e switch.
[ERROR] Re-run Maven using the -X switch to enable full debug logging.
[ERROR] 
[ERROR] For more information about the errors and possible solutions, please read the following
articles:
[ERROR] [Help 1] http://cwiki.apache.org/confluence/display/MAVEN/MojoFailureException
[ERROR] 
[ERROR] After correcting the problems, you can resume the build with the command
[ERROR]   mvn <goals> -rf :hadoop-yarn-server-nodemanager
Build step 'Execute shell' marked build as failure
Archiving artifacts
Recording test results
Updating YARN-3727

Mime
View raw message