hadoop-yarn-dev mailing list archives

Site index · List index
Message view « Date » · « Thread »
Top « Date » · « Thread »
From Apache Jenkins Server <jenk...@builds.apache.org>
Subject Build failed in Jenkins: Hadoop-Yarn-trunk-Java8 #420
Date Fri, 18 Sep 2015 21:11:10 GMT
See <https://builds.apache.org/job/Hadoop-Yarn-trunk-Java8/420/changes>

Changes:

[jlowe] Update CHANGES.txt to reflect commit of MR-5982 to 2.7.2

------------------------------------------
[...truncated 5674 lines...]
[INFO] ------------------------------------------------------------------------
[INFO] Building Apache Hadoop YARN Unmanaged Am Launcher 3.0.0-SNAPSHOT
[INFO] ------------------------------------------------------------------------
[INFO] 
[INFO] --- maven-clean-plugin:2.5:clean (default-clean) @ hadoop-yarn-applications-unmanaged-am-launcher
---
[INFO] Deleting <https://builds.apache.org/job/Hadoop-Yarn-trunk-Java8/ws/hadoop-yarn-project/hadoop-yarn/hadoop-yarn-applications/hadoop-yarn-applications-unmanaged-am-launcher/target>
[INFO] 
[INFO] --- maven-antrun-plugin:1.7:run (create-testdirs) @ hadoop-yarn-applications-unmanaged-am-launcher
---
[INFO] Executing tasks

main:
    [mkdir] Created dir: <https://builds.apache.org/job/Hadoop-Yarn-trunk-Java8/ws/hadoop-yarn-project/hadoop-yarn/hadoop-yarn-applications/hadoop-yarn-applications-unmanaged-am-launcher/target/test-dir>
[INFO] Executed tasks
[INFO] 
[INFO] --- maven-resources-plugin:2.6:resources (default-resources) @ hadoop-yarn-applications-unmanaged-am-launcher
---
[INFO] Using 'UTF-8' encoding to copy filtered resources.
[INFO] skip non existing resourceDirectory <https://builds.apache.org/job/Hadoop-Yarn-trunk-Java8/ws/hadoop-yarn-project/hadoop-yarn/hadoop-yarn-applications/hadoop-yarn-applications-unmanaged-am-launcher/src/main/resources>
[INFO] 
[INFO] --- maven-compiler-plugin:3.1:compile (default-compile) @ hadoop-yarn-applications-unmanaged-am-launcher
---
[INFO] Changes detected - recompiling the module!
[INFO] Compiling 1 source file to <https://builds.apache.org/job/Hadoop-Yarn-trunk-Java8/ws/hadoop-yarn-project/hadoop-yarn/hadoop-yarn-applications/hadoop-yarn-applications-unmanaged-am-launcher/target/classes>
[INFO] 
[INFO] --- maven-resources-plugin:2.6:testResources (default-testResources) @ hadoop-yarn-applications-unmanaged-am-launcher
---
[INFO] Using 'UTF-8' encoding to copy filtered resources.
[INFO] Copying 2 resources
[INFO] 
[INFO] --- maven-compiler-plugin:3.1:testCompile (default-testCompile) @ hadoop-yarn-applications-unmanaged-am-launcher
---
[INFO] Changes detected - recompiling the module!
[INFO] Compiling 1 source file to <https://builds.apache.org/job/Hadoop-Yarn-trunk-Java8/ws/hadoop-yarn-project/hadoop-yarn/hadoop-yarn-applications/hadoop-yarn-applications-unmanaged-am-launcher/target/test-classes>
[INFO] 
[INFO] --- maven-surefire-plugin:2.17:test (default-test) @ hadoop-yarn-applications-unmanaged-am-launcher
---
[INFO] Surefire report directory: <https://builds.apache.org/job/Hadoop-Yarn-trunk-Java8/ws/hadoop-yarn-project/hadoop-yarn/hadoop-yarn-applications/hadoop-yarn-applications-unmanaged-am-launcher/target/surefire-reports>

-------------------------------------------------------
 T E S T S
-------------------------------------------------------

-------------------------------------------------------
 T E S T S
-------------------------------------------------------
Java HotSpot(TM) 64-Bit Server VM warning: ignoring option MaxPermSize=768m; support was removed
in 8.0
Running org.apache.hadoop.yarn.applications.unmanagedamlauncher.TestUnmanagedAMLauncher
Tests run: 2, Failures: 0, Errors: 0, Skipped: 0, Time elapsed: 24.137 sec - in org.apache.hadoop.yarn.applications.unmanagedamlauncher.TestUnmanagedAMLauncher

Results :

Tests run: 2, Failures: 0, Errors: 0, Skipped: 0

[INFO] 
[INFO] --- maven-jar-plugin:2.5:jar (default-jar) @ hadoop-yarn-applications-unmanaged-am-launcher
---
[INFO] Building jar: <https://builds.apache.org/job/Hadoop-Yarn-trunk-Java8/ws/hadoop-yarn-project/hadoop-yarn/hadoop-yarn-applications/hadoop-yarn-applications-unmanaged-am-launcher/target/hadoop-yarn-applications-unmanaged-am-launcher-3.0.0-SNAPSHOT.jar>
[INFO] 
[INFO] --- maven-source-plugin:2.3:jar-no-fork (hadoop-java-sources) @ hadoop-yarn-applications-unmanaged-am-launcher
---
[INFO] Building jar: <https://builds.apache.org/job/Hadoop-Yarn-trunk-Java8/ws/hadoop-yarn-project/hadoop-yarn/hadoop-yarn-applications/hadoop-yarn-applications-unmanaged-am-launcher/target/hadoop-yarn-applications-unmanaged-am-launcher-3.0.0-SNAPSHOT-sources.jar>
[INFO] 
[INFO] --- maven-source-plugin:2.3:test-jar-no-fork (hadoop-java-sources) @ hadoop-yarn-applications-unmanaged-am-launcher
---
[INFO] Building jar: <https://builds.apache.org/job/Hadoop-Yarn-trunk-Java8/ws/hadoop-yarn-project/hadoop-yarn/hadoop-yarn-applications/hadoop-yarn-applications-unmanaged-am-launcher/target/hadoop-yarn-applications-unmanaged-am-launcher-3.0.0-SNAPSHOT-test-sources.jar>
[INFO] 
[INFO] --- maven-enforcer-plugin:1.3.1:enforce (dist-enforce) @ hadoop-yarn-applications-unmanaged-am-launcher
---
[INFO] 
[INFO] --- maven-site-plugin:3.4:attach-descriptor (attach-descriptor) @ hadoop-yarn-applications-unmanaged-am-launcher
---
[INFO] 
[INFO] --- maven-javadoc-plugin:2.8.1:jar (module-javadocs) @ hadoop-yarn-applications-unmanaged-am-launcher
---
[INFO] Skipping javadoc generation
[INFO] 
[INFO] --- maven-enforcer-plugin:1.3.1:enforce (depcheck) @ hadoop-yarn-applications-unmanaged-am-launcher
---
[INFO] 
[INFO] --- maven-checkstyle-plugin:2.15:checkstyle (default-cli) @ hadoop-yarn-applications-unmanaged-am-launcher
---
[INFO] There are 7 errors reported by Checkstyle 6.6 with checkstyle/checkstyle.xml ruleset.
[WARNING] Unable to locate Source XRef to link to - DISABLED
[INFO] 
[INFO] --- findbugs-maven-plugin:3.0.0:findbugs (default-cli) @ hadoop-yarn-applications-unmanaged-am-launcher
---
[INFO] Fork Value is true
[INFO] Done FindBugs Analysis....
[INFO]                                                                         
[INFO] ------------------------------------------------------------------------
[INFO] Building Apache Hadoop YARN Site 3.0.0-SNAPSHOT
[INFO] ------------------------------------------------------------------------
[INFO] 
[INFO] --- maven-clean-plugin:2.5:clean (default-clean) @ hadoop-yarn-site ---
[INFO] Deleting <https://builds.apache.org/job/Hadoop-Yarn-trunk-Java8/ws/hadoop-yarn-project/hadoop-yarn/hadoop-yarn-site/target>
[INFO] 
[INFO] --- maven-antrun-plugin:1.7:run (create-testdirs) @ hadoop-yarn-site ---
[INFO] Executing tasks

main:
    [mkdir] Created dir: <https://builds.apache.org/job/Hadoop-Yarn-trunk-Java8/ws/hadoop-yarn-project/hadoop-yarn/hadoop-yarn-site/target/test-dir>
[INFO] Executed tasks
[INFO] 
[INFO] --- maven-source-plugin:2.3:jar-no-fork (hadoop-java-sources) @ hadoop-yarn-site ---
[INFO] 
[INFO] --- maven-source-plugin:2.3:test-jar-no-fork (hadoop-java-sources) @ hadoop-yarn-site
---
[INFO] 
[INFO] --- maven-enforcer-plugin:1.3.1:enforce (dist-enforce) @ hadoop-yarn-site ---
[INFO] 
[INFO] --- maven-site-plugin:3.4:attach-descriptor (attach-descriptor) @ hadoop-yarn-site
---
[INFO] 
[INFO] --- maven-javadoc-plugin:2.8.1:jar (module-javadocs) @ hadoop-yarn-site ---
[INFO] Skipping javadoc generation
[INFO] 
[INFO] --- maven-enforcer-plugin:1.3.1:enforce (depcheck) @ hadoop-yarn-site ---
[INFO] 
[INFO] --- maven-checkstyle-plugin:2.15:checkstyle (default-cli) @ hadoop-yarn-site ---
[INFO] 
[INFO] --- findbugs-maven-plugin:3.0.0:findbugs (default-cli) @ hadoop-yarn-site ---
[INFO]                                                                         
[INFO] ------------------------------------------------------------------------
[INFO] Building Apache Hadoop YARN Registry 3.0.0-SNAPSHOT
[INFO] ------------------------------------------------------------------------
[INFO] 
[INFO] --- maven-clean-plugin:2.5:clean (default-clean) @ hadoop-yarn-registry ---
[INFO] Deleting <https://builds.apache.org/job/Hadoop-Yarn-trunk-Java8/ws/hadoop-yarn-project/hadoop-yarn/hadoop-yarn-registry/target>
[INFO] 
[INFO] --- maven-antrun-plugin:1.7:run (create-testdirs) @ hadoop-yarn-registry ---
[INFO] Executing tasks

main:
    [mkdir] Created dir: <https://builds.apache.org/job/Hadoop-Yarn-trunk-Java8/ws/hadoop-yarn-project/hadoop-yarn/hadoop-yarn-registry/target/test-dir>
[INFO] Executed tasks
[INFO] 
[INFO] --- hadoop-maven-plugins:3.0.0-SNAPSHOT:version-info (version-info) @ hadoop-yarn-registry
---
[WARNING] [svn, info] failed with error code 1
[INFO] SCM: GIT
[INFO] Computed MD5: b4e8b3c1bff74dd38a93e16b4aef10
[INFO] 
[INFO] --- maven-resources-plugin:2.6:resources (default-resources) @ hadoop-yarn-registry
---
[INFO] Using 'UTF-8' encoding to copy filtered resources.
[INFO] Copying 1 resource
[INFO] Copying 0 resource
[INFO] 
[INFO] --- maven-compiler-plugin:3.1:compile (default-compile) @ hadoop-yarn-registry ---
[INFO] Changes detected - recompiling the module!
[INFO] Compiling 48 source files to <https://builds.apache.org/job/Hadoop-Yarn-trunk-Java8/ws/hadoop-yarn-project/hadoop-yarn/hadoop-yarn-registry/target/classes>
[WARNING] <https://builds.apache.org/job/Hadoop-Yarn-trunk-Java8/ws/hadoop-yarn-project/hadoop-yarn/hadoop-yarn-registry/src/main/java/org/apache/hadoop/registry/client/types/Endpoint.java>:
<https://builds.apache.org/job/Hadoop-Yarn-trunk-Java8/ws/hadoop-yarn-project/hadoop-yarn/hadoop-yarn-registry/src/main/java/org/apache/hadoop/registry/client/types/Endpoint.java>
uses unchecked or unsafe operations.
[WARNING] <https://builds.apache.org/job/Hadoop-Yarn-trunk-Java8/ws/hadoop-yarn-project/hadoop-yarn/hadoop-yarn-registry/src/main/java/org/apache/hadoop/registry/client/types/Endpoint.java>:
Recompile with -Xlint:unchecked for details.
[INFO] 
[INFO] --- maven-resources-plugin:2.6:testResources (default-testResources) @ hadoop-yarn-registry
---
[INFO] Using 'UTF-8' encoding to copy filtered resources.
[INFO] Copying 1 resource
[INFO] 
[INFO] --- maven-compiler-plugin:3.1:testCompile (default-testCompile) @ hadoop-yarn-registry
---
[INFO] Changes detected - recompiling the module!
[INFO] Compiling 19 source files to <https://builds.apache.org/job/Hadoop-Yarn-trunk-Java8/ws/hadoop-yarn-project/hadoop-yarn/hadoop-yarn-registry/target/test-classes>
[INFO] 
[INFO] --- maven-jar-plugin:2.5:test-jar (default) @ hadoop-yarn-registry ---
[INFO] Building jar: <https://builds.apache.org/job/Hadoop-Yarn-trunk-Java8/ws/hadoop-yarn-project/hadoop-yarn/hadoop-yarn-registry/target/hadoop-yarn-registry-3.0.0-SNAPSHOT-tests.jar>
[INFO] 
[INFO] --- maven-surefire-plugin:2.17:test (default-test) @ hadoop-yarn-registry ---
[INFO] Surefire report directory: <https://builds.apache.org/job/Hadoop-Yarn-trunk-Java8/ws/hadoop-yarn-project/hadoop-yarn/hadoop-yarn-registry/target/surefire-reports>

-------------------------------------------------------
 T E S T S
-------------------------------------------------------

-------------------------------------------------------
 T E S T S
-------------------------------------------------------
Running org.apache.hadoop.registry.client.impl.TestMicroZookeeperService
Tests run: 1, Failures: 0, Errors: 0, Skipped: 0, Time elapsed: 0.557 sec - in org.apache.hadoop.registry.client.impl.TestMicroZookeeperService
Running org.apache.hadoop.registry.client.impl.TestCuratorService
Tests run: 20, Failures: 0, Errors: 0, Skipped: 0, Time elapsed: 4.664 sec - in org.apache.hadoop.registry.client.impl.TestCuratorService
Running org.apache.hadoop.registry.client.binding.TestMarshalling
Tests run: 10, Failures: 0, Errors: 0, Skipped: 0, Time elapsed: 0.563 sec - in org.apache.hadoop.registry.client.binding.TestMarshalling
Running org.apache.hadoop.registry.client.binding.TestRegistryOperationUtils
Tests run: 3, Failures: 0, Errors: 0, Skipped: 0, Time elapsed: 0.516 sec - in org.apache.hadoop.registry.client.binding.TestRegistryOperationUtils
Running org.apache.hadoop.registry.client.binding.TestRegistryPathUtils
Tests run: 13, Failures: 0, Errors: 0, Skipped: 0, Time elapsed: 0.393 sec - in org.apache.hadoop.registry.client.binding.TestRegistryPathUtils
Running org.apache.hadoop.registry.integration.TestRegistryRMOperations
Tests run: 5, Failures: 0, Errors: 0, Skipped: 0, Time elapsed: 2.835 sec - in org.apache.hadoop.registry.integration.TestRegistryRMOperations
Running org.apache.hadoop.registry.integration.TestYarnPolicySelector
Tests run: 3, Failures: 0, Errors: 0, Skipped: 0, Time elapsed: 0.397 sec - in org.apache.hadoop.registry.integration.TestYarnPolicySelector
Running org.apache.hadoop.registry.cli.TestRegistryCli
Tests run: 6, Failures: 0, Errors: 0, Skipped: 0, Time elapsed: 2.645 sec - in org.apache.hadoop.registry.cli.TestRegistryCli
Running org.apache.hadoop.registry.operations.TestRegistryOperations
Tests run: 24, Failures: 0, Errors: 0, Skipped: 0, Time elapsed: 4.608 sec - in org.apache.hadoop.registry.operations.TestRegistryOperations
Running org.apache.hadoop.registry.secure.TestSecureRegistry
Tests run: 4, Failures: 0, Errors: 0, Skipped: 0, Time elapsed: 6.335 sec - in org.apache.hadoop.registry.secure.TestSecureRegistry
Running org.apache.hadoop.registry.secure.TestRegistrySecurityHelper
Tests run: 12, Failures: 0, Errors: 0, Skipped: 0, Time elapsed: 0.715 sec - in org.apache.hadoop.registry.secure.TestRegistrySecurityHelper
Running org.apache.hadoop.registry.secure.TestSecureRMRegistryOperations
Tests run: 12, Failures: 0, Errors: 0, Skipped: 0, Time elapsed: 7.418 sec - in org.apache.hadoop.registry.secure.TestSecureRMRegistryOperations
Running org.apache.hadoop.registry.secure.TestSecureLogins
Tests run: 11, Failures: 0, Errors: 0, Skipped: 0, Time elapsed: 4.783 sec - in org.apache.hadoop.registry.secure.TestSecureLogins

Results :

Tests run: 124, Failures: 0, Errors: 0, Skipped: 0

[INFO] 
[INFO] --- maven-jar-plugin:2.5:jar (default-jar) @ hadoop-yarn-registry ---
[INFO] Building jar: <https://builds.apache.org/job/Hadoop-Yarn-trunk-Java8/ws/hadoop-yarn-project/hadoop-yarn/hadoop-yarn-registry/target/hadoop-yarn-registry-3.0.0-SNAPSHOT.jar>
[INFO] 
[INFO] --- maven-source-plugin:2.3:jar-no-fork (hadoop-java-sources) @ hadoop-yarn-registry
---
[INFO] Building jar: <https://builds.apache.org/job/Hadoop-Yarn-trunk-Java8/ws/hadoop-yarn-project/hadoop-yarn/hadoop-yarn-registry/target/hadoop-yarn-registry-3.0.0-SNAPSHOT-sources.jar>
[INFO] 
[INFO] --- maven-source-plugin:2.3:test-jar-no-fork (hadoop-java-sources) @ hadoop-yarn-registry
---
[INFO] Building jar: <https://builds.apache.org/job/Hadoop-Yarn-trunk-Java8/ws/hadoop-yarn-project/hadoop-yarn/hadoop-yarn-registry/target/hadoop-yarn-registry-3.0.0-SNAPSHOT-test-sources.jar>
[INFO] 
[INFO] --- maven-enforcer-plugin:1.3.1:enforce (dist-enforce) @ hadoop-yarn-registry ---
[INFO] 
[INFO] --- maven-site-plugin:3.4:attach-descriptor (attach-descriptor) @ hadoop-yarn-registry
---
[INFO] 
[INFO] --- maven-javadoc-plugin:2.8.1:jar (module-javadocs) @ hadoop-yarn-registry ---
[INFO] Skipping javadoc generation
[INFO] 
[INFO] --- maven-enforcer-plugin:1.3.1:enforce (depcheck) @ hadoop-yarn-registry ---
[INFO] 
[INFO] --- maven-checkstyle-plugin:2.15:checkstyle (default-cli) @ hadoop-yarn-registry ---
[INFO] ------------------------------------------------------------------------
[INFO] Reactor Summary:
[INFO] 
[INFO] Apache Hadoop YARN ................................ SUCCESS [  3.273 s]
[INFO] Apache Hadoop YARN API ............................ SUCCESS [01:26 min]
[INFO] Apache Hadoop YARN Common ......................... SUCCESS [02:32 min]
[INFO] Apache Hadoop YARN Server ......................... SUCCESS [  0.058 s]
[INFO] Apache Hadoop YARN Server Common .................. SUCCESS [ 37.889 s]
[INFO] Apache Hadoop YARN NodeManager .................... SUCCESS [07:43 min]
[INFO] Apache Hadoop YARN Web Proxy ...................... SUCCESS [ 17.731 s]
[INFO] Apache Hadoop YARN ApplicationHistoryService ...... SUCCESS [03:09 min]
[INFO] Apache Hadoop YARN ResourceManager ................ SUCCESS [55:27 min]
[INFO] Apache Hadoop YARN Server Tests ................... SUCCESS [01:53 min]
[INFO] Apache Hadoop YARN Client ......................... SUCCESS [07:01 min]
[INFO] Apache Hadoop YARN SharedCacheManager ............. SUCCESS [ 17.675 s]
[INFO] Apache Hadoop YARN Applications ................... SUCCESS [  0.032 s]
[INFO] Apache Hadoop YARN DistributedShell ............... SUCCESS [06:43 min]
[INFO] Apache Hadoop YARN Unmanaged Am Launcher .......... SUCCESS [ 30.948 s]
[INFO] Apache Hadoop YARN Site ........................... SUCCESS [  0.051 s]
[INFO] Apache Hadoop YARN Registry ....................... FAILURE [ 41.535 s]
[INFO] Apache Hadoop YARN Project ........................ SKIPPED
[INFO] ------------------------------------------------------------------------
[INFO] BUILD FAILURE
[INFO] ------------------------------------------------------------------------
[INFO] Total time: 01:28 h
[INFO] Finished at: 2015-09-18T21:11:18+00:00
[INFO] Final Memory: 99M/1037M
[INFO] ------------------------------------------------------------------------
[ERROR] Failed to execute goal org.apache.maven.plugins:maven-checkstyle-plugin:2.15:checkstyle
(default-cli) on project hadoop-yarn-registry: An error has occurred in Checkstyle report
generation. Failed during checkstyle execution: Unable to find configuration file at location:
checkstyle/checkstyle.xml: Could not find resource 'checkstyle/checkstyle.xml'. -> [Help
1]
[ERROR] 
[ERROR] To see the full stack trace of the errors, re-run Maven with the -e switch.
[ERROR] Re-run Maven using the -X switch to enable full debug logging.
[ERROR] 
[ERROR] For more information about the errors and possible solutions, please read the following
articles:
[ERROR] [Help 1] http://cwiki.apache.org/confluence/display/MAVEN/MojoExecutionException
[ERROR] 
[ERROR] After correcting the problems, you can resume the build with the command
[ERROR]   mvn <goals> -rf :hadoop-yarn-registry
Build step 'Execute shell' marked build as failure
Archiving artifacts
Recording test results

Mime
View raw message