hadoop-yarn-dev mailing list archives

Site index · List index
Message view « Date » · « Thread »
Top « Date » · « Thread »
From Apache Jenkins Server <jenk...@builds.apache.org>
Subject Failed: YARN-4126 PreCommit Build #9042
Date Tue, 08 Sep 2015 22:03:40 GMT
Jira: https://issues.apache.org/jira/browse/YARN-4126
Build: https://builds.apache.org/job/PreCommit-YARN-Build/9042/

###################################################################################
########################## LAST 60 LINES OF THE CONSOLE ###########################
[...truncated 314 lines...]
|  +1  |            install  |  1m 31s    | mvn install still works. 
|  +1  |    eclipse:eclipse  |  0m 35s    | The patch built with 
|      |                     |            | eclipse:eclipse.
|  +1  |           findbugs  |  3m 26s    | The patch does not introduce any 
|      |                     |            | new Findbugs (version 3.0.0)
|      |                     |            | warnings.
|  +1  |       common tests  |  23m 2s    | Tests passed in hadoop-common. 
|  -1  |         yarn tests  |  53m 35s   | Tests failed in 
|      |                     |            | hadoop-yarn-server-resourcemanager.
|      |                     |  120m 41s  | 


             Reason | Tests
 Failed unit tests  |  hadoop.yarn.server.resourcemanager.webapp.TestRMWebServicesDelegationTokens

                    |  hadoop.yarn.server.resourcemanager.TestClientRMService 


|| Subsystem || Report/Notes ||
============================================================================
| Patch URL | http://issues.apache.org/jira/secure/attachment/12754713/0003-YARN-4126.patch
|
| Optional Tests | javadoc javac unit findbugs checkstyle |
| git revision | trunk / 16b9037 |
| hadoop-common test log | /home/jenkins/jenkins-slave/workspace/PreCommit-YARN-Build/patchprocess/testrun_hadoop-common.txt
|
| hadoop-yarn-server-resourcemanager test log | /home/jenkins/jenkins-slave/workspace/PreCommit-YARN-Build/patchprocess/testrun_hadoop-yarn-server-resourcemanager.txt
|
| Test Results | https://builds.apache.org/job/PreCommit-YARN-Build/9042/testReport/ |
| Java | 1.7.0_55 |
| uname | Linux asf906.gq1.ygridcore.net 3.13.0-36-lowlatency #63-Ubuntu SMP PREEMPT Wed Sep
3 21:56:12 UTC 2014 x86_64 x86_64 x86_64 GNU/Linux |


============================================================================
============================================================================
                          Adding comment to JIRA
============================================================================
============================================================================


Comment added.
bb7dac80d5b4ccb41b54773ac971493b6635748e logged out


============================================================================
============================================================================
                              Finished build.
============================================================================
============================================================================


Build step 'Execute shell' marked build as failure
Archiving artifacts
Sending artifact delta relative to PreCommit-YARN-Build #9023
Archived 43 artifacts
Archive block size is 32768
Received 62 blocks and 20579936 bytes
Compression is 9.0%
Took 4.1 sec
[description-setter] Could not determine description.
Recording test results
Email was triggered for: Failure
Sending email for trigger: Failure



###################################################################################
############################## FAILED TESTS (if any) ##############################
6 tests failed.
FAILED:  org.apache.hadoop.yarn.server.resourcemanager.TestClientRMService.testTokenCancellationByOwner

Error Message:
Illegal principal name tester@EXAMPLE.COM: org.apache.hadoop.security.authentication.util.KerberosName$NoMatchingRule:
No rules applied to tester@EXAMPLE.COM

Stack Trace:
java.lang.IllegalArgumentException: Illegal principal name tester@EXAMPLE.COM: org.apache.hadoop.security.authentication.util.KerberosName$NoMatchingRule:
No rules applied to tester@EXAMPLE.COM
	at org.apache.hadoop.security.authentication.util.KerberosName.getShortName(KerberosName.java:389)
	at org.apache.hadoop.security.User.<init>(User.java:48)
	at org.apache.hadoop.security.User.<init>(User.java:43)
	at org.apache.hadoop.security.UserGroupInformation.createRemoteUser(UserGroupInformation.java:1217)
	at org.apache.hadoop.security.UserGroupInformation.createRemoteUser(UserGroupInformation.java:1201)
	at org.apache.hadoop.security.token.delegation.AbstractDelegationTokenIdentifier.getUser(AbstractDelegationTokenIdentifier.java:80)
	at org.apache.hadoop.security.token.delegation.AbstractDelegationTokenSecretManager.cancelToken(AbstractDelegationTokenSecretManager.java:533)
	at org.apache.hadoop.yarn.server.resourcemanager.ClientRMService.cancelDelegationToken(ClientRMService.java:1002)
	at org.apache.hadoop.yarn.server.resourcemanager.TestClientRMService.checkTokenCancellation(TestClientRMService.java:879)
	at org.apache.hadoop.yarn.server.resourcemanager.TestClientRMService.access$400(TestClientRMService.java:165)


FAILED:  org.apache.hadoop.yarn.server.resourcemanager.TestClientRMService.testTokenCancellationByRenewer

Error Message:
org.apache.hadoop.security.authentication.util.KerberosName$NoMatchingRule: No rules applied
to tester@EXAMPLE.COM

Stack Trace:
java.lang.RuntimeException: org.apache.hadoop.security.authentication.util.KerberosName$NoMatchingRule:
No rules applied to tester@EXAMPLE.COM
	at org.apache.hadoop.security.authentication.util.KerberosName.getShortName(KerberosName.java:389)
	at org.apache.hadoop.security.token.delegation.AbstractDelegationTokenIdentifier.setRenewer(AbstractDelegationTokenIdentifier.java:111)
	at org.apache.hadoop.security.token.delegation.AbstractDelegationTokenIdentifier.<init>(AbstractDelegationTokenIdentifier.java:57)
	at org.apache.hadoop.yarn.security.client.YARNDelegationTokenIdentifier.<init>(YARNDelegationTokenIdentifier.java:41)
	at org.apache.hadoop.yarn.security.client.RMDelegationTokenIdentifier.<init>(RMDelegationTokenIdentifier.java:61)
	at org.apache.hadoop.yarn.server.resourcemanager.TestClientRMService.checkTokenCancellation(TestClientRMService.java:868)
	at org.apache.hadoop.yarn.server.resourcemanager.TestClientRMService.access$400(TestClientRMService.java:165)


FAILED:  org.apache.hadoop.yarn.server.resourcemanager.TestClientRMService.testTokenCancellationByWrongUser

Error Message:
null

Stack Trace:
java.lang.AssertionError: null
	at org.junit.Assert.fail(Assert.java:86)
	at org.junit.Assert.assertTrue(Assert.java:41)
	at org.junit.Assert.assertTrue(Assert.java:52)
	at org.apache.hadoop.yarn.server.resourcemanager.TestClientRMService$11.run(TestClientRMService.java:812)
	at org.apache.hadoop.yarn.server.resourcemanager.TestClientRMService$11.run(TestClientRMService.java:802)
	at java.security.AccessController.doPrivileged(Native Method)
	at javax.security.auth.Subject.doAs(Subject.java:415)
	at org.apache.hadoop.security.UserGroupInformation.doAs(UserGroupInformation.java:1667)
	at org.apache.hadoop.yarn.server.resourcemanager.TestClientRMService.testTokenCancellationByWrongUser(TestClientRMService.java:802)


FAILED:  org.apache.hadoop.yarn.server.resourcemanager.webapp.TestRMWebServicesDelegationTokens.testCancelDelegationToken[0]

Error Message:
expected:<OK> but was:<Internal Server Error>

Stack Trace:
java.lang.AssertionError: expected:<OK> but was:<Internal Server Error>
	at org.junit.Assert.fail(Assert.java:88)
	at org.junit.Assert.failNotEquals(Assert.java:743)
	at org.junit.Assert.assertEquals(Assert.java:118)
	at org.junit.Assert.assertEquals(Assert.java:144)
	at org.apache.hadoop.yarn.server.resourcemanager.webapp.TestRMWebServicesDelegationTokens$8.call(TestRMWebServicesDelegationTokens.java:526)
	at org.apache.hadoop.yarn.server.resourcemanager.webapp.TestRMWebServicesDelegationTokens$8.call(TestRMWebServicesDelegationTokens.java:519)
	at org.apache.hadoop.security.authentication.KerberosTestUtils$1.run(KerberosTestUtils.java:120)
	at java.security.AccessController.doPrivileged(Native Method)
	at javax.security.auth.Subject.doAs(Subject.java:415)
	at org.apache.hadoop.security.authentication.KerberosTestUtils.doAs(KerberosTestUtils.java:117)
	at org.apache.hadoop.security.authentication.KerberosTestUtils.doAsClient(KerberosTestUtils.java:133)
	at org.apache.hadoop.yarn.server.resourcemanager.webapp.TestRMWebServicesDelegationTokens.testCancelDelegationToken(TestRMWebServicesDelegationTokens.java:519)


FAILED:  org.apache.hadoop.yarn.server.resourcemanager.webapp.TestRMWebServicesDelegationTokens.testRenewDelegationToken[0]

Error Message:
expected:<OK> but was:<Internal Server Error>

Stack Trace:
java.lang.AssertionError: expected:<OK> but was:<Internal Server Error>
	at org.junit.Assert.fail(Assert.java:88)
	at org.junit.Assert.failNotEquals(Assert.java:743)
	at org.junit.Assert.assertEquals(Assert.java:118)
	at org.junit.Assert.assertEquals(Assert.java:144)
	at org.apache.hadoop.yarn.server.resourcemanager.webapp.TestRMWebServicesDelegationTokens$4.call(TestRMWebServicesDelegationTokens.java:373)
	at org.apache.hadoop.yarn.server.resourcemanager.webapp.TestRMWebServicesDelegationTokens$4.call(TestRMWebServicesDelegationTokens.java:366)
	at org.apache.hadoop.security.authentication.KerberosTestUtils$1.run(KerberosTestUtils.java:120)
	at java.security.AccessController.doPrivileged(Native Method)
	at javax.security.auth.Subject.doAs(Subject.java:415)
	at org.apache.hadoop.security.authentication.KerberosTestUtils.doAs(KerberosTestUtils.java:117)
	at org.apache.hadoop.security.authentication.KerberosTestUtils.doAsClient(KerberosTestUtils.java:133)
	at org.apache.hadoop.yarn.server.resourcemanager.webapp.TestRMWebServicesDelegationTokens.testRenewDelegationToken(TestRMWebServicesDelegationTokens.java:365)


FAILED:  org.apache.hadoop.yarn.server.resourcemanager.webapp.TestRMWebServicesDelegationTokens.testCreateDelegationToken[0]

Error Message:
expected:<OK> but was:<Internal Server Error>

Stack Trace:
java.lang.AssertionError: expected:<OK> but was:<Internal Server Error>
	at org.junit.Assert.fail(Assert.java:88)
	at org.junit.Assert.failNotEquals(Assert.java:743)
	at org.junit.Assert.assertEquals(Assert.java:118)
	at org.junit.Assert.assertEquals(Assert.java:144)
	at org.apache.hadoop.yarn.server.resourcemanager.webapp.TestRMWebServicesDelegationTokens$3.call(TestRMWebServicesDelegationTokens.java:319)
	at org.apache.hadoop.yarn.server.resourcemanager.webapp.TestRMWebServicesDelegationTokens$3.call(TestRMWebServicesDelegationTokens.java:312)
	at org.apache.hadoop.security.authentication.KerberosTestUtils$1.run(KerberosTestUtils.java:120)
	at java.security.AccessController.doPrivileged(Native Method)
	at javax.security.auth.Subject.doAs(Subject.java:415)
	at org.apache.hadoop.security.authentication.KerberosTestUtils.doAs(KerberosTestUtils.java:117)
	at org.apache.hadoop.security.authentication.KerberosTestUtils.doAsClient(KerberosTestUtils.java:133)
	at org.apache.hadoop.yarn.server.resourcemanager.webapp.TestRMWebServicesDelegationTokens.verifyKerberosAuthCreate(TestRMWebServicesDelegationTokens.java:312)
	at org.apache.hadoop.yarn.server.resourcemanager.webapp.TestRMWebServicesDelegationTokens.testCreateDelegationToken(TestRMWebServicesDelegationTokens.java:285)



Mime
  • Unnamed multipart/mixed (inline, None, 0 bytes)
View raw message