hadoop-yarn-dev mailing list archives

Site index · List index
Message view « Date » · « Thread »
Top « Date » · « Thread »
From Apache Jenkins Server <jenk...@builds.apache.org>
Subject Failed: YARN-4150 PreCommit Build #9101
Date Sat, 12 Sep 2015 18:05:17 GMT
Jira: https://issues.apache.org/jira/browse/YARN-4150
Build: https://builds.apache.org/job/PreCommit-YARN-Build/9101/

###################################################################################
########################## LAST 60 LINES OF THE CONSOLE ###########################
[...truncated 263 lines...]
|  +1  |         checkstyle  |  0m 31s    | There were no new checkstyle 
|      |                     |            | issues.
|  +1  |         whitespace  |  0m 0s     | The patch has no lines that end in 
|      |                     |            | whitespace.
|  +1  |            install  |  1m 27s    | mvn install still works. 
|  +1  |    eclipse:eclipse  |  0m 33s    | The patch built with 
|      |                     |            | eclipse:eclipse.
|  +1  |           findbugs  |  0m 52s    | The patch does not introduce any 
|      |                     |            | new Findbugs (version 3.0.0)
|      |                     |            | warnings.
|  -1  |         yarn tests  |  6m 53s    | Tests failed in hadoop-yarn-client. 
|      |                     |  25m 11s   | 


             Reason | Tests
 Failed unit tests  |  hadoop.yarn.client.TestResourceManagerAdministrationProtocolPBClientImpl



|| Subsystem || Report/Notes ||
============================================================================
| Patch URL | http://issues.apache.org/jira/secure/attachment/12755487/YARN-4150.001.patch
|
| Optional Tests | javac unit findbugs checkstyle |
| git revision | trunk / 8c05441 |
| hadoop-yarn-client test log | /home/jenkins/jenkins-slave/workspace/PreCommit-YARN-Build/patchprocess/testrun_hadoop-yarn-client.txt
|
| Test Results | https://builds.apache.org/job/PreCommit-YARN-Build/9101/testReport/ |
| Java | 1.7.0_55 |
| uname | Linux asf905.gq1.ygridcore.net 3.13.0-36-lowlatency #63-Ubuntu SMP PREEMPT Wed Sep
3 21:56:12 UTC 2014 x86_64 x86_64 x86_64 GNU/Linux |


============================================================================
============================================================================
                          Adding comment to JIRA
============================================================================
============================================================================


Comment added.
6b3e62972d4a1d634218aaa808ff4f9ad47154b5 logged out


============================================================================
============================================================================
                              Finished build.
============================================================================
============================================================================


Build step 'Execute shell' marked build as failure
Archiving artifacts
Sending artifact delta relative to PreCommit-YARN-Build #9090
Archived 27 artifacts
Archive block size is 32768
Received 39 blocks and 3071923 bytes
Compression is 29.4%
Took 2.7 sec
[description-setter] Could not determine description.
Recording test results
Email was triggered for: Failure
Sending email for trigger: Failure



###################################################################################
############################## FAILED TESTS (if any) ##############################
1 tests failed.
FAILED:  org.apache.hadoop.yarn.client.TestResourceManagerAdministrationProtocolPBClientImpl.org.apache.hadoop.yarn.client.TestResourceManagerAdministrationProtocolPBClientImpl

Error Message:
ResourceManager failed to start. Final state is STOPPED

Stack Trace:
java.io.IOException: ResourceManager failed to start. Final state is STOPPED
	at org.apache.hadoop.yarn.client.TestResourceManagerAdministrationProtocolPBClientImpl.setUpResourceManager(TestResourceManagerAdministrationProtocolPBClientImpl.java:93)



Mime
  • Unnamed multipart/mixed (inline, None, 0 bytes)
View raw message