hadoop-yarn-dev mailing list archives

Site index · List index
Message view « Date » · « Thread »
Top « Date » · « Thread »
From Apache Jenkins Server <jenk...@builds.apache.org>
Subject Failed: YARN-4081 PreCommit Build #9001
Date Thu, 03 Sep 2015 19:45:57 GMT
Jira: https://issues.apache.org/jira/browse/YARN-4081
Build: https://builds.apache.org/job/PreCommit-YARN-Build/9001/

###################################################################################
########################## LAST 60 LINES OF THE CONSOLE ###########################
[...truncated 436 lines...]
                    |  hadoop.yarn.server.resourcemanager.scheduler.capacity.TestCapacitySchedulerDynamicBehavior 
                    |  hadoop.yarn.server.resourcemanager.TestApplicationACLs 
                    |  hadoop.yarn.server.resourcemanager.security.TestDelegationTokenRenewer 
                    |  hadoop.yarn.server.resourcemanager.webapp.dao.TestFairSchedulerQueueInfo 
                    |  hadoop.yarn.server.resourcemanager.scheduler.capacity.TestCapacitySchedulerNodeLabelUpdate 
                    |  hadoop.yarn.server.resourcemanager.TestRM 
                    |  hadoop.yarn.server.resourcemanager.TestSubmitApplicationWithRMHA 
                    |  hadoop.yarn.server.resourcemanager.scheduler.capacity.TestCapacityScheduler 
                    |  hadoop.yarn.server.resourcemanager.webapp.TestNodesPage 
                    |  hadoop.yarn.server.resourcemanager.webapp.TestRMWebServicesApps 
                    |  hadoop.yarn.server.resourcemanager.TestClientRMService 
                    |  hadoop.yarn.server.resourcemanager.webapp.TestRMWebServicesFairScheduler 


|| Subsystem || Report/Notes ||
============================================================================
| Patch URL | http://issues.apache.org/jira/secure/attachment/12754042/YARN-4081-YARN-3926.004.patch |
| Optional Tests | javadoc javac unit findbugs checkstyle |
| git revision | YARN-3926 / c95993c |
| checkstyle |  /home/jenkins/jenkins-slave/workspace/PreCommit-YARN-Build/patchprocess/diffcheckstylehadoop-yarn-api.txt |
| whitespace | /home/jenkins/jenkins-slave/workspace/PreCommit-YARN-Build/patchprocess/whitespace.txt |
| hadoop-yarn-api test log | /home/jenkins/jenkins-slave/workspace/PreCommit-YARN-Build/patchprocess/testrun_hadoop-yarn-api.txt |
| hadoop-yarn-common test log | /home/jenkins/jenkins-slave/workspace/PreCommit-YARN-Build/patchprocess/testrun_hadoop-yarn-common.txt |
| hadoop-yarn-server-resourcemanager test log | /home/jenkins/jenkins-slave/workspace/PreCommit-YARN-Build/patchprocess/testrun_hadoop-yarn-server-resourcemanager.txt |
| Test Results | https://builds.apache.org/job/PreCommit-YARN-Build/9001/testReport/ |
| Java | 1.7.0_55 |
| uname | Linux asf905.gq1.ygridcore.net 3.13.0-36-lowlatency #63-Ubuntu SMP PREEMPT Wed Sep 3 21:56:12 UTC 2014 x86_64 x86_64 x86_64 GNU/Linux |


============================================================================
============================================================================
                          Adding comment to JIRA
============================================================================
============================================================================


Comment added.
f2b35d8faf7c36948410f7c5427eaf43f802c23d logged out


============================================================================
============================================================================
                              Finished build.
============================================================================
============================================================================


Build step 'Execute shell' marked build as failure
Archiving artifacts
Sending artifact delta relative to PreCommit-YARN-Build #8944
Archived 54 artifacts
Archive block size is 32768
Received 148 blocks and 23943701 bytes
Compression is 16.8%
Took 4.6 sec
[description-setter] Could not determine description.
Recording test results
Email was triggered for: Failure
Sending email for trigger: Failure



###################################################################################
############################## FAILED TESTS (if any) ##############################
135 tests failed.
FAILED:  org.apache.hadoop.yarn.server.resourcemanager.TestAppManager.testEscapeApplicationSummary

Error Message:
null

Stack Trace:
java.lang.AssertionError: null
	at org.junit.Assert.fail(Assert.java:86)
	at org.junit.Assert.assertTrue(Assert.java:41)
	at org.junit.Assert.assertTrue(Assert.java:52)
	at org.apache.hadoop.yarn.server.resourcemanager.TestAppManager.testEscapeApplicationSummary(TestAppManager.java:657)


FAILED:  org.apache.hadoop.yarn.server.resourcemanager.TestApplicationACLs.testApplicationACLs

Error Message:
org.apache.hadoop.yarn.server.utils.BuilderUtils.newApplicationReport(Lorg/apache/hadoop/yarn/api/records/ApplicationId;Lorg/apache/hadoop/yarn/api/records/ApplicationAttemptId;Ljava/lang/String;Ljava/lang/String;Ljava/lang/String;Ljava/lang/String;ILorg/apache/hadoop/yarn/api/records/Token;Lorg/apache/hadoop/yarn/api/records/YarnApplicationState;Ljava/lang/String;Ljava/lang/String;JJLorg/apache/hadoop/yarn/api/records/FinalApplicationStatus;Lorg/apache/hadoop/yarn/api/records/ApplicationResourceUsageReport;Ljava/lang/String;FLjava/lang/String;Lorg/apache/hadoop/yarn/api/records/Token;Ljava/util/Set;)Lorg/apache/hadoop/yarn/api/records/ApplicationReport;
 at org.apache.hadoop.yarn.server.resourcemanager.rmapp.RMAppImpl.createAndGetApplicationReport(RMAppImpl.java:660)
 at org.apache.hadoop.yarn.server.resourcemanager.ClientRMService.getApplicationReport(ClientRMService.java:334)
 at org.apache.hadoop.yarn.api.impl.pb.service.ApplicationClientProtocolPBServiceImpl.getApplicationReport(ApplicationClientProtocolPBServiceImpl.java:180)
 at org.apache.hadoop.yarn.proto.ApplicationClientProtocol$ApplicationClientProtocolService$2.callBlockingMethod(ApplicationClientProtocol.java:433)
 at org.apache.hadoop.ipc.ProtobufRpcEngine$Server$ProtoBufRpcInvoker.call(ProtobufRpcEngine.java:636)
 at org.apache.hadoop.ipc.RPC$Server.call(RPC.java:976)
 at org.apache.hadoop.ipc.Server$Handler$1.run(Server.java:2230)
 at org.apache.hadoop.ipc.Server$Handler$1.run(Server.java:2226)
 at java.security.AccessController.doPrivileged(Native Method)
 at javax.security.auth.Subject.doAs(Subject.java:415)
 at org.apache.hadoop.security.UserGroupInformation.doAs(UserGroupInformation.java:1667)
 at org.apache.hadoop.ipc.Server$Handler.run(Server.java:2224)


Stack Trace:
org.apache.hadoop.ipc.RemoteException: org.apache.hadoop.yarn.server.utils.BuilderUtils.newApplicationReport(Lorg/apache/hadoop/yarn/api/records/ApplicationId;Lorg/apache/hadoop/yarn/api/records/ApplicationAttemptId;Ljava/lang/String;Ljava/lang/String;Ljava/lang/String;Ljava/lang/String;ILorg/apache/hadoop/yarn/api/records/Token;Lorg/apache/hadoop/yarn/api/records/YarnApplicationState;Ljava/lang/String;Ljava/lang/String;JJLorg/apache/hadoop/yarn/api/records/FinalApplicationStatus;Lorg/apache/hadoop/yarn/api/records/ApplicationResourceUsageReport;Ljava/lang/String;FLjava/lang/String;Lorg/apache/hadoop/yarn/api/records/Token;Ljava/util/Set;)Lorg/apache/hadoop/yarn/api/records/ApplicationReport;
	at org.apache.hadoop.yarn.server.resourcemanager.rmapp.RMAppImpl.createAndGetApplicationReport(RMAppImpl.java:660)
	at org.apache.hadoop.yarn.server.resourcemanager.ClientRMService.getApplicationReport(ClientRMService.java:334)
	at org.apache.hadoop.yarn.api.impl.pb.service.ApplicationClientProtocolPBServiceImpl.getApplicationReport(ApplicationClientProtocolPBServiceImpl.java:180)
	at org.apache.hadoop.yarn.proto.ApplicationClientProtocol$ApplicationClientProtocolService$2.callBlockingMethod(ApplicationClientProtocol.java:433)
	at org.apache.hadoop.ipc.ProtobufRpcEngine$Server$ProtoBufRpcInvoker.call(ProtobufRpcEngine.java:636)
	at org.apache.hadoop.ipc.RPC$Server.call(RPC.java:976)
	at org.apache.hadoop.ipc.Server$Handler$1.run(Server.java:2230)
	at org.apache.hadoop.ipc.Server$Handler$1.run(Server.java:2226)
	at java.security.AccessController.doPrivileged(Native Method)
	at javax.security.auth.Subject.doAs(Subject.java:415)
	at org.apache.hadoop.security.UserGroupInformation.doAs(UserGroupInformation.java:1667)
	at org.apache.hadoop.ipc.Server$Handler.run(Server.java:2224)

	at org.apache.hadoop.ipc.Client.call(Client.java:1445)
	at org.apache.hadoop.ipc.Client.call(Client.java:1376)
	at org.apache.hadoop.ipc.ProtobufRpcEngine$Invoker.invoke(ProtobufRpcEngine.java:229)
	at com.sun.proxy.$Proxy14.getApplicationReport(Unknown Source)
	at org.apache.hadoop.yarn.api.impl.pb.client.ApplicationClientProtocolPBClientImpl.getApplicationReport(ApplicationClientProtocolPBClientImpl.java:197)
	at org.apache.hadoop.yarn.server.resourcemanager.TestApplicationACLs.verifyOwnerAccess(TestApplicationACLs.java:243)
	at org.apache.hadoop.yarn.server.resourcemanager.TestApplicationACLs.testApplicationACLs(TestApplicationACLs.java:171)


FAILED:  org.apache.hadoop.yarn.server.resourcemanager.TestClientRMService.testAppSubmit

Error Message:
org.apache.hadoop.yarn.server.utils.BuilderUtils.newApplicationReport(Lorg/apache/hadoop/yarn/api/records/ApplicationId;Lorg/apache/hadoop/yarn/api/records/ApplicationAttemptId;Ljava/lang/String;Ljava/lang/String;Ljava/lang/String;Ljava/lang/String;ILorg/apache/hadoop/yarn/api/records/Token;Lorg/apache/hadoop/yarn/api/records/YarnApplicationState;Ljava/lang/String;Ljava/lang/String;JJLorg/apache/hadoop/yarn/api/records/FinalApplicationStatus;Lorg/apache/hadoop/yarn/api/records/ApplicationResourceUsageReport;Ljava/lang/String;FLjava/lang/String;Lorg/apache/hadoop/yarn/api/records/Token;Ljava/util/Set;)Lorg/apache/hadoop/yarn/api/records/ApplicationReport;

Stack Trace:
java.lang.NoSuchMethodError: org.apache.hadoop.yarn.server.utils.BuilderUtils.newApplicationReport(Lorg/apache/hadoop/yarn/api/records/ApplicationId;Lorg/apache/hadoop/yarn/api/records/ApplicationAttemptId;Ljava/lang/String;Ljava/lang/String;Ljava/lang/String;Ljava/lang/String;ILorg/apache/hadoop/yarn/api/records/Token;Lorg/apache/hadoop/yarn/api/records/YarnApplicationState;Ljava/lang/String;Ljava/lang/String;JJLorg/apache/hadoop/yarn/api/records/FinalApplicationStatus;Lorg/apache/hadoop/yarn/api/records/ApplicationResourceUsageReport;Ljava/lang/String;FLjava/lang/String;Lorg/apache/hadoop/yarn/api/records/Token;Ljava/util/Set;)Lorg/apache/hadoop/yarn/api/records/ApplicationReport;
	at org.apache.hadoop.yarn.server.resourcemanager.rmapp.RMAppImpl.createAndGetApplicationReport(RMAppImpl.java:660)
	at org.apache.hadoop.yarn.server.resourcemanager.ClientRMService.getApplications(ClientRMService.java:810)
	at org.apache.hadoop.yarn.server.resourcemanager.ClientRMService.getApplications(ClientRMService.java:677)
	at org.apache.hadoop.yarn.server.resourcemanager.TestClientRMService.testAppSubmit(TestClientRMService.java:899)


FAILED:  org.apache.hadoop.yarn.server.resourcemanager.TestClientRMService.testGetApplications

Error Message:
org.apache.hadoop.yarn.server.utils.BuilderUtils.newApplicationReport(Lorg/apache/hadoop/yarn/api/records/ApplicationId;Lorg/apache/hadoop/yarn/api/records/ApplicationAttemptId;Ljava/lang/String;Ljava/lang/String;Ljava/lang/String;Ljava/lang/String;ILorg/apache/hadoop/yarn/api/records/Token;Lorg/apache/hadoop/yarn/api/records/YarnApplicationState;Ljava/lang/String;Ljava/lang/String;JJLorg/apache/hadoop/yarn/api/records/FinalApplicationStatus;Lorg/apache/hadoop/yarn/api/records/ApplicationResourceUsageReport;Ljava/lang/String;FLjava/lang/String;Lorg/apache/hadoop/yarn/api/records/Token;Ljava/util/Set;)Lorg/apache/hadoop/yarn/api/records/ApplicationReport;

Stack Trace:
java.lang.NoSuchMethodError: org.apache.hadoop.yarn.server.utils.BuilderUtils.newApplicationReport(Lorg/apache/hadoop/yarn/api/records/ApplicationId;Lorg/apache/hadoop/yarn/api/records/ApplicationAttemptId;Ljava/lang/String;Ljava/lang/String;Ljava/lang/String;Ljava/lang/String;ILorg/apache/hadoop/yarn/api/records/Token;Lorg/apache/hadoop/yarn/api/records/YarnApplicationState;Ljava/lang/String;Ljava/lang/String;JJLorg/apache/hadoop/yarn/api/records/FinalApplicationStatus;Lorg/apache/hadoop/yarn/api/records/ApplicationResourceUsageReport;Ljava/lang/String;FLjava/lang/String;Lorg/apache/hadoop/yarn/api/records/Token;Ljava/util/Set;)Lorg/apache/hadoop/yarn/api/records/ApplicationReport;
	at org.apache.hadoop.yarn.server.resourcemanager.rmapp.RMAppImpl.createAndGetApplicationReport(RMAppImpl.java:660)
	at org.apache.hadoop.yarn.server.resourcemanager.ClientRMService.getApplications(ClientRMService.java:810)
	at org.apache.hadoop.yarn.server.resourcemanager.ClientRMService.getApplications(ClientRMService.java:677)
	at org.apache.hadoop.yarn.server.resourcemanager.TestClientRMService.testGetApplications(TestClientRMService.java:967)


FAILED:  org.apache.hadoop.yarn.server.resourcemanager.TestClientRMService.testGetQueueInfo

Error Message:
org.apache.hadoop.yarn.server.utils.BuilderUtils.newApplicationReport(Lorg/apache/hadoop/yarn/api/records/ApplicationId;Lorg/apache/hadoop/yarn/api/records/ApplicationAttemptId;Ljava/lang/String;Ljava/lang/String;Ljava/lang/String;Ljava/lang/String;ILorg/apache/hadoop/yarn/api/records/Token;Lorg/apache/hadoop/yarn/api/records/YarnApplicationState;Ljava/lang/String;Ljava/lang/String;JJLorg/apache/hadoop/yarn/api/records/FinalApplicationStatus;Lorg/apache/hadoop/yarn/api/records/ApplicationResourceUsageReport;Ljava/lang/String;FLjava/lang/String;Lorg/apache/hadoop/yarn/api/records/Token;Ljava/util/Set;)Lorg/apache/hadoop/yarn/api/records/ApplicationReport;

Stack Trace:
java.lang.NoSuchMethodError: org.apache.hadoop.yarn.server.utils.BuilderUtils.newApplicationReport(Lorg/apache/hadoop/yarn/api/records/ApplicationId;Lorg/apache/hadoop/yarn/api/records/ApplicationAttemptId;Ljava/lang/String;Ljava/lang/String;Ljava/lang/String;Ljava/lang/String;ILorg/apache/hadoop/yarn/api/records/Token;Lorg/apache/hadoop/yarn/api/records/YarnApplicationState;Ljava/lang/String;Ljava/lang/String;JJLorg/apache/hadoop/yarn/api/records/FinalApplicationStatus;Lorg/apache/hadoop/yarn/api/records/ApplicationResourceUsageReport;Ljava/lang/String;FLjava/lang/String;Lorg/apache/hadoop/yarn/api/records/Token;Ljava/util/Set;)Lorg/apache/hadoop/yarn/api/records/ApplicationReport;
	at org.apache.hadoop.yarn.server.resourcemanager.rmapp.RMAppImpl.createAndGetApplicationReport(RMAppImpl.java:660)
	at org.apache.hadoop.yarn.server.resourcemanager.TestClientRMService$17.createAndGetApplicationReport(TestClientRMService.java:1235)
	at org.apache.hadoop.yarn.server.resourcemanager.ClientRMService.getQueueInfo(ClientRMService.java:871)
	at org.apache.hadoop.yarn.server.resourcemanager.TestClientRMService.testGetQueueInfo(TestClientRMService.java:575)


FAILED:  org.apache.hadoop.yarn.server.resourcemanager.TestClientRMService.testGetApplicationReport

Error Message:
org.apache.hadoop.yarn.server.utils.BuilderUtils.newApplicationReport(Lorg/apache/hadoop/yarn/api/records/ApplicationId;Lorg/apache/hadoop/yarn/api/records/ApplicationAttemptId;Ljava/lang/String;Ljava/lang/String;Ljava/lang/String;Ljava/lang/String;ILorg/apache/hadoop/yarn/api/records/Token;Lorg/apache/hadoop/yarn/api/records/YarnApplicationState;Ljava/lang/String;Ljava/lang/String;JJLorg/apache/hadoop/yarn/api/records/FinalApplicationStatus;Lorg/apache/hadoop/yarn/api/records/ApplicationResourceUsageReport;Ljava/lang/String;FLjava/lang/String;Lorg/apache/hadoop/yarn/api/records/Token;Ljava/util/Set;)Lorg/apache/hadoop/yarn/api/records/ApplicationReport;

Stack Trace:
java.lang.NoSuchMethodError: org.apache.hadoop.yarn.server.utils.BuilderUtils.newApplicationReport(Lorg/apache/hadoop/yarn/api/records/ApplicationId;Lorg/apache/hadoop/yarn/api/records/ApplicationAttemptId;Ljava/lang/String;Ljava/lang/String;Ljava/lang/String;Ljava/lang/String;ILorg/apache/hadoop/yarn/api/records/Token;Lorg/apache/hadoop/yarn/api/records/YarnApplicationState;Ljava/lang/String;Ljava/lang/String;JJLorg/apache/hadoop/yarn/api/records/FinalApplicationStatus;Lorg/apache/hadoop/yarn/api/records/ApplicationResourceUsageReport;Ljava/lang/String;FLjava/lang/String;Lorg/apache/hadoop/yarn/api/records/Token;Ljava/util/Set;)Lorg/apache/hadoop/yarn/api/records/ApplicationReport;
	at org.apache.hadoop.yarn.server.resourcemanager.rmapp.RMAppImpl.createAndGetApplicationReport(RMAppImpl.java:660)
	at org.apache.hadoop.yarn.server.resourcemanager.TestClientRMService$17.createAndGetApplicationReport(TestClientRMService.java:1235)
	at org.apache.hadoop.yarn.server.resourcemanager.ClientRMService.getApplicationReport(ClientRMService.java:334)
	at org.apache.hadoop.yarn.server.resourcemanager.TestClientRMService.testGetApplicationReport(TestClientRMService.java:326)


FAILED:  org.apache.hadoop.yarn.server.resourcemanager.TestClientRMService.testForceKillApplication

Error Message:
org.apache.hadoop.yarn.server.utils.BuilderUtils.newApplicationReport(Lorg/apache/hadoop/yarn/api/records/ApplicationId;Lorg/apache/hadoop/yarn/api/records/ApplicationAttemptId;Ljava/lang/String;Ljava/lang/String;Ljava/lang/String;Ljava/lang/String;ILorg/apache/hadoop/yarn/api/records/Token;Lorg/apache/hadoop/yarn/api/records/YarnApplicationState;Ljava/lang/String;Ljava/lang/String;JJLorg/apache/hadoop/yarn/api/records/FinalApplicationStatus;Lorg/apache/hadoop/yarn/api/records/ApplicationResourceUsageReport;Ljava/lang/String;FLjava/lang/String;Lorg/apache/hadoop/yarn/api/records/Token;Ljava/util/Set;)Lorg/apache/hadoop/yarn/api/records/ApplicationReport;

Stack Trace:
java.lang.NoSuchMethodError: org.apache.hadoop.yarn.server.utils.BuilderUtils.newApplicationReport(Lorg/apache/hadoop/yarn/api/records/ApplicationId;Lorg/apache/hadoop/yarn/api/records/ApplicationAttemptId;Ljava/lang/String;Ljava/lang/String;Ljava/lang/String;Ljava/lang/String;ILorg/apache/hadoop/yarn/api/records/Token;Lorg/apache/hadoop/yarn/api/records/YarnApplicationState;Ljava/lang/String;Ljava/lang/String;JJLorg/apache/hadoop/yarn/api/records/FinalApplicationStatus;Lorg/apache/hadoop/yarn/api/records/ApplicationResourceUsageReport;Ljava/lang/String;FLjava/lang/String;Lorg/apache/hadoop/yarn/api/records/Token;Ljava/util/Set;)Lorg/apache/hadoop/yarn/api/records/ApplicationReport;
	at org.apache.hadoop.yarn.server.resourcemanager.rmapp.RMAppImpl.createAndGetApplicationReport(RMAppImpl.java:660)
	at org.apache.hadoop.yarn.server.resourcemanager.ClientRMService.getApplications(ClientRMService.java:810)
	at org.apache.hadoop.yarn.server.resourcemanager.ClientRMService.getApplications(ClientRMService.java:677)
	at org.apache.hadoop.yarn.server.resourcemanager.TestClientRMService.testForceKillApplication(TestClientRMService.java:523)


FAILED:  org.apache.hadoop.yarn.server.resourcemanager.TestRM.testInvalidateAMHostPortWhenAMFailedOrKilled[0]

Error Message:
org.apache.hadoop.yarn.server.utils.BuilderUtils.newApplicationReport(Lorg/apache/hadoop/yarn/api/records/ApplicationId;Lorg/apache/hadoop/yarn/api/records/ApplicationAttemptId;Ljava/lang/String;Ljava/lang/String;Ljava/lang/String;Ljava/lang/String;ILorg/apache/hadoop/yarn/api/records/Token;Lorg/apache/hadoop/yarn/api/records/YarnApplicationState;Ljava/lang/String;Ljava/lang/String;JJLorg/apache/hadoop/yarn/api/records/FinalApplicationStatus;Lorg/apache/hadoop/yarn/api/records/ApplicationResourceUsageReport;Ljava/lang/String;FLjava/lang/String;Lorg/apache/hadoop/yarn/api/records/Token;Ljava/util/Set;)Lorg/apache/hadoop/yarn/api/records/ApplicationReport;

Stack Trace:
java.lang.NoSuchMethodError: org.apache.hadoop.yarn.server.utils.BuilderUtils.newApplicationReport(Lorg/apache/hadoop/yarn/api/records/ApplicationId;Lorg/apache/hadoop/yarn/api/records/ApplicationAttemptId;Ljava/lang/String;Ljava/lang/String;Ljava/lang/String;Ljava/lang/String;ILorg/apache/hadoop/yarn/api/records/Token;Lorg/apache/hadoop/yarn/api/records/YarnApplicationState;Ljava/lang/String;Ljava/lang/String;JJLorg/apache/hadoop/yarn/api/records/FinalApplicationStatus;Lorg/apache/hadoop/yarn/api/records/ApplicationResourceUsageReport;Ljava/lang/String;FLjava/lang/String;Lorg/apache/hadoop/yarn/api/records/Token;Ljava/util/Set;)Lorg/apache/hadoop/yarn/api/records/ApplicationReport;
	at org.apache.hadoop.yarn.server.resourcemanager.rmapp.RMAppImpl.createAndGetApplicationReport(RMAppImpl.java:660)
	at org.apache.hadoop.yarn.server.resourcemanager.ClientRMService.getApplications(ClientRMService.java:810)
	at org.apache.hadoop.yarn.server.resourcemanager.ClientRMService.getApplications(ClientRMService.java:677)
	at org.apache.hadoop.yarn.server.resourcemanager.TestRM.testInvalidateAMHostPortWhenAMFailedOrKilled(TestRM.java:519)


FAILED:  org.apache.hadoop.yarn.server.resourcemanager.TestRM.testInvalidatedAMHostPortOnAMRestart[0]

Error Message:
org.apache.hadoop.yarn.server.utils.BuilderUtils.newApplicationReport(Lorg/apache/hadoop/yarn/api/records/ApplicationId;Lorg/apache/hadoop/yarn/api/records/ApplicationAttemptId;Ljava/lang/String;Ljava/lang/String;Ljava/lang/String;Ljava/lang/String;ILorg/apache/hadoop/yarn/api/records/Token;Lorg/apache/hadoop/yarn/api/records/YarnApplicationState;Ljava/lang/String;Ljava/lang/String;JJLorg/apache/hadoop/yarn/api/records/FinalApplicationStatus;Lorg/apache/hadoop/yarn/api/records/ApplicationResourceUsageReport;Ljava/lang/String;FLjava/lang/String;Lorg/apache/hadoop/yarn/api/records/Token;Ljava/util/Set;)Lorg/apache/hadoop/yarn/api/records/ApplicationReport;

Stack Trace:
java.lang.NoSuchMethodError: org.apache.hadoop.yarn.server.utils.BuilderUtils.newApplicationReport(Lorg/apache/hadoop/yarn/api/records/ApplicationId;Lorg/apache/hadoop/yarn/api/records/ApplicationAttemptId;Ljava/lang/String;Ljava/lang/String;Ljava/lang/String;Ljava/lang/String;ILorg/apache/hadoop/yarn/api/records/Token;Lorg/apache/hadoop/yarn/api/records/YarnApplicationState;Ljava/lang/String;Ljava/lang/String;JJLorg/apache/hadoop/yarn/api/records/FinalApplicationStatus;Lorg/apache/hadoop/yarn/api/records/ApplicationResourceUsageReport;Ljava/lang/String;FLjava/lang/String;Lorg/apache/hadoop/yarn/api/records/Token;Ljava/util/Set;)Lorg/apache/hadoop/yarn/api/records/ApplicationReport;
	at org.apache.hadoop.yarn.server.resourcemanager.rmapp.RMAppImpl.createAndGetApplicationReport(RMAppImpl.java:660)
	at org.apache.hadoop.yarn.server.resourcemanager.ClientRMService.getApplicationReport(ClientRMService.java:334)
	at org.apache.hadoop.yarn.server.resourcemanager.TestRM.testInvalidatedAMHostPortOnAMRestart(TestRM.java:559)


FAILED:  org.apache.hadoop.yarn.server.resourcemanager.TestRM.testInvalidateAMHostPortWhenAMFailedOrKilled[1]

Error Message:
org.apache.hadoop.yarn.server.utils.BuilderUtils.newApplicationReport(Lorg/apache/hadoop/yarn/api/records/ApplicationId;Lorg/apache/hadoop/yarn/api/records/ApplicationAttemptId;Ljava/lang/String;Ljava/lang/String;Ljava/lang/String;Ljava/lang/String;ILorg/apache/hadoop/yarn/api/records/Token;Lorg/apache/hadoop/yarn/api/records/YarnApplicationState;Ljava/lang/String;Ljava/lang/String;JJLorg/apache/hadoop/yarn/api/records/FinalApplicationStatus;Lorg/apache/hadoop/yarn/api/records/ApplicationResourceUsageReport;Ljava/lang/String;FLjava/lang/String;Lorg/apache/hadoop/yarn/api/records/Token;Ljava/util/Set;)Lorg/apache/hadoop/yarn/api/records/ApplicationReport;

Stack Trace:
java.lang.NoSuchMethodError: org.apache.hadoop.yarn.server.utils.BuilderUtils.newApplicationReport(Lorg/apache/hadoop/yarn/api/records/ApplicationId;Lorg/apache/hadoop/yarn/api/records/ApplicationAttemptId;Ljava/lang/String;Ljava/lang/String;Ljava/lang/String;Ljava/lang/String;ILorg/apache/hadoop/yarn/api/records/Token;Lorg/apache/hadoop/yarn/api/records/YarnApplicationState;Ljava/lang/String;Ljava/lang/String;JJLorg/apache/hadoop/yarn/api/records/FinalApplicationStatus;Lorg/apache/hadoop/yarn/api/records/ApplicationResourceUsageReport;Ljava/lang/String;FLjava/lang/String;Lorg/apache/hadoop/yarn/api/records/Token;Ljava/util/Set;)Lorg/apache/hadoop/yarn/api/records/ApplicationReport;
	at org.apache.hadoop.yarn.server.resourcemanager.rmapp.RMAppImpl.createAndGetApplicationReport(RMAppImpl.java:660)
	at org.apache.hadoop.yarn.server.resourcemanager.ClientRMService.getApplications(ClientRMService.java:810)
	at org.apache.hadoop.yarn.server.resourcemanager.ClientRMService.getApplications(ClientRMService.java:677)
	at org.apache.hadoop.yarn.server.resourcemanager.TestRM.testInvalidateAMHostPortWhenAMFailedOrKilled(TestRM.java:519)


FAILED:  org.apache.hadoop.yarn.server.resourcemanager.TestRM.testInvalidatedAMHostPortOnAMRestart[1]

Error Message:
org.apache.hadoop.yarn.server.utils.BuilderUtils.newApplicationReport(Lorg/apache/hadoop/yarn/api/records/ApplicationId;Lorg/apache/hadoop/yarn/api/records/ApplicationAttemptId;Ljava/lang/String;Ljava/lang/String;Ljava/lang/String;Ljava/lang/String;ILorg/apache/hadoop/yarn/api/records/Token;Lorg/apache/hadoop/yarn/api/records/YarnApplicationState;Ljava/lang/String;Ljava/lang/String;JJLorg/apache/hadoop/yarn/api/records/FinalApplicationStatus;Lorg/apache/hadoop/yarn/api/records/ApplicationResourceUsageReport;Ljava/lang/String;FLjava/lang/String;Lorg/apache/hadoop/yarn/api/records/Token;Ljava/util/Set;)Lorg/apache/hadoop/yarn/api/records/ApplicationReport;

Stack Trace:
java.lang.NoSuchMethodError: org.apache.hadoop.yarn.server.utils.BuilderUtils.newApplicationReport(Lorg/apache/hadoop/yarn/api/records/ApplicationId;Lorg/apache/hadoop/yarn/api/records/ApplicationAttemptId;Ljava/lang/String;Ljava/lang/String;Ljava/lang/String;Ljava/lang/String;ILorg/apache/hadoop/yarn/api/records/Token;Lorg/apache/hadoop/yarn/api/records/YarnApplicationState;Ljava/lang/String;Ljava/lang/String;JJLorg/apache/hadoop/yarn/api/records/FinalApplicationStatus;Lorg/apache/hadoop/yarn/api/records/ApplicationResourceUsageReport;Ljava/lang/String;FLjava/lang/String;Lorg/apache/hadoop/yarn/api/records/Token;Ljava/util/Set;)Lorg/apache/hadoop/yarn/api/records/ApplicationReport;
	at org.apache.hadoop.yarn.server.resourcemanager.rmapp.RMAppImpl.createAndGetApplicationReport(RMAppImpl.java:660)
	at org.apache.hadoop.yarn.server.resourcemanager.ClientRMService.getApplicationReport(ClientRMService.java:334)
	at org.apache.hadoop.yarn.server.resourcemanager.TestRM.testInvalidatedAMHostPortOnAMRestart(TestRM.java:559)


FAILED:  org.apache.hadoop.yarn.server.resourcemanager.TestRMHA.testFailoverClearsRMContext

Error Message:
expected:<application/json> but was:<text/html; charset=iso-8859-1>

Stack Trace:
java.lang.AssertionError: expected:<application/json> but was:<text/html; charset=iso-8859-1>
	at org.junit.Assert.fail(Assert.java:88)
	at org.junit.Assert.failNotEquals(Assert.java:743)
	at org.junit.Assert.assertEquals(Assert.java:118)
	at org.junit.Assert.assertEquals(Assert.java:144)
	at org.apache.hadoop.yarn.server.resourcemanager.TestRMHA.checkActiveRMWebServices(TestRMHA.java:162)
	at org.apache.hadoop.yarn.server.resourcemanager.TestRMHA.checkActiveRMFunctionality(TestRMHA.java:143)
	at org.apache.hadoop.yarn.server.resourcemanager.TestRMHA.testFailoverClearsRMContext(TestRMHA.java:541)


FAILED:  org.apache.hadoop.yarn.server.resourcemanager.TestRMHA.testTransitionsWhenAutomaticFailoverEnabled

Error Message:
expected:<application/json> but was:<text/html; charset=iso-8859-1>

Stack Trace:
java.lang.AssertionError: expected:<application/json> but was:<text/html; charset=iso-8859-1>
	at org.junit.Assert.fail(Assert.java:88)
	at org.junit.Assert.failNotEquals(Assert.java:743)
	at org.junit.Assert.assertEquals(Assert.java:118)
	at org.junit.Assert.assertEquals(Assert.java:144)
	at org.apache.hadoop.yarn.server.resourcemanager.TestRMHA.checkActiveRMWebServices(TestRMHA.java:162)
	at org.apache.hadoop.yarn.server.resourcemanager.TestRMHA.checkActiveRMFunctionality(TestRMHA.java:143)
	at org.apache.hadoop.yarn.server.resourcemanager.TestRMHA.testTransitionsWhenAutomaticFailoverEnabled(TestRMHA.java:300)


FAILED:  org.apache.hadoop.yarn.server.resourcemanager.TestRMHA.testFailoverWhenTransitionToActiveThrowException

Error Message:
expected:<application/json> but was:<text/html; charset=iso-8859-1>

Stack Trace:
java.lang.AssertionError: expected:<application/json> but was:<text/html; charset=iso-8859-1>
	at org.junit.Assert.fail(Assert.java:88)
	at org.junit.Assert.failNotEquals(Assert.java:743)
	at org.junit.Assert.assertEquals(Assert.java:118)
	at org.junit.Assert.assertEquals(Assert.java:144)
	at org.apache.hadoop.yarn.server.resourcemanager.TestRMHA.checkActiveRMWebServices(TestRMHA.java:162)
	at org.apache.hadoop.yarn.server.resourcemanager.TestRMHA.checkActiveRMFunctionality(TestRMHA.java:143)
	at org.apache.hadoop.yarn.server.resourcemanager.TestRMHA.testFailoverWhenTransitionToActiveThrowException(TestRMHA.java:453)


FAILED:  org.apache.hadoop.yarn.server.resourcemanager.TestRMHA.testFailoverAndTransitions

Error Message:
expected:<application/json> but was:<text/html; charset=iso-8859-1>

Stack Trace:
java.lang.AssertionError: expected:<application/json> but was:<text/html; charset=iso-8859-1>
	at org.junit.Assert.fail(Assert.java:88)
	at org.junit.Assert.failNotEquals(Assert.java:743)
	at org.junit.Assert.assertEquals(Assert.java:118)
	at org.junit.Assert.assertEquals(Assert.java:144)
	at org.apache.hadoop.yarn.server.resourcemanager.TestRMHA.checkActiveRMWebServices(TestRMHA.java:162)
	at org.apache.hadoop.yarn.server.resourcemanager.TestRMHA.checkActiveRMFunctionality(TestRMHA.java:143)
	at org.apache.hadoop.yarn.server.resourcemanager.TestRMHA.testFailoverAndTransitions(TestRMHA.java:212)


FAILED:  org.apache.hadoop.yarn.server.resourcemanager.TestRMRestart.testRMRestartGetApplicationList[0]

Error Message:
org.apache.hadoop.yarn.server.utils.BuilderUtils.newApplicationReport(Lorg/apache/hadoop/yarn/api/records/ApplicationId;Lorg/apache/hadoop/yarn/api/records/ApplicationAttemptId;Ljava/lang/String;Ljava/lang/String;Ljava/lang/String;Ljava/lang/String;ILorg/apache/hadoop/yarn/api/records/Token;Lorg/apache/hadoop/yarn/api/records/YarnApplicationState;Ljava/lang/String;Ljava/lang/String;JJLorg/apache/hadoop/yarn/api/records/FinalApplicationStatus;Lorg/apache/hadoop/yarn/api/records/ApplicationResourceUsageReport;Ljava/lang/String;FLjava/lang/String;Lorg/apache/hadoop/yarn/api/records/Token;Ljava/util/Set;)Lorg/apache/hadoop/yarn/api/records/ApplicationReport;

Stack Trace:
java.lang.NoSuchMethodError: org.apache.hadoop.yarn.server.utils.BuilderUtils.newApplicationReport(Lorg/apache/hadoop/yarn/api/records/ApplicationId;Lorg/apache/hadoop/yarn/api/records/ApplicationAttemptId;Ljava/lang/String;Ljava/lang/String;Ljava/lang/String;Ljava/lang/String;ILorg/apache/hadoop/yarn/api/records/Token;Lorg/apache/hadoop/yarn/api/records/YarnApplicationState;Ljava/lang/String;Ljava/lang/String;JJLorg/apache/hadoop/yarn/api/records/FinalApplicationStatus;Lorg/apache/hadoop/yarn/api/records/ApplicationResourceUsageReport;Ljava/lang/String;FLjava/lang/String;Lorg/apache/hadoop/yarn/api/records/Token;Ljava/util/Set;)Lorg/apache/hadoop/yarn/api/records/ApplicationReport;
	at org.apache.hadoop.yarn.server.resourcemanager.rmapp.RMAppImpl.createAndGetApplicationReport(RMAppImpl.java:660)
	at org.apache.hadoop.yarn.server.resourcemanager.ClientRMService.getApplications(ClientRMService.java:810)
	at org.apache.hadoop.yarn.server.resourcemanager.ClientRMService.getApplications(ClientRMService.java:677)
	at org.apache.hadoop.yarn.server.resourcemanager.TestRMRestart.testRMRestartGetApplicationList(TestRMRestart.java:943)


FAILED:  org.apache.hadoop.yarn.server.resourcemanager.TestRMRestart.testRMRestartKilledApp[0]

Error Message:
org.apache.hadoop.yarn.server.utils.BuilderUtils.newApplicationReport(Lorg/apache/hadoop/yarn/api/records/ApplicationId;Lorg/apache/hadoop/yarn/api/records/ApplicationAttemptId;Ljava/lang/String;Ljava/lang/String;Ljava/lang/String;Ljava/lang/String;ILorg/apache/hadoop/yarn/api/records/Token;Lorg/apache/hadoop/yarn/api/records/YarnApplicationState;Ljava/lang/String;Ljava/lang/String;JJLorg/apache/hadoop/yarn/api/records/FinalApplicationStatus;Lorg/apache/hadoop/yarn/api/records/ApplicationResourceUsageReport;Ljava/lang/String;FLjava/lang/String;Lorg/apache/hadoop/yarn/api/records/Token;Ljava/util/Set;)Lorg/apache/hadoop/yarn/api/records/ApplicationReport;

Stack Trace:
java.lang.NoSuchMethodError: org.apache.hadoop.yarn.server.utils.BuilderUtils.newApplicationReport(Lorg/apache/hadoop/yarn/api/records/ApplicationId;Lorg/apache/hadoop/yarn/api/records/ApplicationAttemptId;Ljava/lang/String;Ljava/lang/String;Ljava/lang/String;Ljava/lang/String;ILorg/apache/hadoop/yarn/api/records/Token;Lorg/apache/hadoop/yarn/api/records/YarnApplicationState;Ljava/lang/String;Ljava/lang/String;JJLorg/apache/hadoop/yarn/api/records/FinalApplicationStatus;Lorg/apache/hadoop/yarn/api/records/ApplicationResourceUsageReport;Ljava/lang/String;FLjava/lang/String;Lorg/apache/hadoop/yarn/api/records/Token;Ljava/util/Set;)Lorg/apache/hadoop/yarn/api/records/ApplicationReport;
	at org.apache.hadoop.yarn.server.resourcemanager.rmapp.RMAppImpl.createAndGetApplicationReport(RMAppImpl.java:660)
	at org.apache.hadoop.yarn.server.resourcemanager.ClientRMService.getApplicationReport(ClientRMService.java:334)
	at org.apache.hadoop.yarn.server.resourcemanager.TestRMRestart.verifyAppReportAfterRMRestart(TestRMRestart.java:1000)
	at org.apache.hadoop.yarn.server.resourcemanager.TestRMRestart.testRMRestartKilledApp(TestRMRestart.java:796)


FAILED:  org.apache.hadoop.yarn.server.resourcemanager.TestRMRestart.testRMRestartSucceededApp[0]

Error Message:
org.apache.hadoop.yarn.server.utils.BuilderUtils.newApplicationReport(Lorg/apache/hadoop/yarn/api/records/ApplicationId;Lorg/apache/hadoop/yarn/api/records/ApplicationAttemptId;Ljava/lang/String;Ljava/lang/String;Ljava/lang/String;Ljava/lang/String;ILorg/apache/hadoop/yarn/api/records/Token;Lorg/apache/hadoop/yarn/api/records/YarnApplicationState;Ljava/lang/String;Ljava/lang/String;JJLorg/apache/hadoop/yarn/api/records/FinalApplicationStatus;Lorg/apache/hadoop/yarn/api/records/ApplicationResourceUsageReport;Ljava/lang/String;FLjava/lang/String;Lorg/apache/hadoop/yarn/api/records/Token;Ljava/util/Set;)Lorg/apache/hadoop/yarn/api/records/ApplicationReport;

Stack Trace:
java.lang.NoSuchMethodError: org.apache.hadoop.yarn.server.utils.BuilderUtils.newApplicationReport(Lorg/apache/hadoop/yarn/api/records/ApplicationId;Lorg/apache/hadoop/yarn/api/records/ApplicationAttemptId;Ljava/lang/String;Ljava/lang/String;Ljava/lang/String;Ljava/lang/String;ILorg/apache/hadoop/yarn/api/records/Token;Lorg/apache/hadoop/yarn/api/records/YarnApplicationState;Ljava/lang/String;Ljava/lang/String;JJLorg/apache/hadoop/yarn/api/records/FinalApplicationStatus;Lorg/apache/hadoop/yarn/api/records/ApplicationResourceUsageReport;Ljava/lang/String;FLjava/lang/String;Lorg/apache/hadoop/yarn/api/records/Token;Ljava/util/Set;)Lorg/apache/hadoop/yarn/api/records/ApplicationReport;
	at org.apache.hadoop.yarn.server.resourcemanager.rmapp.RMAppImpl.createAndGetApplicationReport(RMAppImpl.java:660)
	at org.apache.hadoop.yarn.server.resourcemanager.ClientRMService.getApplicationReport(ClientRMService.java:334)
	at org.apache.hadoop.yarn.server.resourcemanager.TestRMRestart.verifyAppReportAfterRMRestart(TestRMRestart.java:1000)
	at org.apache.hadoop.yarn.server.resourcemanager.TestRMRestart.testRMRestartSucceededApp(TestRMRestart.java:886)


FAILED:  org.apache.hadoop.yarn.server.resourcemanager.TestRMRestart.testRMRestartFailedApp[0]

Error Message:
org.apache.hadoop.yarn.server.utils.BuilderUtils.newApplicationReport(Lorg/apache/hadoop/yarn/api/records/ApplicationId;Lorg/apache/hadoop/yarn/api/records/ApplicationAttemptId;Ljava/lang/String;Ljava/lang/String;Ljava/lang/String;Ljava/lang/String;ILorg/apache/hadoop/yarn/api/records/Token;Lorg/apache/hadoop/yarn/api/records/YarnApplicationState;Ljava/lang/String;Ljava/lang/String;JJLorg/apache/hadoop/yarn/api/records/FinalApplicationStatus;Lorg/apache/hadoop/yarn/api/records/ApplicationResourceUsageReport;Ljava/lang/String;FLjava/lang/String;Lorg/apache/hadoop/yarn/api/records/Token;Ljava/util/Set;)Lorg/apache/hadoop/yarn/api/records/ApplicationReport;

Stack Trace:
java.lang.NoSuchMethodError: org.apache.hadoop.yarn.server.utils.BuilderUtils.newApplicationReport(Lorg/apache/hadoop/yarn/api/records/ApplicationId;Lorg/apache/hadoop/yarn/api/records/ApplicationAttemptId;Ljava/lang/String;Ljava/lang/String;Ljava/lang/String;Ljava/lang/String;ILorg/apache/hadoop/yarn/api/records/Token;Lorg/apache/hadoop/yarn/api/records/YarnApplicationState;Ljava/lang/String;Ljava/lang/String;JJLorg/apache/hadoop/yarn/api/records/FinalApplicationStatus;Lorg/apache/hadoop/yarn/api/records/ApplicationResourceUsageReport;Ljava/lang/String;FLjava/lang/String;Lorg/apache/hadoop/yarn/api/records/Token;Ljava/util/Set;)Lorg/apache/hadoop/yarn/api/records/ApplicationReport;
	at org.apache.hadoop.yarn.server.resourcemanager.rmapp.RMAppImpl.createAndGetApplicationReport(RMAppImpl.java:660)
	at org.apache.hadoop.yarn.server.resourcemanager.ClientRMService.getApplicationReport(ClientRMService.java:334)
	at org.apache.hadoop.yarn.server.resourcemanager.TestRMRestart.verifyAppReportAfterRMRestart(TestRMRestart.java:1000)
	at org.apache.hadoop.yarn.server.resourcemanager.TestRMRestart.testRMRestartFailedApp(TestRMRestart.java:746)


FAILED:  org.apache.hadoop.yarn.server.resourcemanager.TestRMRestart.testRMRestartGetApplicationList[1]

Error Message:
org.apache.hadoop.yarn.server.utils.BuilderUtils.newApplicationReport(Lorg/apache/hadoop/yarn/api/records/ApplicationId;Lorg/apache/hadoop/yarn/api/records/ApplicationAttemptId;Ljava/lang/String;Ljava/lang/String;Ljava/lang/String;Ljava/lang/String;ILorg/apache/hadoop/yarn/api/records/Token;Lorg/apache/hadoop/yarn/api/records/YarnApplicationState;Ljava/lang/String;Ljava/lang/String;JJLorg/apache/hadoop/yarn/api/records/FinalApplicationStatus;Lorg/apache/hadoop/yarn/api/records/ApplicationResourceUsageReport;Ljava/lang/String;FLjava/lang/String;Lorg/apache/hadoop/yarn/api/records/Token;Ljava/util/Set;)Lorg/apache/hadoop/yarn/api/records/ApplicationReport;

Stack Trace:
java.lang.NoSuchMethodError: org.apache.hadoop.yarn.server.utils.BuilderUtils.newApplicationReport(Lorg/apache/hadoop/yarn/api/records/ApplicationId;Lorg/apache/hadoop/yarn/api/records/ApplicationAttemptId;Ljava/lang/String;Ljava/lang/String;Ljava/lang/String;Ljava/lang/String;ILorg/apache/hadoop/yarn/api/records/Token;Lorg/apache/hadoop/yarn/api/records/YarnApplicationState;Ljava/lang/String;Ljava/lang/String;JJLorg/apache/hadoop/yarn/api/records/FinalApplicationStatus;Lorg/apache/hadoop/yarn/api/records/ApplicationResourceUsageReport;Ljava/lang/String;FLjava/lang/String;Lorg/apache/hadoop/yarn/api/records/Token;Ljava/util/Set;)Lorg/apache/hadoop/yarn/api/records/ApplicationReport;
	at org.apache.hadoop.yarn.server.resourcemanager.rmapp.RMAppImpl.createAndGetApplicationReport(RMAppImpl.java:660)
	at org.apache.hadoop.yarn.server.resourcemanager.ClientRMService.getApplications(ClientRMService.java:810)
	at org.apache.hadoop.yarn.server.resourcemanager.ClientRMService.getApplications(ClientRMService.java:677)
	at org.apache.hadoop.yarn.server.resourcemanager.TestRMRestart.testRMRestartGetApplicationList(TestRMRestart.java:943)


FAILED:  org.apache.hadoop.yarn.server.resourcemanager.TestRMRestart.testRMRestartKilledApp[1]

Error Message:
org.apache.hadoop.yarn.server.utils.BuilderUtils.newApplicationReport(Lorg/apache/hadoop/yarn/api/records/ApplicationId;Lorg/apache/hadoop/yarn/api/records/ApplicationAttemptId;Ljava/lang/String;Ljava/lang/String;Ljava/lang/String;Ljava/lang/String;ILorg/apache/hadoop/yarn/api/records/Token;Lorg/apache/hadoop/yarn/api/records/YarnApplicationState;Ljava/lang/String;Ljava/lang/String;JJLorg/apache/hadoop/yarn/api/records/FinalApplicationStatus;Lorg/apache/hadoop/yarn/api/records/ApplicationResourceUsageReport;Ljava/lang/String;FLjava/lang/String;Lorg/apache/hadoop/yarn/api/records/Token;Ljava/util/Set;)Lorg/apache/hadoop/yarn/api/records/ApplicationReport;

Stack Trace:
java.lang.NoSuchMethodError: org.apache.hadoop.yarn.server.utils.BuilderUtils.newApplicationReport(Lorg/apache/hadoop/yarn/api/records/ApplicationId;Lorg/apache/hadoop/yarn/api/records/ApplicationAttemptId;Ljava/lang/String;Ljava/lang/String;Ljava/lang/String;Ljava/lang/String;ILorg/apache/hadoop/yarn/api/records/Token;Lorg/apache/hadoop/yarn/api/records/YarnApplicationState;Ljava/lang/String;Ljava/lang/String;JJLorg/apache/hadoop/yarn/api/records/FinalApplicationStatus;Lorg/apache/hadoop/yarn/api/records/ApplicationResourceUsageReport;Ljava/lang/String;FLjava/lang/String;Lorg/apache/hadoop/yarn/api/records/Token;Ljava/util/Set;)Lorg/apache/hadoop/yarn/api/records/ApplicationReport;
	at org.apache.hadoop.yarn.server.resourcemanager.rmapp.RMAppImpl.createAndGetApplicationReport(RMAppImpl.java:660)
	at org.apache.hadoop.yarn.server.resourcemanager.ClientRMService.getApplicationReport(ClientRMService.java:334)
	at org.apache.hadoop.yarn.server.resourcemanager.TestRMRestart.verifyAppReportAfterRMRestart(TestRMRestart.java:1000)
	at org.apache.hadoop.yarn.server.resourcemanager.TestRMRestart.testRMRestartKilledApp(TestRMRestart.java:796)


FAILED:  org.apache.hadoop.yarn.server.resourcemanager.TestRMRestart.testRMRestartSucceededApp[1]

Error Message:
org.apache.hadoop.yarn.server.utils.BuilderUtils.newApplicationReport(Lorg/apache/hadoop/yarn/api/records/ApplicationId;Lorg/apache/hadoop/yarn/api/records/ApplicationAttemptId;Ljava/lang/String;Ljava/lang/String;Ljava/lang/String;Ljava/lang/String;ILorg/apache/hadoop/yarn/api/records/Token;Lorg/apache/hadoop/yarn/api/records/YarnApplicationState;Ljava/lang/String;Ljava/lang/String;JJLorg/apache/hadoop/yarn/api/records/FinalApplicationStatus;Lorg/apache/hadoop/yarn/api/records/ApplicationResourceUsageReport;Ljava/lang/String;FLjava/lang/String;Lorg/apache/hadoop/yarn/api/records/Token;Ljava/util/Set;)Lorg/apache/hadoop/yarn/api/records/ApplicationReport;

Stack Trace:
java.lang.NoSuchMethodError: org.apache.hadoop.yarn.server.utils.BuilderUtils.newApplicationReport(Lorg/apache/hadoop/yarn/api/records/ApplicationId;Lorg/apache/hadoop/yarn/api/records/ApplicationAttemptId;Ljava/lang/String;Ljava/lang/String;Ljava/lang/String;Ljava/lang/String;ILorg/apache/hadoop/yarn/api/records/Token;Lorg/apache/hadoop/yarn/api/records/YarnApplicationState;Ljava/lang/String;Ljava/lang/String;JJLorg/apache/hadoop/yarn/api/records/FinalApplicationStatus;Lorg/apache/hadoop/yarn/api/records/ApplicationResourceUsageReport;Ljava/lang/String;FLjava/lang/String;Lorg/apache/hadoop/yarn/api/records/Token;Ljava/util/Set;)Lorg/apache/hadoop/yarn/api/records/ApplicationReport;
	at org.apache.hadoop.yarn.server.resourcemanager.rmapp.RMAppImpl.createAndGetApplicationReport(RMAppImpl.java:660)
	at org.apache.hadoop.yarn.server.resourcemanager.ClientRMService.getApplicationReport(ClientRMService.java:334)
	at org.apache.hadoop.yarn.server.resourcemanager.TestRMRestart.verifyAppReportAfterRMRestart(TestRMRestart.java:1000)
	at org.apache.hadoop.yarn.server.resourcemanager.TestRMRestart.testRMRestartSucceededApp(TestRMRestart.java:886)


FAILED:  org.apache.hadoop.yarn.server.resourcemanager.TestRMRestart.testRMRestartFailedApp[1]

Error Message:
org.apache.hadoop.yarn.server.utils.BuilderUtils.newApplicationReport(Lorg/apache/hadoop/yarn/api/records/ApplicationId;Lorg/apache/hadoop/yarn/api/records/ApplicationAttemptId;Ljava/lang/String;Ljava/lang/String;Ljava/lang/String;Ljava/lang/String;ILorg/apache/hadoop/yarn/api/records/Token;Lorg/apache/hadoop/yarn/api/records/YarnApplicationState;Ljava/lang/String;Ljava/lang/String;JJLorg/apache/hadoop/yarn/api/records/FinalApplicationStatus;Lorg/apache/hadoop/yarn/api/records/ApplicationResourceUsageReport;Ljava/lang/String;FLjava/lang/String;Lorg/apache/hadoop/yarn/api/records/Token;Ljava/util/Set;)Lorg/apache/hadoop/yarn/api/records/ApplicationReport;

Stack Trace:
java.lang.NoSuchMethodError: org.apache.hadoop.yarn.server.utils.BuilderUtils.newApplicationReport(Lorg/apache/hadoop/yarn/api/records/ApplicationId;Lorg/apache/hadoop/yarn/api/records/ApplicationAttemptId;Ljava/lang/String;Ljava/lang/String;Ljava/lang/String;Ljava/lang/String;ILorg/apache/hadoop/yarn/api/records/Token;Lorg/apache/hadoop/yarn/api/records/YarnApplicationState;Ljava/lang/String;Ljava/lang/String;JJLorg/apache/hadoop/yarn/api/records/FinalApplicationStatus;Lorg/apache/hadoop/yarn/api/records/ApplicationResourceUsageReport;Ljava/lang/String;FLjava/lang/String;Lorg/apache/hadoop/yarn/api/records/Token;Ljava/util/Set;)Lorg/apache/hadoop/yarn/api/records/ApplicationReport;
	at org.apache.hadoop.yarn.server.resourcemanager.rmapp.RMAppImpl.createAndGetApplicationReport(RMAppImpl.java:660)
	at org.apache.hadoop.yarn.server.resourcemanager.ClientRMService.getApplicationReport(ClientRMService.java:334)
	at org.apache.hadoop.yarn.server.resourcemanager.TestRMRestart.verifyAppReportAfterRMRestart(TestRMRestart.java:1000)
	at org.apache.hadoop.yarn.server.resourcemanager.TestRMRestart.testRMRestartFailedApp(TestRMRestart.java:746)


FAILED:  org.apache.hadoop.yarn.server.resourcemanager.TestSubmitApplicationWithRMHA.testHandleRMHAafterSubmitApplicationCallWithSavedApplicationState

Error Message:
org.apache.hadoop.yarn.server.utils.BuilderUtils.newApplicationReport(Lorg/apache/hadoop/yarn/api/records/ApplicationId;Lorg/apache/hadoop/yarn/api/records/ApplicationAttemptId;Ljava/lang/String;Ljava/lang/String;Ljava/lang/String;Ljava/lang/String;ILorg/apache/hadoop/yarn/api/records/Token;Lorg/apache/hadoop/yarn/api/records/YarnApplicationState;Ljava/lang/String;Ljava/lang/String;JJLorg/apache/hadoop/yarn/api/records/FinalApplicationStatus;Lorg/apache/hadoop/yarn/api/records/ApplicationResourceUsageReport;Ljava/lang/String;FLjava/lang/String;Lorg/apache/hadoop/yarn/api/records/Token;Ljava/util/Set;)Lorg/apache/hadoop/yarn/api/records/ApplicationReport;

Stack Trace:
java.lang.NoSuchMethodError: org.apache.hadoop.yarn.server.utils.BuilderUtils.newApplicationReport(Lorg/apache/hadoop/yarn/api/records/ApplicationId;Lorg/apache/hadoop/yarn/api/records/ApplicationAttemptId;Ljava/lang/String;Ljava/lang/String;Ljava/lang/String;Ljava/lang/String;ILorg/apache/hadoop/yarn/api/records/Token;Lorg/apache/hadoop/yarn/api/records/YarnApplicationState;Ljava/lang/String;Ljava/lang/String;JJLorg/apache/hadoop/yarn/api/records/FinalApplicationStatus;Lorg/apache/hadoop/yarn/api/records/ApplicationResourceUsageReport;Ljava/lang/String;FLjava/lang/String;Lorg/apache/hadoop/yarn/api/records/Token;Ljava/util/Set;)Lorg/apache/hadoop/yarn/api/records/ApplicationReport;
	at org.apache.hadoop.yarn.server.resourcemanager.rmapp.RMAppImpl.createAndGetApplicationReport(RMAppImpl.java:660)
	at org.apache.hadoop.yarn.server.resourcemanager.ClientRMService.getApplicationReport(ClientRMService.java:334)
	at org.apache.hadoop.yarn.server.resourcemanager.MockRM.getApplicationReport(MockRM.java:775)
	at org.apache.hadoop.yarn.server.resourcemanager.TestSubmitApplicationWithRMHA.testHandleRMHAafterSubmitApplicationCallWithSavedApplicationState(TestSubmitApplicationWithRMHA.java:117)


FAILED:  org.apache.hadoop.yarn.server.resourcemanager.TestSubmitApplicationWithRMHA.testHandleRMHAafterSubmitApplicationCallWithoutSavedApplicationState

Error Message:
org.apache.hadoop.yarn.server.utils.BuilderUtils.newApplicationReport(Lorg/apache/hadoop/yarn/api/records/ApplicationId;Lorg/apache/hadoop/yarn/api/records/ApplicationAttemptId;Ljava/lang/String;Ljava/lang/String;Ljava/lang/String;Ljava/lang/String;ILorg/apache/hadoop/yarn/api/records/Token;Lorg/apache/hadoop/yarn/api/records/YarnApplicationState;Ljava/lang/String;Ljava/lang/String;JJLorg/apache/hadoop/yarn/api/records/FinalApplicationStatus;Lorg/apache/hadoop/yarn/api/records/ApplicationResourceUsageReport;Ljava/lang/String;FLjava/lang/String;Lorg/apache/hadoop/yarn/api/records/Token;Ljava/util/Set;)Lorg/apache/hadoop/yarn/api/records/ApplicationReport;

Stack Trace:
java.lang.NoSuchMethodError: org.apache.hadoop.yarn.server.utils.BuilderUtils.newApplicationReport(Lorg/apache/hadoop/yarn/api/records/ApplicationId;Lorg/apache/hadoop/yarn/api/records/ApplicationAttemptId;Ljava/lang/String;Ljava/lang/String;Ljava/lang/String;Ljava/lang/String;ILorg/apache/hadoop/yarn/api/records/Token;Lorg/apache/hadoop/yarn/api/records/YarnApplicationState;Ljava/lang/String;Ljava/lang/String;JJLorg/apache/hadoop/yarn/api/records/FinalApplicationStatus;Lorg/apache/hadoop/yarn/api/records/ApplicationResourceUsageReport;Ljava/lang/String;FLjava/lang/String;Lorg/apache/hadoop/yarn/api/records/Token;Ljava/util/Set;)Lorg/apache/hadoop/yarn/api/records/ApplicationReport;
	at org.apache.hadoop.yarn.server.resourcemanager.rmapp.RMAppImpl.createAndGetApplicationReport(RMAppImpl.java:660)
	at org.apache.hadoop.yarn.server.resourcemanager.ClientRMService.getApplicationReport(ClientRMService.java:334)
	at org.apache.hadoop.yarn.server.resourcemanager.MockRM.getApplicationReport(MockRM.java:775)
	at org.apache.hadoop.yarn.server.resourcemanager.TestSubmitApplicationWithRMHA.verifySubmitApp(TestSubmitApplicationWithRMHA.java:71)
	at org.apache.hadoop.yarn.server.resourcemanager.TestSubmitApplicationWithRMHA.testHandleRMHAafterSubmitApplicationCallWithoutSavedApplicationState(TestSubmitApplicationWithRMHA.java:172)


FAILED:  org.apache.hadoop.yarn.server.resourcemanager.TestSubmitApplicationWithRMHA.testHandleRMHABeforeSubmitApplicationCallWithSavedApplicationState

Error Message:
org.apache.hadoop.yarn.server.utils.BuilderUtils.newApplicationReport(Lorg/apache/hadoop/yarn/api/records/ApplicationId;Lorg/apache/hadoop/yarn/api/records/ApplicationAttemptId;Ljava/lang/String;Ljava/lang/String;Ljava/lang/String;Ljava/lang/String;ILorg/apache/hadoop/yarn/api/records/Token;Lorg/apache/hadoop/yarn/api/records/YarnApplicationState;Ljava/lang/String;Ljava/lang/String;JJLorg/apache/hadoop/yarn/api/records/FinalApplicationStatus;Lorg/apache/hadoop/yarn/api/records/ApplicationResourceUsageReport;Ljava/lang/String;FLjava/lang/String;Lorg/apache/hadoop/yarn/api/records/Token;Ljava/util/Set;)Lorg/apache/hadoop/yarn/api/records/ApplicationReport;

Stack Trace:
java.lang.NoSuchMethodError: org.apache.hadoop.yarn.server.utils.BuilderUtils.newApplicationReport(Lorg/apache/hadoop/yarn/api/records/ApplicationId;Lorg/apache/hadoop/yarn/api/records/ApplicationAttemptId;Ljava/lang/String;Ljava/lang/String;Ljava/lang/String;Ljava/lang/String;ILorg/apache/hadoop/yarn/api/records/Token;Lorg/apache/hadoop/yarn/api/records/YarnApplicationState;Ljava/lang/String;Ljava/lang/String;JJLorg/apache/hadoop/yarn/api/records/FinalApplicationStatus;Lorg/apache/hadoop/yarn/api/records/ApplicationResourceUsageReport;Ljava/lang/String;FLjava/lang/String;Lorg/apache/hadoop/yarn/api/records/Token;Ljava/util/Set;)Lorg/apache/hadoop/yarn/api/records/ApplicationReport;
	at org.apache.hadoop.yarn.server.resourcemanager.rmapp.RMAppImpl.createAndGetApplicationReport(RMAppImpl.java:660)
	at org.apache.hadoop.yarn.server.resourcemanager.ClientRMService.getApplicationReport(ClientRMService.java:334)
	at org.apache.hadoop.yarn.server.resourcemanager.MockRM.getApplicationReport(MockRM.java:775)
	at org.apache.hadoop.yarn.server.resourcemanager.TestSubmitApplicationWithRMHA.verifySubmitApp(TestSubmitApplicationWithRMHA.java:71)
	at org.apache.hadoop.yarn.server.resourcemanager.TestSubmitApplicationWithRMHA.testHandleRMHABeforeSubmitApplicationCallWithSavedApplicationState(TestSubmitApplicationWithRMHA.java:63)


FAILED:  org.apache.hadoop.yarn.server.resourcemanager.TestSubmitApplicationWithRMHA.testHandleRMHADuringSubmitApplicationCallWithoutSavedApplicationState

Error Message:
org.apache.hadoop.yarn.server.utils.BuilderUtils.newApplicationReport(Lorg/apache/hadoop/yarn/api/records/ApplicationId;Lorg/apache/hadoop/yarn/api/records/ApplicationAttemptId;Ljava/lang/String;Ljava/lang/String;Ljava/lang/String;Ljava/lang/String;ILorg/apache/hadoop/yarn/api/records/Token;Lorg/apache/hadoop/yarn/api/records/YarnApplicationState;Ljava/lang/String;Ljava/lang/String;JJLorg/apache/hadoop/yarn/api/records/FinalApplicationStatus;Lorg/apache/hadoop/yarn/api/records/ApplicationResourceUsageReport;Ljava/lang/String;FLjava/lang/String;Lorg/apache/hadoop/yarn/api/records/Token;Ljava/util/Set;)Lorg/apache/hadoop/yarn/api/records/ApplicationReport;

Stack Trace:
java.lang.NoSuchMethodError: org.apache.hadoop.yarn.server.utils.BuilderUtils.newApplicationReport(Lorg/apache/hadoop/yarn/api/records/ApplicationId;Lorg/apache/hadoop/yarn/api/records/ApplicationAttemptId;Ljava/lang/String;Ljava/lang/String;Ljava/lang/String;Ljava/lang/String;ILorg/apache/hadoop/yarn/api/records/Token;Lorg/apache/hadoop/yarn/api/records/YarnApplicationState;Ljava/lang/String;Ljava/lang/String;JJLorg/apache/hadoop/yarn/api/records/FinalApplicationStatus;Lorg/apache/hadoop/yarn/api/records/ApplicationResourceUsageReport;Ljava/lang/String;FLjava/lang/String;Lorg/apache/hadoop/yarn/api/records/Token;Ljava/util/Set;)Lorg/apache/hadoop/yarn/api/records/ApplicationReport;
	at org.apache.hadoop.yarn.server.resourcemanager.rmapp.RMAppImpl.createAndGetApplicationReport(RMAppImpl.java:660)
	at org.apache.hadoop.yarn.server.resourcemanager.ClientRMService.getApplicationReport(ClientRMService.java:334)
	at org.apache.hadoop.yarn.server.resourcemanager.MockRM.getApplicationReport(MockRM.java:775)
	at org.apache.hadoop.yarn.server.resourcemanager.TestSubmitApplicationWithRMHA.verifySubmitApp(TestSubmitApplicationWithRMHA.java:71)
	at org.apache.hadoop.yarn.server.resourcemanager.TestSubmitApplicationWithRMHA.testHandleRMHADuringSubmitApplicationCallWithoutSavedApplicationState(TestSubmitApplicationWithRMHA.java:303)


FAILED:  org.apache.hadoop.yarn.server.resourcemanager.TestSubmitApplicationWithRMHA.testGetApplicationReportIdempotent

Error Message:
org.apache.hadoop.yarn.server.utils.BuilderUtils.newApplicationReport(Lorg/apache/hadoop/yarn/api/records/ApplicationId;Lorg/apache/hadoop/yarn/api/records/ApplicationAttemptId;Ljava/lang/String;Ljava/lang/String;Ljava/lang/String;Ljava/lang/String;ILorg/apache/hadoop/yarn/api/records/Token;Lorg/apache/hadoop/yarn/api/records/YarnApplicationState;Ljava/lang/String;Ljava/lang/String;JJLorg/apache/hadoop/yarn/api/records/FinalApplicationStatus;Lorg/apache/hadoop/yarn/api/records/ApplicationResourceUsageReport;Ljava/lang/String;FLjava/lang/String;Lorg/apache/hadoop/yarn/api/records/Token;Ljava/util/Set;)Lorg/apache/hadoop/yarn/api/records/ApplicationReport;

Stack Trace:
java.lang.NoSuchMethodError: org.apache.hadoop.yarn.server.utils.BuilderUtils.newApplicationReport(Lorg/apache/hadoop/yarn/api/records/ApplicationId;Lorg/apache/hadoop/yarn/api/records/ApplicationAttemptId;Ljava/lang/String;Ljava/lang/String;Ljava/lang/String;Ljava/lang/String;ILorg/apache/hadoop/yarn/api/records/Token;Lorg/apache/hadoop/yarn/api/records/YarnApplicationState;Ljava/lang/String;Ljava/lang/String;JJLorg/apache/hadoop/yarn/api/records/FinalApplicationStatus;Lorg/apache/hadoop/yarn/api/records/ApplicationResourceUsageReport;Ljava/lang/String;FLjava/lang/String;Lorg/apache/hadoop/yarn/api/records/Token;Ljava/util/Set;)Lorg/apache/hadoop/yarn/api/records/ApplicationReport;
	at org.apache.hadoop.yarn.server.resourcemanager.rmapp.RMAppImpl.createAndGetApplicationReport(RMAppImpl.java:660)
	at org.apache.hadoop.yarn.server.resourcemanager.ClientRMService.getApplicationReport(ClientRMService.java:334)
	at org.apache.hadoop.yarn.server.resourcemanager.MockRM.getApplicationReport(MockRM.java:775)
	at org.apache.hadoop.yarn.server.resourcemanager.TestSubmitApplicationWithRMHA.testGetApplicationReportIdempotent(TestSubmitApplicationWithRMHA.java:188)


FAILED:  org.apache.hadoop.yarn.server.resourcemanager.applicationsmanager.TestAMRestart.testRMAppAttemptFailuresValidityInterval

Error Message:
org/apache/hadoop/service/ServiceOperations

Stack Trace:
java.lang.NoClassDefFoundError: org/apache/hadoop/service/ServiceOperations
	at java.net.URLClassLoader$1.run(URLClassLoader.java:366)
	at java.net.URLClassLoader$1.run(URLClassLoader.java:355)
	at java.security.AccessController.doPrivileged(Native Method)
	at java.net.URLClassLoader.findClass(URLClassLoader.java:354)
	at java.lang.ClassLoader.loadClass(ClassLoader.java:425)
	at sun.misc.Launcher$AppClassLoader.loadClass(Launcher.java:308)
	at java.lang.ClassLoader.loadClass(ClassLoader.java:358)
	at org.apache.hadoop.service.CompositeService.stop(CompositeService.java:157)
	at org.apache.hadoop.service.CompositeService.serviceStop(CompositeService.java:131)
	at org.apache.hadoop.yarn.server.resourcemanager.ResourceManager.serviceStop(ResourceManager.java:1075)
	at org.apache.hadoop.service.AbstractService.stop(AbstractService.java:221)
	at org.apache.hadoop.yarn.server.resourcemanager.applicationsmanager.TestAMRestart.testRMAppAttemptFailuresValidityInterval(TestAMRestart.java:717)


FAILED:  org.apache.hadoop.yarn.server.resourcemanager.applicationsmanager.TestAMRestart.testShouldNotCountFailureToMaxAttemptRetry

Error Message:
org/apache/hadoop/service/ServiceOperations

Stack Trace:
java.lang.NoClassDefFoundError: org/apache/hadoop/service/ServiceOperations
	at org.apache.hadoop.service.CompositeService.stop(CompositeService.java:157)
	at org.apache.hadoop.service.CompositeService.serviceStop(CompositeService.java:131)
	at org.apache.hadoop.yarn.server.resourcemanager.ResourceManager.serviceStop(ResourceManager.java:1075)
	at org.apache.hadoop.service.AbstractService.stop(AbstractService.java:221)
	at org.apache.hadoop.yarn.server.resourcemanager.applicationsmanager.TestAMRestart.testShouldNotCountFailureToMaxAttemptRetry(TestAMRestart.java:461)


FAILED:  org.apache.hadoop.yarn.server.resourcemanager.applicationsmanager.TestAMRestart.testRMRestartOrFailoverNotCountedForAMFailures

Error Message:
org/apache/hadoop/service/ServiceOperations

Stack Trace:
java.lang.NoClassDefFoundError: org/apache/hadoop/service/ServiceOperations
	at java.net.URLClassLoader$1.run(URLClassLoader.java:366)
	at java.net.URLClassLoader$1.run(URLClassLoader.java:355)
	at java.security.AccessController.doPrivileged(Native Method)
	at java.net.URLClassLoader.findClass(URLClassLoader.java:354)
	at java.lang.ClassLoader.loadClass(ClassLoader.java:425)
	at sun.misc.Launcher$AppClassLoader.loadClass(Launcher.java:308)
	at java.lang.ClassLoader.loadClass(ClassLoader.java:358)
	at org.apache.hadoop.service.AbstractService.init(AbstractService.java:171)
	at org.apache.hadoop.yarn.server.resourcemanager.MockRM.<init>(MockRM.java:120)
	at org.apache.hadoop.yarn.server.resourcemanager.MockRM.<init>(MockRM.java:113)
	at org.apache.hadoop.yarn.server.resourcemanager.applicationsmanager.TestAMRestart.testRMRestartOrFailoverNotCountedForAMFailures(TestAMRestart.java:560)


FAILED:  org.apache.hadoop.yarn.server.resourcemanager.applicationsmanager.TestAMRestart.testPreemptedAMRestartOnRMRestart

Error Message:
java.util.zip.ZipException: invalid distance too far back

Stack Trace:
java.lang.RuntimeException: java.util.zip.ZipException: invalid distance too far back
	at java.util.zip.InflaterInputStream.read(InflaterInputStream.java:164)
	at java.util.zip.InflaterInputStream.read(InflaterInputStream.java:122)
	at java.io.FilterInputStream.read(FilterInputStream.java:83)
	at org.apache.xerces.impl.XMLEntityManager$RewindableInputStream.read(Unknown Source)
	at org.apache.xerces.impl.XMLEntityManager.setupCurrentEntity(Unknown Source)
	at org.apache.xerces.impl.XMLVersionDetector.determineDocVersion(Unknown Source)
	at org.apache.xerces.parsers.XML11Configuration.parse(Unknown Source)
	at org.apache.xerces.parsers.XML11Configuration.parse(Unknown Source)
	at org.apache.xerces.parsers.XMLParser.parse(Unknown Source)
	at org.apache.xerces.parsers.DOMParser.parse(Unknown Source)
	at org.apache.xerces.jaxp.DocumentBuilderImpl.parse(Unknown Source)
	at javax.xml.parsers.DocumentBuilder.parse(DocumentBuilder.java:150)
	at org.apache.hadoop.conf.Configuration.parse(Configuration.java:2546)
	at org.apache.hadoop.conf.Configuration.parse(Configuration.java:2534)
	at org.apache.hadoop.conf.Configuration.loadResource(Configuration.java:2605)
	at org.apache.hadoop.conf.Configuration.loadResources(Configuration.java:2558)
	at org.apache.hadoop.conf.Configuration.getProps(Configuration.java:2469)
	at org.apache.hadoop.conf.Configuration.set(Configuration.java:1205)
	at org.apache.hadoop.conf.Configuration.set(Configuration.java:1177)
	at org.apache.hadoop.conf.Configuration.setClass(Configuration.java:2334)
	at org.apache.hadoop.yarn.server.resourcemanager.applicationsmanager.TestAMRestart.testPreemptedAMRestartOnRMRestart(TestAMRestart.java:470)


FAILED:  org.apache.hadoop.yarn.server.resourcemanager.applicationsmanager.TestAMRestart.testAMRestartWithExistingContainers

Error Message:
java.util.zip.ZipException: invalid distance too far back

Stack Trace:
java.lang.RuntimeException: java.util.zip.ZipException: invalid distance too far back
	at java.util.zip.InflaterInputStream.read(InflaterInputStream.java:164)
	at java.util.zip.InflaterInputStream.read(InflaterInputStream.java:122)
	at java.io.FilterInputStream.read(FilterInputStream.java:83)
	at org.apache.xerces.impl.XMLEntityManager$RewindableInputStream.read(Unknown Source)
	at org.apache.xerces.impl.XMLEntityManager.setupCurrentEntity(Unknown Source)
	at org.apache.xerces.impl.XMLVersionDetector.determineDocVersion(Unknown Source)
	at org.apache.xerces.parsers.XML11Configuration.parse(Unknown Source)
	at org.apache.xerces.parsers.XML11Configuration.parse(Unknown Source)
	at org.apache.xerces.parsers.XMLParser.parse(Unknown Source)
	at org.apache.xerces.parsers.DOMParser.parse(Unknown Source)
	at org.apache.xerces.jaxp.DocumentBuilderImpl.parse(Unknown Source)
	at javax.xml.parsers.DocumentBuilder.parse(DocumentBuilder.java:150)
	at org.apache.hadoop.conf.Configuration.parse(Configuration.java:2546)
	at org.apache.hadoop.conf.Configuration.parse(Configuration.java:2534)
	at org.apache.hadoop.conf.Configuration.loadResource(Configuration.java:2605)
	at org.apache.hadoop.conf.Configuration.loadResources(Configuration.java:2558)
	at org.apache.hadoop.conf.Configuration.getProps(Configuration.java:2469)
	at org.apache.hadoop.conf.Configuration.set(Configuration.java:1205)
	at org.apache.hadoop.conf.Configuration.set(Configuration.java:1177)
	at org.apache.hadoop.conf.Configuration.setInt(Configuration.java:1349)
	at org.apache.hadoop.yarn.server.resourcemanager.applicationsmanager.TestAMRestart.testAMRestartWithExistingContainers(TestAMRestart.java:68)


FAILED:  org.apache.hadoop.yarn.server.resourcemanager.applicationsmanager.TestAMRestart.testNMTokensRebindOnAMRestart

Error Message:
java.util.zip.ZipException: invalid distance too far back

Stack Trace:
java.lang.RuntimeException: java.util.zip.ZipException: invalid distance too far back
	at java.util.zip.InflaterInputStream.read(InflaterInputStream.java:164)
	at java.util.zip.InflaterInputStream.read(InflaterInputStream.java:122)
	at java.io.FilterInputStream.read(FilterInputStream.java:83)
	at org.apache.xerces.impl.XMLEntityManager$RewindableInputStream.read(Unknown Source)
	at org.apache.xerces.impl.XMLEntityManager.setupCurrentEntity(Unknown Source)
	at org.apache.xerces.impl.XMLVersionDetector.determineDocVersion(Unknown Source)
	at org.apache.xerces.parsers.XML11Configuration.parse(Unknown Source)
	at org.apache.xerces.parsers.XML11Configuration.parse(Unknown Source)
	at org.apache.xerces.parsers.XMLParser.parse(Unknown Source)
	at org.apache.xerces.parsers.DOMParser.parse(Unknown Source)
	at org.apache.xerces.jaxp.DocumentBuilderImpl.parse(Unknown Source)
	at javax.xml.parsers.DocumentBuilder.parse(DocumentBuilder.java:150)
	at org.apache.hadoop.conf.Configuration.parse(Configuration.java:2546)
	at org.apache.hadoop.conf.Configuration.parse(Configuration.java:2534)
	at org.apache.hadoop.conf.Configuration.loadResource(Configuration.java:2605)
	at org.apache.hadoop.conf.Configuration.loadResources(Configuration.java:2558)
	at org.apache.hadoop.conf.Configuration.getProps(Configuration.java:2469)
	at org.apache.hadoop.conf.Configuration.set(Configuration.java:1205)
	at org.apache.hadoop.conf.Configuration.set(Configuration.java:1177)
	at org.apache.hadoop.conf.Configuration.setInt(Configuration.java:1349)
	at org.apache.hadoop.yarn.server.resourcemanager.applicationsmanager.TestAMRestart.testNMTokensRebindOnAMRestart(TestAMRestart.java:260)


FAILED:  org.apache.hadoop.yarn.server.resourcemanager.reservation.TestCapacitySchedulerPlanFollower.testWithKillOnExpiry

Error Message:
org.apache.hadoop.yarn.api.records.Resource.compareTo(Lorg/apache/hadoop/yarn/api/records/Resource;)I

Stack Trace:
java.lang.NoSuchMethodError: org.apache.hadoop.yarn.api.records.Resource.compareTo(Lorg/apache/hadoop/yarn/api/records/Resource;)I
	at org.apache.hadoop.yarn.server.resourcemanager.reservation.AbstractSchedulerPlanFollower$ReservationAllocationComparator.compare(AbstractSchedulerPlanFollower.java:407)
	at org.apache.hadoop.yarn.server.resourcemanager.reservation.AbstractSchedulerPlanFollower$ReservationAllocationComparator.compare(AbstractSchedulerPlanFollower.java:371)
	at java.util.TimSort.countRunAndMakeAscending(TimSort.java:324)
	at java.util.TimSort.sort(TimSort.java:189)
	at java.util.TimSort.sort(TimSort.java:173)
	at java.util.Arrays.sort(Arrays.java:659)
	at java.util.Collections.sort(Collections.java:217)
	at org.apache.hadoop.yarn.server.resourcemanager.reservation.AbstractSchedulerPlanFollower.sortByDelta(AbstractSchedulerPlanFollower.java:314)
	at org.apache.hadoop.yarn.server.resourcemanager.reservation.AbstractSchedulerPlanFollower.synchronizePlan(AbstractSchedulerPlanFollower.java:152)
	at org.apache.hadoop.yarn.server.resourcemanager.reservation.AbstractSchedulerPlanFollower.run(AbstractSchedulerPlanFollower.java:62)
	at org.apache.hadoop.yarn.server.resourcemanager.reservation.TestSchedulerPlanFollowerBase.testPlanFollower(TestSchedulerPlanFollowerBase.java:117)
	at org.apache.hadoop.yarn.server.resourcemanager.reservation.TestCapacitySchedulerPlanFollower.testWithKillOnExpiry(TestCapacitySchedulerPlanFollower.java:142)


FAILED:  org.apache.hadoop.yarn.server.resourcemanager.reservation.TestCapacitySchedulerPlanFollower.testWithMoveOnExpiry

Error Message:
org.apache.hadoop.yarn.api.records.Resource.compareTo(Lorg/apache/hadoop/yarn/api/records/Resource;)I

Stack Trace:
java.lang.NoSuchMethodError: org.apache.hadoop.yarn.api.records.Resource.compareTo(Lorg/apache/hadoop/yarn/api/records/Resource;)I
	at org.apache.hadoop.yarn.server.resourcemanager.reservation.AbstractSchedulerPlanFollower$ReservationAllocationComparator.compare(AbstractSchedulerPlanFollower.java:407)
	at org.apache.hadoop.yarn.server.resourcemanager.reservation.AbstractSchedulerPlanFollower$ReservationAllocationComparator.compare(AbstractSchedulerPlanFollower.java:371)
	at java.util.TimSort.countRunAndMakeAscending(TimSort.java:324)
	at java.util.TimSort.sort(TimSort.java:189)
	at java.util.TimSort.sort(TimSort.java:173)
	at java.util.Arrays.sort(Arrays.java:659)
	at java.util.Collections.sort(Collections.java:217)
	at org.apache.hadoop.yarn.server.resourcemanager.reservation.AbstractSchedulerPlanFollower.sortByDelta(AbstractSchedulerPlanFollower.java:314)
	at org.apache.hadoop.yarn.server.resourcemanager.reservation.AbstractSchedulerPlanFollower.synchronizePlan(AbstractSchedulerPlanFollower.java:152)
	at org.apache.hadoop.yarn.server.resourcemanager.reservation.AbstractSchedulerPlanFollower.run(AbstractSchedulerPlanFollower.java:62)
	at org.apache.hadoop.yarn.server.resourcemanager.reservation.TestSchedulerPlanFollowerBase.testPlanFollower(TestSchedulerPlanFollowerBase.java:117)
	at org.apache.hadoop.yarn.server.resourcemanager.reservation.TestCapacitySchedulerPlanFollower.testWithMoveOnExpiry(TestCapacitySchedulerPlanFollower.java:135)


FAILED:  org.apache.hadoop.yarn.server.resourcemanager.reservation.TestFairSchedulerPlanFollower.testWithKillOnExpiry

Error Message:
org.apache.hadoop.yarn.api.records.Resource.compareTo(Lorg/apache/hadoop/yarn/api/records/Resource;)I

Stack Trace:
java.lang.NoSuchMethodError: org.apache.hadoop.yarn.api.records.Resource.compareTo(Lorg/apache/hadoop/yarn/api/records/Resource;)I
	at org.apache.hadoop.yarn.server.resourcemanager.reservation.AbstractSchedulerPlanFollower$ReservationAllocationComparator.compare(AbstractSchedulerPlanFollower.java:407)
	at org.apache.hadoop.yarn.server.resourcemanager.reservation.AbstractSchedulerPlanFollower$ReservationAllocationComparator.compare(AbstractSchedulerPlanFollower.java:371)
	at java.util.TimSort.countRunAndMakeAscending(TimSort.java:324)
	at java.util.TimSort.sort(TimSort.java:189)
	at java.util.TimSort.sort(TimSort.java:173)
	at java.util.Arrays.sort(Arrays.java:659)
	at java.util.Collections.sort(Collections.java:217)
	at org.apache.hadoop.yarn.server.resourcemanager.reservation.AbstractSchedulerPlanFollower.sortByDelta(AbstractSchedulerPlanFollower.java:314)
	at org.apache.hadoop.yarn.server.resourcemanager.reservation.AbstractSchedulerPlanFollower.synchronizePlan(AbstractSchedulerPlanFollower.java:152)
	at org.apache.hadoop.yarn.server.resourcemanager.reservation.AbstractSchedulerPlanFollower.run(AbstractSchedulerPlanFollower.java:62)
	at org.apache.hadoop.yarn.server.resourcemanager.reservation.TestSchedulerPlanFollowerBase.testPlanFollower(TestSchedulerPlanFollowerBase.java:117)
	at org.apache.hadoop.yarn.server.resourcemanager.reservation.TestFairSchedulerPlanFollower.testWithKillOnExpiry(TestFairSchedulerPlanFollower.java:133)


FAILED:  org.apache.hadoop.yarn.server.resourcemanager.reservation.TestFairSchedulerPlanFollower.testWithMoveOnExpiry

Error Message:
org.apache.hadoop.yarn.api.records.Resource.compareTo(Lorg/apache/hadoop/yarn/api/records/Resource;)I

Stack Trace:
java.lang.NoSuchMethodError: org.apache.hadoop.yarn.api.records.Resource.compareTo(Lorg/apache/hadoop/yarn/api/records/Resource;)I
	at org.apache.hadoop.yarn.server.resourcemanager.reservation.AbstractSchedulerPlanFollower$ReservationAllocationComparator.compare(AbstractSchedulerPlanFollower.java:407)
	at org.apache.hadoop.yarn.server.resourcemanager.reservation.AbstractSchedulerPlanFollower$ReservationAllocationComparator.compare(AbstractSchedulerPlanFollower.java:371)
	at java.util.TimSort.countRunAndMakeAscending(TimSort.java:324)
	at java.util.TimSort.sort(TimSort.java:189)
	at java.util.TimSort.sort(TimSort.java:173)
	at java.util.Arrays.sort(Arrays.java:659)
	at java.util.Collections.sort(Collections.java:217)
	at org.apache.hadoop.yarn.server.resourcemanager.reservation.AbstractSchedulerPlanFollower.sortByDelta(AbstractSchedulerPlanFollower.java:314)
	at org.apache.hadoop.yarn.server.resourcemanager.reservation.AbstractSchedulerPlanFollower.synchronizePlan(AbstractSchedulerPlanFollower.java:152)
	at org.apache.hadoop.yarn.server.resourcemanager.reservation.AbstractSchedulerPlanFollower.run(AbstractSchedulerPlanFollower.java:62)
	at org.apache.hadoop.yarn.server.resourcemanager.reservation.TestSchedulerPlanFollowerBase.testPlanFollower(TestSchedulerPlanFollowerBase.java:117)
	at org.apache.hadoop.yarn.server.resourcemanager.reservation.TestFairSchedulerPlanFollower.testWithMoveOnExpiry(TestFairSchedulerPlanFollower.java:126)


FAILED:  org.apache.hadoop.yarn.server.resourcemanager.rmapp.TestRMAppTransitions.testGetAppReport[0]

Error Message:
org.apache.hadoop.yarn.server.utils.BuilderUtils.newApplicationReport(Lorg/apache/hadoop/yarn/api/records/ApplicationId;Lorg/apache/hadoop/yarn/api/records/ApplicationAttemptId;Ljava/lang/String;Ljava/lang/String;Ljava/lang/String;Ljava/lang/String;ILorg/apache/hadoop/yarn/api/records/Token;Lorg/apache/hadoop/yarn/api/records/YarnApplicationState;Ljava/lang/String;Ljava/lang/String;JJLorg/apache/hadoop/yarn/api/records/FinalApplicationStatus;Lorg/apache/hadoop/yarn/api/records/ApplicationResourceUsageReport;Ljava/lang/String;FLjava/lang/String;Lorg/apache/hadoop/yarn/api/records/Token;Ljava/util/Set;)Lorg/apache/hadoop/yarn/api/records/ApplicationReport;

Stack Trace:
java.lang.NoSuchMethodError: org.apache.hadoop.yarn.server.utils.BuilderUtils.newApplicationReport(Lorg/apache/hadoop/yarn/api/records/ApplicationId;Lorg/apache/hadoop/yarn/api/records/ApplicationAttemptId;Ljava/lang/String;Ljava/lang/String;Ljava/lang/String;Ljava/lang/String;ILorg/apache/hadoop/yarn/api/records/Token;Lorg/apache/hadoop/yarn/api/records/YarnApplicationState;Ljava/lang/String;Ljava/lang/String;JJLorg/apache/hadoop/yarn/api/records/FinalApplicationStatus;Lorg/apache/hadoop/yarn/api/records/ApplicationResourceUsageReport;Ljava/lang/String;FLjava/lang/String;Lorg/apache/hadoop/yarn/api/records/Token;Ljava/util/Set;)Lorg/apache/hadoop/yarn/api/records/ApplicationReport;
	at org.apache.hadoop.yarn.server.resourcemanager.rmapp.RMAppImpl.createAndGetApplicationReport(RMAppImpl.java:660)
	at org.apache.hadoop.yarn.server.resourcemanager.rmapp.TestRMAppTransitions.testGetAppReport(TestRMAppTransitions.java:1010)


FAILED:  org.apache.hadoop.yarn.server.resourcemanager.rmapp.TestRMAppTransitions.testGetAppReport[1]

Error Message:
org.apache.hadoop.yarn.server.utils.BuilderUtils.newApplicationReport(Lorg/apache/hadoop/yarn/api/records/ApplicationId;Lorg/apache/hadoop/yarn/api/records/ApplicationAttemptId;Ljava/lang/String;Ljava/lang/String;Ljava/lang/String;Ljava/lang/String;ILorg/apache/hadoop/yarn/api/records/Token;Lorg/apache/hadoop/yarn/api/records/YarnApplicationState;Ljava/lang/String;Ljava/lang/String;JJLorg/apache/hadoop/yarn/api/records/FinalApplicationStatus;Lorg/apache/hadoop/yarn/api/records/ApplicationResourceUsageReport;Ljava/lang/String;FLjava/lang/String;Lorg/apache/hadoop/yarn/api/records/Token;Ljava/util/Set;)Lorg/apache/hadoop/yarn/api/records/ApplicationReport;

Stack Trace:
java.lang.NoSuchMethodError: org.apache.hadoop.yarn.server.utils.BuilderUtils.newApplicationReport(Lorg/apache/hadoop/yarn/api/records/ApplicationId;Lorg/apache/hadoop/yarn/api/records/ApplicationAttemptId;Ljava/lang/String;Ljava/lang/String;Ljava/lang/String;Ljava/lang/String;ILorg/apache/hadoop/yarn/api/records/Token;Lorg/apache/hadoop/yarn/api/records/YarnApplicationState;Ljava/lang/String;Ljava/lang/String;JJLorg/apache/hadoop/yarn/api/records/FinalApplicationStatus;Lorg/apache/hadoop/yarn/api/records/ApplicationResourceUsageReport;Ljava/lang/String;FLjava/lang/String;Lorg/apache/hadoop/yarn/api/records/Token;Ljava/util/Set;)Lorg/apache/hadoop/yarn/api/records/ApplicationReport;
	at org.apache.hadoop.yarn.server.resourcemanager.rmapp.RMAppImpl.createAndGetApplicationReport(RMAppImpl.java:660)
	at org.apache.hadoop.yarn.server.resourcemanager.rmapp.TestRMAppTransitions.testGetAppReport(TestRMAppTransitions.java:1010)


FAILED:  org.apache.hadoop.yarn.server.resourcemanager.scheduler.capacity.TestCapacityScheduler.testMoveAllApps

Error Message:
org.apache.hadoop.yarn.server.utils.BuilderUtils.newApplicationReport(Lorg/apache/hadoop/yarn/api/records/ApplicationId;Lorg/apache/hadoop/yarn/api/records/ApplicationAttemptId;Ljava/lang/String;Ljava/lang/String;Ljava/lang/String;Ljava/lang/String;ILorg/apache/hadoop/yarn/api/records/Token;Lorg/apache/hadoop/yarn/api/records/YarnApplicationState;Ljava/lang/String;Ljava/lang/String;JJLorg/apache/hadoop/yarn/api/records/FinalApplicationStatus;Lorg/apache/hadoop/yarn/api/records/ApplicationResourceUsageReport;Ljava/lang/String;FLjava/lang/String;Lorg/apache/hadoop/yarn/api/records/Token;Ljava/util/Set;)Lorg/apache/hadoop/yarn/api/records/ApplicationReport;

Stack Trace:
java.lang.NoSuchMethodError: org.apache.hadoop.yarn.server.utils.BuilderUtils.newApplicationReport(Lorg/apache/hadoop/yarn/api/records/ApplicationId;Lorg/apache/hadoop/yarn/api/records/ApplicationAttemptId;Ljava/lang/String;Ljava/lang/String;Ljava/lang/String;Ljava/lang/String;ILorg/apache/hadoop/yarn/api/records/Token;Lorg/apache/hadoop/yarn/api/records/YarnApplicationState;Ljava/lang/String;Ljava/lang/String;JJLorg/apache/hadoop/yarn/api/records/FinalApplicationStatus;Lorg/apache/hadoop/yarn/api/records/ApplicationResourceUsageReport;Ljava/lang/String;FLjava/lang/String;Lorg/apache/hadoop/yarn/api/records/Token;Ljava/util/Set;)Lorg/apache/hadoop/yarn/api/records/ApplicationReport;
	at org.apache.hadoop.yarn.server.resourcemanager.rmapp.RMAppImpl.createAndGetApplicationReport(RMAppImpl.java:660)
	at org.apache.hadoop.yarn.server.resourcemanager.ClientRMService.getApplicationReport(ClientRMService.java:334)
	at org.apache.hadoop.yarn.server.resourcemanager.MockRM.getApplicationReport(MockRM.java:775)
	at org.apache.hadoop.yarn.server.resourcemanager.scheduler.capacity.TestCapacityScheduler.testMoveAllApps(TestCapacityScheduler.java:1907)


FAILED:  org.apache.hadoop.yarn.server.resourcemanager.scheduler.capacity.TestCapacityScheduler.testMoveAllAppsInvalidSource

Error Message:
org.apache.hadoop.yarn.server.utils.BuilderUtils.newApplicationReport(Lorg/apache/hadoop/yarn/api/records/ApplicationId;Lorg/apache/hadoop/yarn/api/records/ApplicationAttemptId;Ljava/lang/String;Ljava/lang/String;Ljava/lang/String;Ljava/lang/String;ILorg/apache/hadoop/yarn/api/records/Token;Lorg/apache/hadoop/yarn/api/records/YarnApplicationState;Ljava/lang/String;Ljava/lang/String;JJLorg/apache/hadoop/yarn/api/records/FinalApplicationStatus;Lorg/apache/hadoop/yarn/api/records/ApplicationResourceUsageReport;Ljava/lang/String;FLjava/lang/String;Lorg/apache/hadoop/yarn/api/records/Token;Ljava/util/Set;)Lorg/apache/hadoop/yarn/api/records/ApplicationReport;

Stack Trace:
java.lang.NoSuchMethodError: org.apache.hadoop.yarn.server.utils.BuilderUtils.newApplicationReport(Lorg/apache/hadoop/yarn/api/records/ApplicationId;Lorg/apache/hadoop/yarn/api/records/ApplicationAttemptId;Ljava/lang/String;Ljava/lang/String;Ljava/lang/String;Ljava/lang/String;ILorg/apache/hadoop/yarn/api/records/Token;Lorg/apache/hadoop/yarn/api/records/YarnApplicationState;Ljava/lang/String;Ljava/lang/String;JJLorg/apache/hadoop/yarn/api/records/FinalApplicationStatus;Lorg/apache/hadoop/yarn/api/records/ApplicationResourceUsageReport;Ljava/lang/String;FLjava/lang/String;Lorg/apache/hadoop/yarn/api/records/Token;Ljava/util/Set;)Lorg/apache/hadoop/yarn/api/records/ApplicationReport;
	at org.apache.hadoop.yarn.server.resourcemanager.rmapp.RMAppImpl.createAndGetApplicationReport(RMAppImpl.java:660)
	at org.apache.hadoop.yarn.server.resourcemanager.ClientRMService.getApplicationReport(ClientRMService.java:334)
	at org.apache.hadoop.yarn.server.resourcemanager.MockRM.getApplicationReport(MockRM.java:775)
	at org.apache.hadoop.yarn.server.resourcemanager.scheduler.capacity.TestCapacityScheduler.testMoveAllAppsInvalidSource(TestCapacityScheduler.java:2029)


FAILED:  org.apache.hadoop.yarn.server.resourcemanager.scheduler.capacity.TestCapacityScheduler.testMoveAllAppsInvalidDestination

Error Message:
org.apache.hadoop.yarn.server.utils.BuilderUtils.newApplicationReport(Lorg/apache/hadoop/yarn/api/records/ApplicationId;Lorg/apache/hadoop/yarn/api/records/ApplicationAttemptId;Ljava/lang/String;Ljava/lang/String;Ljava/lang/String;Ljava/lang/String;ILorg/apache/hadoop/yarn/api/records/Token;Lorg/apache/hadoop/yarn/api/records/YarnApplicationState;Ljava/lang/String;Ljava/lang/String;JJLorg/apache/hadoop/yarn/api/records/FinalApplicationStatus;Lorg/apache/hadoop/yarn/api/records/ApplicationResourceUsageReport;Ljava/lang/String;FLjava/lang/String;Lorg/apache/hadoop/yarn/api/records/Token;Ljava/util/Set;)Lorg/apache/hadoop/yarn/api/records/ApplicationReport;

Stack Trace:
java.lang.NoSuchMethodError: org.apache.hadoop.yarn.server.utils.BuilderUtils.newApplicationReport(Lorg/apache/hadoop/yarn/api/records/ApplicationId;Lorg/apache/hadoop/yarn/api/records/ApplicationAttemptId;Ljava/lang/String;Ljava/lang/String;Ljava/lang/String;Ljava/lang/String;ILorg/apache/hadoop/yarn/api/records/Token;Lorg/apache/hadoop/yarn/api/records/YarnApplicationState;Ljava/lang/String;Ljava/lang/String;JJLorg/apache/hadoop/yarn/api/records/FinalApplicationStatus;Lorg/apache/hadoop/yarn/api/records/ApplicationResourceUsageReport;Ljava/lang/String;FLjava/lang/String;Lorg/apache/hadoop/yarn/api/records/Token;Ljava/util/Set;)Lorg/apache/hadoop/yarn/api/records/ApplicationReport;
	at org.apache.hadoop.yarn.server.resourcemanager.rmapp.RMAppImpl.createAndGetApplicationReport(RMAppImpl.java:660)
	at org.apache.hadoop.yarn.server.resourcemanager.ClientRMService.getApplicationReport(ClientRMService.java:334)
	at org.apache.hadoop.yarn.server.resourcemanager.MockRM.getApplicationReport(MockRM.java:775)
	at org.apache.hadoop.yarn.server.resourcemanager.scheduler.capacity.TestCapacityScheduler.testMoveAllAppsInvalidDestination(TestCapacityScheduler.java:1970)


FAILED:  org.apache.hadoop.yarn.server.resourcemanager.scheduler.capacity.TestCapacityScheduler.testKillAllAppsInvalidSource

Error Message:
org.apache.hadoop.yarn.server.utils.BuilderUtils.newApplicationReport(Lorg/apache/hadoop/yarn/api/records/ApplicationId;Lorg/apache/hadoop/yarn/api/records/ApplicationAttemptId;Ljava/lang/String;Ljava/lang/String;Ljava/lang/String;Ljava/lang/String;ILorg/apache/hadoop/yarn/api/records/Token;Lorg/apache/hadoop/yarn/api/records/YarnApplicationState;Ljava/lang/String;Ljava/lang/String;JJLorg/apache/hadoop/yarn/api/records/FinalApplicationStatus;Lorg/apache/hadoop/yarn/api/records/ApplicationResourceUsageReport;Ljava/lang/String;FLjava/lang/String;Lorg/apache/hadoop/yarn/api/records/Token;Ljava/util/Set;)Lorg/apache/hadoop/yarn/api/records/ApplicationReport;

Stack Trace:
java.lang.NoSuchMethodError: org.apache.hadoop.yarn.server.utils.BuilderUtils.newApplicationReport(Lorg/apache/hadoop/yarn/api/records/ApplicationId;Lorg/apache/hadoop/yarn/api/records/ApplicationAttemptId;Ljava/lang/String;Ljava/lang/String;Ljava/lang/String;Ljava/lang/String;ILorg/apache/hadoop/yarn/api/records/Token;Lorg/apache/hadoop/yarn/api/records/YarnApplicationState;Ljava/lang/String;Ljava/lang/String;JJLorg/apache/hadoop/yarn/api/records/FinalApplicationStatus;Lorg/apache/hadoop/yarn/api/records/ApplicationResourceUsageReport;Ljava/lang/String;FLjava/lang/String;Lorg/apache/hadoop/yarn/api/records/Token;Ljava/util/Set;)Lorg/apache/hadoop/yarn/api/records/ApplicationReport;
	at org.apache.hadoop.yarn.server.resourcemanager.rmapp.RMAppImpl.createAndGetApplicationReport(RMAppImpl.java:660)
	at org.apache.hadoop.yarn.server.resourcemanager.ClientRMService.getApplicationReport(ClientRMService.java:334)
	at org.apache.hadoop.yarn.server.resourcemanager.MockRM.getApplicationReport(MockRM.java:775)
	at org.apache.hadoop.yarn.server.resourcemanager.scheduler.capacity.TestCapacityScheduler.testKillAllAppsInvalidSource(TestCapacityScheduler.java:2133)


FAILED:  org.apache.hadoop.yarn.server.resourcemanager.scheduler.capacity.TestCapacityScheduler.testKillAllAppsInQueue

Error Message:
org.apache.hadoop.yarn.server.utils.BuilderUtils.newApplicationReport(Lorg/apache/hadoop/yarn/api/records/ApplicationId;Lorg/apache/hadoop/yarn/api/records/ApplicationAttemptId;Ljava/lang/String;Ljava/lang/String;Ljava/lang/String;Ljava/lang/String;ILorg/apache/hadoop/yarn/api/records/Token;Lorg/apache/hadoop/yarn/api/records/YarnApplicationState;Ljava/lang/String;Ljava/lang/String;JJLorg/apache/hadoop/yarn/api/records/FinalApplicationStatus;Lorg/apache/hadoop/yarn/api/records/ApplicationResourceUsageReport;Ljava/lang/String;FLjava/lang/String;Lorg/apache/hadoop/yarn/api/records/Token;Ljava/util/Set;)Lorg/apache/hadoop/yarn/api/records/ApplicationReport;

Stack Trace:
java.lang.NoSuchMethodError: org.apache.hadoop.yarn.server.utils.BuilderUtils.newApplicationReport(Lorg/apache/hadoop/yarn/api/records/ApplicationId;Lorg/apache/hadoop/yarn/api/records/ApplicationAttemptId;Ljava/lang/String;Ljava/lang/String;Ljava/lang/String;Ljava/lang/String;ILorg/apache/hadoop/yarn/api/records/Token;Lorg/apache/hadoop/yarn/api/records/YarnApplicationState;Ljava/lang/String;Ljava/lang/String;JJLorg/apache/hadoop/yarn/api/records/FinalApplicationStatus;Lorg/apache/hadoop/yarn/api/records/ApplicationResourceUsageReport;Ljava/lang/String;FLjava/lang/String;Lorg/apache/hadoop/yarn/api/records/Token;Ljava/util/Set;)Lorg/apache/hadoop/yarn/api/records/ApplicationReport;
	at org.apache.hadoop.yarn.server.resourcemanager.rmapp.RMAppImpl.createAndGetApplicationReport(RMAppImpl.java:660)
	at org.apache.hadoop.yarn.server.resourcemanager.ClientRMService.getApplicationReport(ClientRMService.java:334)
	at org.apache.hadoop.yarn.server.resourcemanager.MockRM.getApplicationReport(MockRM.java:775)
	at org.apache.hadoop.yarn.server.resourcemanager.scheduler.capacity.TestCapacityScheduler.testKillAllAppsInQueue(TestCapacityScheduler.java:2088)


FAILED:  org.apache.hadoop.yarn.server.resourcemanager.scheduler.capacity.TestCapacityScheduler.testMoveAppQueueMetricsCheck

Error Message:
org.apache.hadoop.yarn.api.records.Resource.getResources()Ljava/util/Map;

Stack Trace:
java.lang.NoSuchMethodError: org.apache.hadoop.yarn.api.records.Resource.getResources()Ljava/util/Map;
	at org.apache.hadoop.yarn.server.resourcemanager.webapp.dao.ResourceInfo.<init>(ResourceInfo.java:47)
	at org.apache.hadoop.yarn.server.resourcemanager.webapp.dao.CapacitySchedulerQueueInfo.<init>(CapacitySchedulerQueueInfo.java:86)
	at org.apache.hadoop.yarn.server.resourcemanager.webapp.dao.CapacitySchedulerInfo.getQueues(CapacitySchedulerInfo.java:107)
	at org.apache.hadoop.yarn.server.resourcemanager.webapp.dao.CapacitySchedulerInfo.<init>(CapacitySchedulerInfo.java:64)
	at org.apache.hadoop.yarn.server.resourcemanager.scheduler.capacity.TestCapacityScheduler.testMoveAppQueueMetricsCheck(TestCapacityScheduler.java:1790)


FAILED:  org.apache.hadoop.yarn.server.resourcemanager.scheduler.capacity.TestCapacityScheduler.testMoveAppSameParent

Error Message:
org.apache.hadoop.yarn.server.utils.BuilderUtils.newApplicationReport(Lorg/apache/hadoop/yarn/api/records/ApplicationId;Lorg/apache/hadoop/yarn/api/records/ApplicationAttemptId;Ljava/lang/String;Ljava/lang/String;Ljava/lang/String;Ljava/lang/String;ILorg/apache/hadoop/yarn/api/records/Token;Lorg/apache/hadoop/yarn/api/records/YarnApplicationState;Ljava/lang/String;Ljava/lang/String;JJLorg/apache/hadoop/yarn/api/records/FinalApplicationStatus;Lorg/apache/hadoop/yarn/api/records/ApplicationResourceUsageReport;Ljava/lang/String;FLjava/lang/String;Lorg/apache/hadoop/yarn/api/records/Token;Ljava/util/Set;)Lorg/apache/hadoop/yarn/api/records/ApplicationReport;

Stack Trace:
java.lang.NoSuchMethodError: org.apache.hadoop.yarn.server.utils.BuilderUtils.newApplicationReport(Lorg/apache/hadoop/yarn/api/records/ApplicationId;Lorg/apache/hadoop/yarn/api/records/ApplicationAttemptId;Ljava/lang/String;Ljava/lang/String;Ljava/lang/String;Ljava/lang/String;ILorg/apache/hadoop/yarn/api/records/Token;Lorg/apache/hadoop/yarn/api/records/YarnApplicationState;Ljava/lang/String;Ljava/lang/String;JJLorg/apache/hadoop/yarn/api/records/FinalApplicationStatus;Lorg/apache/hadoop/yarn/api/records/ApplicationResourceUsageReport;Ljava/lang/String;FLjava/lang/String;Lorg/apache/hadoop/yarn/api/records/Token;Ljava/util/Set;)Lorg/apache/hadoop/yarn/api/records/ApplicationReport;
	at org.apache.hadoop.yarn.server.resourcemanager.rmapp.RMAppImpl.createAndGetApplicationReport(RMAppImpl.java:660)
	at org.apache.hadoop.yarn.server.resourcemanager.ClientRMService.getApplicationReport(ClientRMService.java:334)
	at org.apache.hadoop.yarn.server.resourcemanager.MockRM.getApplicationReport(MockRM.java:775)
	at org.apache.hadoop.yarn.server.resourcemanager.scheduler.capacity.TestCapacityScheduler.testMoveAppSameParent(TestCapacityScheduler.java:1373)


FAILED:  org.apache.hadoop.yarn.server.resourcemanager.scheduler.capacity.TestCapacityScheduler.testMoveAppBasic

Error Message:
org.apache.hadoop.yarn.server.utils.BuilderUtils.newApplicationReport(Lorg/apache/hadoop/yarn/api/records/ApplicationId;Lorg/apache/hadoop/yarn/api/records/ApplicationAttemptId;Ljava/lang/String;Ljava/lang/String;Ljava/lang/String;Ljava/lang/String;ILorg/apache/hadoop/yarn/api/records/Token;Lorg/apache/hadoop/yarn/api/records/YarnApplicationState;Ljava/lang/String;Ljava/lang/String;JJLorg/apache/hadoop/yarn/api/records/FinalApplicationStatus;Lorg/apache/hadoop/yarn/api/records/ApplicationResourceUsageReport;Ljava/lang/String;FLjava/lang/String;Lorg/apache/hadoop/yarn/api/records/Token;Ljava/util/Set;)Lorg/apache/hadoop/yarn/api/records/ApplicationReport;

Stack Trace:
java.lang.NoSuchMethodError: org.apache.hadoop.yarn.server.utils.BuilderUtils.newApplicationReport(Lorg/apache/hadoop/yarn/api/records/ApplicationId;Lorg/apache/hadoop/yarn/api/records/ApplicationAttemptId;Ljava/lang/String;Ljava/lang/String;Ljava/lang/String;Ljava/lang/String;ILorg/apache/hadoop/yarn/api/records/Token;Lorg/apache/hadoop/yarn/api/records/YarnApplicationState;Ljava/lang/String;Ljava/lang/String;JJLorg/apache/hadoop/yarn/api/records/FinalApplicationStatus;Lorg/apache/hadoop/yarn/api/records/ApplicationResourceUsageReport;Ljava/lang/String;FLjava/lang/String;Lorg/apache/hadoop/yarn/api/records/Token;Ljava/util/Set;)Lorg/apache/hadoop/yarn/api/records/ApplicationReport;
	at org.apache.hadoop.yarn.server.resourcemanager.rmapp.RMAppImpl.createAndGetApplicationReport(RMAppImpl.java:660)
	at org.apache.hadoop.yarn.server.resourcemanager.ClientRMService.getApplicationReport(ClientRMService.java:334)
	at org.apache.hadoop.yarn.server.resourcemanager.MockRM.getApplicationReport(MockRM.java:775)
	at org.apache.hadoop.yarn.server.resourcemanager.scheduler.capacity.TestCapacityScheduler.testMoveAppBasic(TestCapacityScheduler.java:1311)


FAILED:  org.apache.hadoop.yarn.server.resourcemanager.scheduler.capacity.TestCapacitySchedulerDynamicBehavior.testMoveAppToPlanQueue

Error Message:
org.apache.hadoop.yarn.server.utils.BuilderUtils.newApplicationReport(Lorg/apache/hadoop/yarn/api/records/ApplicationId;Lorg/apache/hadoop/yarn/api/records/ApplicationAttemptId;Ljava/lang/String;Ljava/lang/String;Ljava/lang/String;Ljava/lang/String;ILorg/apache/hadoop/yarn/api/records/Token;Lorg/apache/hadoop/yarn/api/records/YarnApplicationState;Ljava/lang/String;Ljava/lang/String;JJLorg/apache/hadoop/yarn/api/records/FinalApplicationStatus;Lorg/apache/hadoop/yarn/api/records/ApplicationResourceUsageReport;Ljava/lang/String;FLjava/lang/String;Lorg/apache/hadoop/yarn/api/records/Token;Ljava/util/Set;)Lorg/apache/hadoop/yarn/api/records/ApplicationReport;

Stack Trace:
java.lang.NoSuchMethodError: org.apache.hadoop.yarn.server.utils.BuilderUtils.newApplicationReport(Lorg/apache/hadoop/yarn/api/records/ApplicationId;Lorg/apache/hadoop/yarn/api/records/ApplicationAttemptId;Ljava/lang/String;Ljava/lang/String;Ljava/lang/String;Ljava/lang/String;ILorg/apache/hadoop/yarn/api/records/Token;Lorg/apache/hadoop/yarn/api/records/YarnApplicationState;Ljava/lang/String;Ljava/lang/String;JJLorg/apache/hadoop/yarn/api/records/FinalApplicationStatus;Lorg/apache/hadoop/yarn/api/records/ApplicationResourceUsageReport;Ljava/lang/String;FLjava/lang/String;Lorg/apache/hadoop/yarn/api/records/Token;Ljava/util/Set;)Lorg/apache/hadoop/yarn/api/records/ApplicationReport;
	at org.apache.hadoop.yarn.server.resourcemanager.rmapp.RMAppImpl.createAndGetApplicationReport(RMAppImpl.java:660)
	at org.apache.hadoop.yarn.server.resourcemanager.ClientRMService.getApplicationReport(ClientRMService.java:334)
	at org.apache.hadoop.yarn.server.resourcemanager.MockRM.getApplicationReport(MockRM.java:775)
	at org.apache.hadoop.yarn.server.resourcemanager.scheduler.capacity.TestCapacitySchedulerDynamicBehavior.testMoveAppToPlanQueue(TestCapacitySchedulerDynamicBehavior.java:196)


FAILED:  org.apache.hadoop.yarn.server.resourcemanager.scheduler.capacity.TestCapacitySchedulerNodeLabelUpdate.testResourceUsage

Error Message:
org.apache.hadoop.yarn.api.records.Resource.getResources()Ljava/util/Map;

Stack Trace:
java.lang.NoSuchMethodError: org.apache.hadoop.yarn.api.records.Resource.getResources()Ljava/util/Map;
	at org.apache.hadoop.yarn.server.resourcemanager.webapp.dao.ResourceInfo.<init>(ResourceInfo.java:47)
	at org.apache.hadoop.yarn.server.resourcemanager.scheduler.capacity.UserInfo.<init>(UserInfo.java:43)
	at org.apache.hadoop.yarn.server.resourcemanager.scheduler.capacity.LeafQueue.getUsers(LeafQueue.java:429)
	at org.apache.hadoop.yarn.server.resourcemanager.scheduler.capacity.TestCapacitySchedulerNodeLabelUpdate.testResourceUsage(TestCapacitySchedulerNodeLabelUpdate.java:151)


FAILED:  org.apache.hadoop.yarn.server.resourcemanager.scheduler.capacity.TestCapacitySchedulerQueueACLs.testApplicationACLs

Error Message:
org.apache.hadoop.yarn.server.utils.BuilderUtils.newApplicationReport(Lorg/apache/hadoop/yarn/api/records/ApplicationId;Lorg/apache/hadoop/yarn/api/records/ApplicationAttemptId;Ljava/lang/String;Ljava/lang/String;Ljava/lang/String;Ljava/lang/String;ILorg/apache/hadoop/yarn/api/records/Token;Lorg/apache/hadoop/yarn/api/records/YarnApplicationState;Ljava/lang/String;Ljava/lang/String;JJLorg/apache/hadoop/yarn/api/records/FinalApplicationStatus;Lorg/apache/hadoop/yarn/api/records/ApplicationResourceUsageReport;Ljava/lang/String;FLjava/lang/String;Lorg/apache/hadoop/yarn/api/records/Token;Ljava/util/Set;)Lorg/apache/hadoop/yarn/api/records/ApplicationReport;
 at org.apache.hadoop.yarn.server.resourcemanager.rmapp.RMAppImpl.createAndGetApplicationReport(RMAppImpl.java:660)
 at org.apache.hadoop.yarn.server.resourcemanager.ClientRMService.getApplicationReport(ClientRMService.java:334)
 at org.apache.hadoop.yarn.api.impl.pb.service.ApplicationClientProtocolPBServiceImpl.getApplicationReport(ApplicationClientProtocolPBServiceImpl.java:180)
 at org.apache.hadoop.yarn.proto.ApplicationClientProtocol$ApplicationClientProtocolService$2.callBlockingMethod(ApplicationClientProtocol.java:433)
 at org.apache.hadoop.ipc.ProtobufRpcEngine$Server$ProtoBufRpcInvoker.call(ProtobufRpcEngine.java:636)
 at org.apache.hadoop.ipc.RPC$Server.call(RPC.java:976)
 at org.apache.hadoop.ipc.Server$Handler$1.run(Server.java:2230)
 at org.apache.hadoop.ipc.Server$Handler$1.run(Server.java:2226)
 at java.security.AccessController.doPrivileged(Native Method)
 at javax.security.auth.Subject.doAs(Subject.java:415)
 at org.apache.hadoop.security.UserGroupInformation.doAs(UserGroupInformation.java:1667)
 at org.apache.hadoop.ipc.Server$Handler.run(Server.java:2224)


Stack Trace:
org.apache.hadoop.ipc.RemoteException: org.apache.hadoop.yarn.server.utils.BuilderUtils.newApplicationReport(Lorg/apache/hadoop/yarn/api/records/ApplicationId;Lorg/apache/hadoop/yarn/api/records/ApplicationAttemptId;Ljava/lang/String;Ljava/lang/String;Ljava/lang/String;Ljava/lang/String;ILorg/apache/hadoop/yarn/api/records/Token;Lorg/apache/hadoop/yarn/api/records/YarnApplicationState;Ljava/lang/String;Ljava/lang/String;JJLorg/apache/hadoop/yarn/api/records/FinalApplicationStatus;Lorg/apache/hadoop/yarn/api/records/ApplicationResourceUsageReport;Ljava/lang/String;FLjava/lang/String;Lorg/apache/hadoop/yarn/api/records/Token;Ljava/util/Set;)Lorg/apache/hadoop/yarn/api/records/ApplicationReport;
	at org.apache.hadoop.yarn.server.resourcemanager.rmapp.RMAppImpl.createAndGetApplicationReport(RMAppImpl.java:660)
	at org.apache.hadoop.yarn.server.resourcemanager.ClientRMService.getApplicationReport(ClientRMService.java:334)
	at org.apache.hadoop.yarn.api.impl.pb.service.ApplicationClientProtocolPBServiceImpl.getApplicationReport(ApplicationClientProtocolPBServiceImpl.java:180)
	at org.apache.hadoop.yarn.proto.ApplicationClientProtocol$ApplicationClientProtocolService$2.callBlockingMethod(ApplicationClientProtocol.java:433)
	at org.apache.hadoop.ipc.ProtobufRpcEngine$Server$ProtoBufRpcInvoker.call(ProtobufRpcEngine.java:636)
	at org.apache.hadoop.ipc.RPC$Server.call(RPC.java:976)
	at org.apache.hadoop.ipc.Server$Handler$1.run(Server.java:2230)
	at org.apache.hadoop.ipc.Server$Handler$1.run(Server.java:2226)
	at java.security.AccessController.doPrivileged(Native Method)
	at javax.security.auth.Subject.doAs(Subject.java:415)
	at org.apache.hadoop.security.UserGroupInformation.doAs(UserGroupInformation.java:1667)
	at org.apache.hadoop.ipc.Server$Handler.run(Server.java:2224)

	at org.apache.hadoop.ipc.Client.call(Client.java:1445)
	at org.apache.hadoop.ipc.Client.call(Client.java:1376)
	at org.apache.hadoop.ipc.ProtobufRpcEngine$Invoker.invoke(ProtobufRpcEngine.java:229)
	at com.sun.proxy.$Proxy14.getApplicationReport(Unknown Source)
	at org.apache.hadoop.yarn.api.impl.pb.client.ApplicationClientProtocolPBClientImpl.getApplicationReport(ApplicationClientProtocolPBClientImpl.java:197)
	at org.apache.hadoop.yarn.server.resourcemanager.QueueACLsTestBase.verifyGetClientAMToken(QueueACLsTestBase.java:156)
	at org.apache.hadoop.yarn.server.resourcemanager.QueueACLsTestBase.testApplicationACLs(QueueACLsTestBase.java:142)
	at sun.reflect.NativeMethodAccessorImpl.invoke0(Native Method)
	at sun.reflect.NativeMethodAccessorImpl.invoke(NativeMethodAccessorImpl.java:57)
	at sun.reflect.DelegatingMethodAccessorImpl.invoke(DelegatingMethodAccessorImpl.java:43)
	at java.lang.reflect.Method.invoke(Method.java:606)
	at org.junit.runners.model.FrameworkMethod$1.runReflectiveCall(FrameworkMethod.java:47)
	at org.junit.internal.runners.model.ReflectiveCallable.run(ReflectiveCallable.java:12)
	at org.junit.runners.model.FrameworkMethod.invokeExplosively(FrameworkMethod.java:44)
	at org.junit.internal.runners.statements.InvokeMethod.evaluate(InvokeMethod.java:17)
	at org.junit.internal.runners.statements.RunBefores.evaluate(RunBefores.java:26)
	at org.junit.internal.runners.statements.RunAfters.evaluate(RunAfters.java:27)
	at org.junit.runners.ParentRunner.runLeaf(ParentRunner.java:271)
	at org.junit.runners.BlockJUnit4ClassRunner.runChild(BlockJUnit4ClassRunner.java:70)
	at org.junit.runners.BlockJUnit4ClassRunner.runChild(BlockJUnit4ClassRunner.java:50)
	at org.junit.runners.ParentRunner$3.run(ParentRunner.java:238)
	at org.junit.runners.ParentRunner$1.schedule(ParentRunner.java:63)
	at org.junit.runners.ParentRunner.runChildren(ParentRunner.java:236)
	at org.junit.runners.ParentRunner.access$000(ParentRunner.java:53)
	at org.junit.runners.ParentRunner$2.evaluate(ParentRunner.java:229)
	at org.junit.runners.ParentRunner.run(ParentRunner.java:309)
	at org.apache.maven.surefire.junit4.JUnit4Provider.execute(JUnit4Provider.java:264)
	at org.apache.maven.surefire.junit4.JUnit4Provider.executeTestSet(JUnit4Provider.java:153)
	at org.apache.maven.surefire.junit4.JUnit4Provider.invoke(JUnit4Provider.java:124)
	at org.apache.maven.surefire.booter.ForkedBooter.invokeProviderInSameClassLoader(ForkedBooter.java:200)
	at org.apache.maven.surefire.booter.ForkedBooter.runSuitesInProcess(ForkedBooter.java:153)
	at org.apache.maven.surefire.booter.ForkedBooter.main(ForkedBooter.java:103)


FAILED:  org.apache.hadoop.yarn.server.resourcemanager.scheduler.fair.TestFairSchedulerQueueACLs.testApplicationACLs

Error Message:
org.apache.hadoop.yarn.server.utils.BuilderUtils.newApplicationReport(Lorg/apache/hadoop/yarn/api/records/ApplicationId;Lorg/apache/hadoop/yarn/api/records/ApplicationAttemptId;Ljava/lang/String;Ljava/lang/String;Ljava/lang/String;Ljava/lang/String;ILorg/apache/hadoop/yarn/api/records/Token;Lorg/apache/hadoop/yarn/api/records/YarnApplicationState;Ljava/lang/String;Ljava/lang/String;JJLorg/apache/hadoop/yarn/api/records/FinalApplicationStatus;Lorg/apache/hadoop/yarn/api/records/ApplicationResourceUsageReport;Ljava/lang/String;FLjava/lang/String;Lorg/apache/hadoop/yarn/api/records/Token;Ljava/util/Set;)Lorg/apache/hadoop/yarn/api/records/ApplicationReport;
 at org.apache.hadoop.yarn.server.resourcemanager.rmapp.RMAppImpl.createAndGetApplicationReport(RMAppImpl.java:660)
 at org.apache.hadoop.yarn.server.resourcemanager.ClientRMService.getApplicationReport(ClientRMService.java:334)
 at org.apache.hadoop.yarn.api.impl.pb.service.ApplicationClientProtocolPBServiceImpl.getApplicationReport(ApplicationClientProtocolPBServiceImpl.java:180)
 at org.apache.hadoop.yarn.proto.ApplicationClientProtocol$ApplicationClientProtocolService$2.callBlockingMethod(ApplicationClientProtocol.java:433)
 at org.apache.hadoop.ipc.ProtobufRpcEngine$Server$ProtoBufRpcInvoker.call(ProtobufRpcEngine.java:636)
 at org.apache.hadoop.ipc.RPC$Server.call(RPC.java:976)
 at org.apache.hadoop.ipc.Server$Handler$1.run(Server.java:2230)
 at org.apache.hadoop.ipc.Server$Handler$1.run(Server.java:2226)
 at java.security.AccessController.doPrivileged(Native Method)
 at javax.security.auth.Subject.doAs(Subject.java:415)
 at org.apache.hadoop.security.UserGroupInformation.doAs(UserGroupInformation.java:1667)
 at org.apache.hadoop.ipc.Server$Handler.run(Server.java:2224)


Stack Trace:
org.apache.hadoop.ipc.RemoteException: org.apache.hadoop.yarn.server.utils.BuilderUtils.newApplicationReport(Lorg/apache/hadoop/yarn/api/records/ApplicationId;Lorg/apache/hadoop/yarn/api/records/ApplicationAttemptId;Ljava/lang/String;Ljava/lang/String;Ljava/lang/String;Ljava/lang/String;ILorg/apache/hadoop/yarn/api/records/Token;Lorg/apache/hadoop/yarn/api/records/YarnApplicationState;Ljava/lang/String;Ljava/lang/String;JJLorg/apache/hadoop/yarn/api/records/FinalApplicationStatus;Lorg/apache/hadoop/yarn/api/records/ApplicationResourceUsageReport;Ljava/lang/String;FLjava/lang/String;Lorg/apache/hadoop/yarn/api/records/Token;Ljava/util/Set;)Lorg/apache/hadoop/yarn/api/records/ApplicationReport;
	at org.apache.hadoop.yarn.server.resourcemanager.rmapp.RMAppImpl.createAndGetApplicationReport(RMAppImpl.java:660)
	at org.apache.hadoop.yarn.server.resourcemanager.ClientRMService.getApplicationReport(ClientRMService.java:334)
	at org.apache.hadoop.yarn.api.impl.pb.service.ApplicationClientProtocolPBServiceImpl.getApplicationReport(ApplicationClientProtocolPBServiceImpl.java:180)
	at org.apache.hadoop.yarn.proto.ApplicationClientProtocol$ApplicationClientProtocolService$2.callBlockingMethod(ApplicationClientProtocol.java:433)
	at org.apache.hadoop.ipc.ProtobufRpcEngine$Server$ProtoBufRpcInvoker.call(ProtobufRpcEngine.java:636)
	at org.apache.hadoop.ipc.RPC$Server.call(RPC.java:976)
	at org.apache.hadoop.ipc.Server$Handler$1.run(Server.java:2230)
	at org.apache.hadoop.ipc.Server$Handler$1.run(Server.java:2226)
	at java.security.AccessController.doPrivileged(Native Method)
	at javax.security.auth.Subject.doAs(Subject.java:415)
	at org.apache.hadoop.security.UserGroupInformation.doAs(UserGroupInformation.java:1667)
	at org.apache.hadoop.ipc.Server$Handler.run(Server.java:2224)

	at org.apache.hadoop.ipc.Client.call(Client.java:1445)
	at org.apache.hadoop.ipc.Client.call(Client.java:1376)
	at org.apache.hadoop.ipc.ProtobufRpcEngine$Invoker.invoke(ProtobufRpcEngine.java:229)
	at com.sun.proxy.$Proxy14.getApplicationReport(Unknown Source)
	at org.apache.hadoop.yarn.api.impl.pb.client.ApplicationClientProtocolPBClientImpl.getApplicationReport(ApplicationClientProtocolPBClientImpl.java:197)
	at org.apache.hadoop.yarn.server.resourcemanager.QueueACLsTestBase.verifyGetClientAMToken(QueueACLsTestBase.java:156)
	at org.apache.hadoop.yarn.server.resourcemanager.QueueACLsTestBase.testApplicationACLs(QueueACLsTestBase.java:142)
	at sun.reflect.NativeMethodAccessorImpl.invoke0(Native Method)
	at sun.reflect.NativeMethodAccessorImpl.invoke(NativeMethodAccessorImpl.java:57)
	at sun.reflect.DelegatingMethodAccessorImpl.invoke(DelegatingMethodAccessorImpl.java:43)
	at java.lang.reflect.Method.invoke(Method.java:606)
	at org.junit.runners.model.FrameworkMethod$1.runReflectiveCall(FrameworkMethod.java:47)
	at org.junit.internal.runners.model.ReflectiveCallable.run(ReflectiveCallable.java:12)
	at org.junit.runners.model.FrameworkMethod.invokeExplosively(FrameworkMethod.java:44)
	at org.junit.internal.runners.statements.InvokeMethod.evaluate(InvokeMethod.java:17)
	at org.junit.internal.runners.statements.RunBefores.evaluate(RunBefores.java:26)
	at org.junit.internal.runners.statements.RunAfters.evaluate(RunAfters.java:27)
	at org.junit.runners.ParentRunner.runLeaf(ParentRunner.java:271)
	at org.junit.runners.BlockJUnit4ClassRunner.runChild(BlockJUnit4ClassRunner.java:70)
	at org.junit.runners.BlockJUnit4ClassRunner.runChild(BlockJUnit4ClassRunner.java:50)
	at org.junit.runners.ParentRunner$3.run(ParentRunner.java:238)
	at org.junit.runners.ParentRunner$1.schedule(ParentRunner.java:63)
	at org.junit.runners.ParentRunner.runChildren(ParentRunner.java:236)
	at org.junit.runners.ParentRunner.access$000(ParentRunner.java:53)
	at org.junit.runners.ParentRunner$2.evaluate(ParentRunner.java:229)
	at org.junit.runners.ParentRunner.run(ParentRunner.java:309)
	at org.apache.maven.surefire.junit4.JUnit4Provider.execute(JUnit4Provider.java:264)
	at org.apache.maven.surefire.junit4.JUnit4Provider.executeTestSet(JUnit4Provider.java:153)
	at org.apache.maven.surefire.junit4.JUnit4Provider.invoke(JUnit4Provider.java:124)
	at org.apache.maven.surefire.booter.ForkedBooter.invokeProviderInSameClassLoader(ForkedBooter.java:200)
	at org.apache.maven.surefire.booter.ForkedBooter.runSuitesInProcess(ForkedBooter.java:153)
	at org.apache.maven.surefire.booter.ForkedBooter.main(ForkedBooter.java:103)


FAILED:  org.apache.hadoop.yarn.server.resourcemanager.security.TestClientToAMTokens.testClientToAMTokens[0]

Error Message:
org.apache.hadoop.yarn.server.utils.BuilderUtils.newApplicationReport(Lorg/apache/hadoop/yarn/api/records/ApplicationId;Lorg/apache/hadoop/yarn/api/records/ApplicationAttemptId;Ljava/lang/String;Ljava/lang/String;Ljava/lang/String;Ljava/lang/String;ILorg/apache/hadoop/yarn/api/records/Token;Lorg/apache/hadoop/yarn/api/records/YarnApplicationState;Ljava/lang/String;Ljava/lang/String;JJLorg/apache/hadoop/yarn/api/records/FinalApplicationStatus;Lorg/apache/hadoop/yarn/api/records/ApplicationResourceUsageReport;Ljava/lang/String;FLjava/lang/String;Lorg/apache/hadoop/yarn/api/records/Token;Ljava/util/Set;)Lorg/apache/hadoop/yarn/api/records/ApplicationReport;

Stack Trace:
java.lang.NoSuchMethodError: org.apache.hadoop.yarn.server.utils.BuilderUtils.newApplicationReport(Lorg/apache/hadoop/yarn/api/records/ApplicationId;Lorg/apache/hadoop/yarn/api/records/ApplicationAttemptId;Ljava/lang/String;Ljava/lang/String;Ljava/lang/String;Ljava/lang/String;ILorg/apache/hadoop/yarn/api/records/Token;Lorg/apache/hadoop/yarn/api/records/YarnApplicationState;Ljava/lang/String;Ljava/lang/String;JJLorg/apache/hadoop/yarn/api/records/FinalApplicationStatus;Lorg/apache/hadoop/yarn/api/records/ApplicationResourceUsageReport;Ljava/lang/String;FLjava/lang/String;Lorg/apache/hadoop/yarn/api/records/Token;Ljava/util/Set;)Lorg/apache/hadoop/yarn/api/records/ApplicationReport;
	at org.apache.hadoop.yarn.server.resourcemanager.rmapp.RMAppImpl.createAndGetApplicationReport(RMAppImpl.java:660)
	at org.apache.hadoop.yarn.server.resourcemanager.ClientRMService.getApplicationReport(ClientRMService.java:334)
	at org.apache.hadoop.yarn.server.resourcemanager.security.TestClientToAMTokens.testClientToAMTokens(TestClientToAMTokens.java:247)


FAILED:  org.apache.hadoop.yarn.server.resourcemanager.security.TestClientToAMTokens.testClientTokenRace[0]

Error Message:
java.net.BindException: Problem binding to [0.0.0.0:8032] java.net.BindException: Address already in use; For more details see:  http://wiki.apache.org/hadoop/BindException

Stack Trace:
org.apache.hadoop.yarn.exceptions.YarnRuntimeException: java.net.BindException: Problem binding to [0.0.0.0:8032] java.net.BindException: Address already in use; For more details see:  http://wiki.apache.org/hadoop/BindException
	at sun.nio.ch.Net.bind0(Native Method)
	at sun.nio.ch.Net.bind(Net.java:444)
	at sun.nio.ch.Net.bind(Net.java:436)
	at sun.nio.ch.ServerSocketChannelImpl.bind(ServerSocketChannelImpl.java:214)
	at sun.nio.ch.ServerSocketAdaptor.bind(ServerSocketAdaptor.java:74)
	at org.apache.hadoop.ipc.Server.bind(Server.java:469)
	at org.apache.hadoop.ipc.Server$Listener.<init>(Server.java:646)
	at org.apache.hadoop.ipc.Server.<init>(Server.java:2396)
	at org.apache.hadoop.ipc.RPC$Server.<init>(RPC.java:945)
	at org.apache.hadoop.ipc.ProtobufRpcEngine$Server.<init>(ProtobufRpcEngine.java:534)
	at org.apache.hadoop.ipc.ProtobufRpcEngine.getServer(ProtobufRpcEngine.java:509)
	at org.apache.hadoop.ipc.RPC$Builder.build(RPC.java:787)
	at org.apache.hadoop.yarn.factories.impl.pb.RpcServerFactoryPBImpl.createServer(RpcServerFactoryPBImpl.java:169)
	at org.apache.hadoop.yarn.factories.impl.pb.RpcServerFactoryPBImpl.getServer(RpcServerFactoryPBImpl.java:132)
	at org.apache.hadoop.yarn.ipc.HadoopYarnProtoRPC.getServer(HadoopYarnProtoRPC.java:65)
	at org.apache.hadoop.yarn.ipc.YarnRPC.getServer(YarnRPC.java:54)
	at org.apache.hadoop.yarn.server.resourcemanager.ClientRMService.serviceStart(ClientRMService.java:219)
	at org.apache.hadoop.service.AbstractService.start(AbstractService.java:193)
	at org.apache.hadoop.service.CompositeService.serviceStart(CompositeService.java:120)
	at org.apache.hadoop.yarn.server.resourcemanager.ResourceManager$RMActiveServices.serviceStart(ResourceManager.java:587)
	at org.apache.hadoop.service.AbstractService.start(AbstractService.java:193)
	at org.apache.hadoop.yarn.server.resourcemanager.ResourceManager.startActiveServices(ResourceManager.java:964)
	at org.apache.hadoop.yarn.server.resourcemanager.ResourceManager$1.run(ResourceManager.java:1005)
	at org.apache.hadoop.yarn.server.resourcemanager.ResourceManager$1.run(ResourceManager.java:1001)
	at java.security.AccessController.doPrivileged(Native Method)
	at javax.security.auth.Subject.doAs(Subject.java:415)
	at org.apache.hadoop.security.UserGroupInformation.doAs(UserGroupInformation.java:1667)
	at org.apache.hadoop.yarn.server.resourcemanager.ResourceManager.transitionToActive(ResourceManager.java:1001)
	at org.apache.hadoop.yarn.server.resourcemanager.ResourceManager.serviceStart(ResourceManager.java:1041)
	at org.apache.hadoop.service.AbstractService.start(AbstractService.java:193)
	at org.apache.hadoop.yarn.server.resourcemanager.security.TestClientToAMTokens.testClientTokenRace(TestClientToAMTokens.java:449)


FAILED:  org.apache.hadoop.yarn.server.resourcemanager.security.TestClientToAMTokens.testClientToAMTokens[1]

Error Message:
org.apache.hadoop.yarn.server.resourcemanager.scheduler.capacity.CSQueueMetrics cannot be cast to org.apache.hadoop.yarn.server.resourcemanager.scheduler.fair.FSQueueMetrics

Stack Trace:
java.lang.ClassCastException: org.apache.hadoop.yarn.server.resourcemanager.scheduler.capacity.CSQueueMetrics cannot be cast to org.apache.hadoop.yarn.server.resourcemanager.scheduler.fair.FSQueueMetrics
	at org.apache.hadoop.yarn.server.resourcemanager.scheduler.fair.FSQueueMetrics.forQueue(FSQueueMetrics.java:118)
	at org.apache.hadoop.yarn.server.resourcemanager.scheduler.fair.FairScheduler.initScheduler(FairScheduler.java:1340)
	at org.apache.hadoop.yarn.server.resourcemanager.scheduler.fair.FairScheduler.serviceInit(FairScheduler.java:1393)
	at org.apache.hadoop.service.AbstractService.init(AbstractService.java:163)
	at org.apache.hadoop.service.CompositeService.serviceInit(CompositeService.java:107)
	at org.apache.hadoop.yarn.server.resourcemanager.ResourceManager$RMActiveServices.serviceInit(ResourceManager.java:559)
	at org.apache.hadoop.service.AbstractService.init(AbstractService.java:163)
	at org.apache.hadoop.yarn.server.resourcemanager.ResourceManager.createAndInitActiveServices(ResourceManager.java:954)
	at org.apache.hadoop.yarn.server.resourcemanager.ResourceManager.serviceInit(ResourceManager.java:254)
	at org.apache.hadoop.service.AbstractService.init(AbstractService.java:163)
	at org.apache.hadoop.yarn.server.resourcemanager.MockRM.<init>(MockRM.java:120)
	at org.apache.hadoop.yarn.server.resourcemanager.MockRM.<init>(MockRM.java:113)
	at org.apache.hadoop.yarn.server.resourcemanager.MockRM.<init>(MockRM.java:109)
	at org.apache.hadoop.yarn.server.resourcemanager.MockRMWithCustomAMLauncher.<init>(MockRMWithCustomAMLauncher.java:45)
	at org.apache.hadoop.yarn.server.resourcemanager.security.TestClientToAMTokens$1.<init>(TestClientToAMTokens.java:192)
	at org.apache.hadoop.yarn.server.resourcemanager.security.TestClientToAMTokens.testClientToAMTokens(TestClientToAMTokens.java:192)


FAILED:  org.apache.hadoop.yarn.server.resourcemanager.security.TestClientToAMTokens.testClientTokenRace[1]

Error Message:
org.apache.hadoop.yarn.server.resourcemanager.scheduler.capacity.CSQueueMetrics cannot be cast to org.apache.hadoop.yarn.server.resourcemanager.scheduler.fair.FSQueueMetrics

Stack Trace:
java.lang.ClassCastException: org.apache.hadoop.yarn.server.resourcemanager.scheduler.capacity.CSQueueMetrics cannot be cast to org.apache.hadoop.yarn.server.resourcemanager.scheduler.fair.FSQueueMetrics
	at org.apache.hadoop.yarn.server.resourcemanager.scheduler.fair.FSQueueMetrics.forQueue(FSQueueMetrics.java:118)
	at org.apache.hadoop.yarn.server.resourcemanager.scheduler.fair.FairScheduler.initScheduler(FairScheduler.java:1340)
	at org.apache.hadoop.yarn.server.resourcemanager.scheduler.fair.FairScheduler.serviceInit(FairScheduler.java:1393)
	at org.apache.hadoop.service.AbstractService.init(AbstractService.java:163)
	at org.apache.hadoop.service.CompositeService.serviceInit(CompositeService.java:107)
	at org.apache.hadoop.yarn.server.resourcemanager.ResourceManager$RMActiveServices.serviceInit(ResourceManager.java:559)
	at org.apache.hadoop.service.AbstractService.init(AbstractService.java:163)
	at org.apache.hadoop.yarn.server.resourcemanager.ResourceManager.createAndInitActiveServices(ResourceManager.java:954)
	at org.apache.hadoop.yarn.server.resourcemanager.ResourceManager.serviceInit(ResourceManager.java:254)
	at org.apache.hadoop.service.AbstractService.init(AbstractService.java:163)
	at org.apache.hadoop.yarn.server.resourcemanager.MockRM.<init>(MockRM.java:120)
	at org.apache.hadoop.yarn.server.resourcemanager.MockRM.<init>(MockRM.java:113)
	at org.apache.hadoop.yarn.server.resourcemanager.MockRM.<init>(MockRM.java:109)
	at org.apache.hadoop.yarn.server.resourcemanager.MockRMWithCustomAMLauncher.<init>(MockRMWithCustomAMLauncher.java:45)
	at org.apache.hadoop.yarn.server.resourcemanager.security.TestClientToAMTokens$6.<init>(TestClientToAMTokens.java:433)
	at org.apache.hadoop.yarn.server.resourcemanager.security.TestClientToAMTokens.testClientTokenRace(TestClientToAMTokens.java:433)


FAILED:  org.apache.hadoop.yarn.server.resourcemanager.security.TestDelegationTokenRenewer.testAppRejectionWithCancelledDelegationToken

Error Message:
org/apache/hadoop/yarn/server/applicationhistoryservice/ApplicationHistoryWriter

Stack Trace:
java.lang.NoClassDefFoundError: org/apache/hadoop/yarn/server/applicationhistoryservice/ApplicationHistoryWriter
	at java.net.URLClassLoader$1.run(URLClassLoader.java:366)
	at java.net.URLClassLoader$1.run(URLClassLoader.java:355)
	at java.security.AccessController.doPrivileged(Native Method)
	at java.net.URLClassLoader.findClass(URLClassLoader.java:354)
	at java.lang.ClassLoader.loadClass(ClassLoader.java:425)
	at sun.misc.Launcher$AppClassLoader.loadClass(Launcher.java:308)
	at java.lang.ClassLoader.loadClass(ClassLoader.java:358)
	at java.lang.Class.getDeclaredConstructors0(Native Method)
	at java.lang.Class.privateGetDeclaredConstructors(Class.java:2493)
	at java.lang.Class.getDeclaredConstructors(Class.java:1901)
	at org.mockito.internal.creation.jmock.ClassImposterizer.setConstructorsAccessible(ClassImposterizer.java:58)
	at org.mockito.internal.creation.jmock.ClassImposterizer.imposterise(ClassImposterizer.java:53)
	at org.mockito.internal.util.MockUtil.createMock(MockUtil.java:54)
	at org.mockito.internal.MockitoCore.mock(MockitoCore.java:45)
	at org.mockito.Mockito.mock(Mockito.java:921)
	at org.mockito.Mockito.mock(Mockito.java:816)
	at org.apache.hadoop.yarn.server.resourcemanager.scheduler.capacity.TestUtils.getMockRMContext(TestUtils.java:100)
	at org.apache.hadoop.yarn.server.resourcemanager.security.TestDelegationTokenRenewer.createNewDelegationTokenRenewer(TestDelegationTokenRenewer.java:727)
	at org.apache.hadoop.yarn.server.resourcemanager.security.TestDelegationTokenRenewer.setUp(TestDelegationTokenRenewer.java:204)


FAILED:  org.apache.hadoop.yarn.server.resourcemanager.security.TestDelegationTokenRenewer.testAppRejectionWithCancelledDelegationToken

Error Message:
null

Stack Trace:
java.lang.NullPointerException: null
	at org.apache.hadoop.yarn.server.resourcemanager.security.TestDelegationTokenRenewer.tearDown(TestDelegationTokenRenewer.java:223)


FAILED:  org.apache.hadoop.yarn.server.resourcemanager.security.TestDelegationTokenRenewer.testAppSubmissionWithPreviousToken

Error Message:
org/apache/hadoop/yarn/server/applicationhistoryservice/ApplicationHistoryWriter

Stack Trace:
java.lang.NoClassDefFoundError: org/apache/hadoop/yarn/server/applicationhistoryservice/ApplicationHistoryWriter
	at java.net.URLClassLoader$1.run(URLClassLoader.java:366)
	at java.net.URLClassLoader$1.run(URLClassLoader.java:355)
	at java.security.AccessController.doPrivileged(Native Method)
	at java.net.URLClassLoader.findClass(URLClassLoader.java:354)
	at java.lang.ClassLoader.loadClass(ClassLoader.java:425)
	at sun.misc.Launcher$AppClassLoader.loadClass(Launcher.java:308)
	at java.lang.ClassLoader.loadClass(ClassLoader.java:358)
	at java.lang.Class.getDeclaredConstructors0(Native Method)
	at java.lang.Class.privateGetDeclaredConstructors(Class.java:2493)
	at java.lang.Class.getDeclaredConstructors(Class.java:1901)
	at org.mockito.internal.creation.jmock.ClassImposterizer.setConstructorsAccessible(ClassImposterizer.java:58)
	at org.mockito.internal.creation.jmock.ClassImposterizer.imposterise(ClassImposterizer.java:53)
	at org.mockito.internal.util.MockUtil.createMock(MockUtil.java:54)
	at org.mockito.internal.MockitoCore.mock(MockitoCore.java:45)
	at org.mockito.Mockito.mock(Mockito.java:921)
	at org.mockito.Mockito.mock(Mockito.java:816)
	at org.apache.hadoop.yarn.server.resourcemanager.scheduler.capacity.TestUtils.getMockRMContext(TestUtils.java:100)
	at org.apache.hadoop.yarn.server.resourcemanager.security.TestDelegationTokenRenewer.createNewDelegationTokenRenewer(TestDelegationTokenRenewer.java:727)
	at org.apache.hadoop.yarn.server.resourcemanager.security.TestDelegationTokenRenewer.setUp(TestDelegationTokenRenewer.java:204)


FAILED:  org.apache.hadoop.yarn.server.resourcemanager.security.TestDelegationTokenRenewer.testAppSubmissionWithPreviousToken

Error Message:
null

Stack Trace:
java.lang.NullPointerException: null
	at org.apache.hadoop.yarn.server.resourcemanager.security.TestDelegationTokenRenewer.tearDown(TestDelegationTokenRenewer.java:223)


FAILED:  org.apache.hadoop.yarn.server.resourcemanager.security.TestDelegationTokenRenewer.testDTRenewalWithNoCancel

Error Message:
org/apache/hadoop/yarn/server/applicationhistoryservice/ApplicationHistoryWriter

Stack Trace:
java.lang.NoClassDefFoundError: org/apache/hadoop/yarn/server/applicationhistoryservice/ApplicationHistoryWriter
	at java.net.URLClassLoader$1.run(URLClassLoader.java:366)
	at java.net.URLClassLoader$1.run(URLClassLoader.java:355)
	at java.security.AccessController.doPrivileged(Native Method)
	at java.net.URLClassLoader.findClass(URLClassLoader.java:354)
	at java.lang.ClassLoader.loadClass(ClassLoader.java:425)
	at sun.misc.Launcher$AppClassLoader.loadClass(Launcher.java:308)
	at java.lang.ClassLoader.loadClass(ClassLoader.java:358)
	at java.lang.Class.getDeclaredConstructors0(Native Method)
	at java.lang.Class.privateGetDeclaredConstructors(Class.java:2493)
	at java.lang.Class.getDeclaredConstructors(Class.java:1901)
	at org.mockito.internal.creation.jmock.ClassImposterizer.setConstructorsAccessible(ClassImposterizer.java:58)
	at org.mockito.internal.creation.jmock.ClassImposterizer.imposterise(ClassImposterizer.java:53)
	at org.mockito.internal.util.MockUtil.createMock(MockUtil.java:54)
	at org.mockito.internal.MockitoCore.mock(MockitoCore.java:45)
	at org.mockito.Mockito.mock(Mockito.java:921)
	at org.mockito.Mockito.mock(Mockito.java:816)
	at org.apache.hadoop.yarn.server.resourcemanager.scheduler.capacity.TestUtils.getMockRMContext(TestUtils.java:100)
	at org.apache.hadoop.yarn.server.resourcemanager.security.TestDelegationTokenRenewer.createNewDelegationTokenRenewer(TestDelegationTokenRenewer.java:727)
	at org.apache.hadoop.yarn.server.resourcemanager.security.TestDelegationTokenRenewer.setUp(TestDelegationTokenRenewer.java:204)


FAILED:  org.apache.hadoop.yarn.server.resourcemanager.security.TestDelegationTokenRenewer.testDTRenewalWithNoCancel

Error Message:
null

Stack Trace:
java.lang.NullPointerException: null
	at org.apache.hadoop.yarn.server.resourcemanager.security.TestDelegationTokenRenewer.tearDown(TestDelegationTokenRenewer.java:223)


FAILED:  org.apache.hadoop.yarn.server.resourcemanager.security.TestDelegationTokenRenewer.testDTKeepAlive1

Error Message:
org/apache/hadoop/yarn/server/applicationhistoryservice/ApplicationHistoryWriter

Stack Trace:
java.lang.NoClassDefFoundError: org/apache/hadoop/yarn/server/applicationhistoryservice/ApplicationHistoryWriter
	at java.net.URLClassLoader$1.run(URLClassLoader.java:366)
	at java.net.URLClassLoader$1.run(URLClassLoader.java:355)
	at java.security.AccessController.doPrivileged(Native Method)
	at java.net.URLClassLoader.findClass(URLClassLoader.java:354)
	at java.lang.ClassLoader.loadClass(ClassLoader.java:425)
	at sun.misc.Launcher$AppClassLoader.loadClass(Launcher.java:308)
	at java.lang.ClassLoader.loadClass(ClassLoader.java:358)
	at java.lang.Class.getDeclaredConstructors0(Native Method)
	at java.lang.Class.privateGetDeclaredConstructors(Class.java:2493)
	at java.lang.Class.getDeclaredConstructors(Class.java:1901)
	at org.mockito.internal.creation.jmock.ClassImposterizer.setConstructorsAccessible(ClassImposterizer.java:58)
	at org.mockito.internal.creation.jmock.ClassImposterizer.imposterise(ClassImposterizer.java:53)
	at org.mockito.internal.util.MockUtil.createMock(MockUtil.java:54)
	at org.mockito.internal.MockitoCore.mock(MockitoCore.java:45)
	at org.mockito.Mockito.mock(Mockito.java:921)
	at org.mockito.Mockito.mock(Mockito.java:816)
	at org.apache.hadoop.yarn.server.resourcemanager.scheduler.capacity.TestUtils.getMockRMContext(TestUtils.java:100)
	at org.apache.hadoop.yarn.server.resourcemanager.security.TestDelegationTokenRenewer.createNewDelegationTokenRenewer(TestDelegationTokenRenewer.java:727)
	at org.apache.hadoop.yarn.server.resourcemanager.security.TestDelegationTokenRenewer.setUp(TestDelegationTokenRenewer.java:204)


FAILED:  org.apache.hadoop.yarn.server.resourcemanager.security.TestDelegationTokenRenewer.testDTKeepAlive1

Error Message:
null

Stack Trace:
java.lang.NullPointerException: null
	at org.apache.hadoop.yarn.server.resourcemanager.security.TestDelegationTokenRenewer.tearDown(TestDelegationTokenRenewer.java:223)


FAILED:  org.apache.hadoop.yarn.server.resourcemanager.security.TestDelegationTokenRenewer.testDTKeepAlive2

Error Message:
org/apache/hadoop/yarn/server/applicationhistoryservice/ApplicationHistoryWriter

Stack Trace:
java.lang.NoClassDefFoundError: org/apache/hadoop/yarn/server/applicationhistoryservice/ApplicationHistoryWriter
	at java.net.URLClassLoader$1.run(URLClassLoader.java:366)
	at java.net.URLClassLoader$1.run(URLClassLoader.java:355)
	at java.security.AccessController.doPrivileged(Native Method)
	at java.net.URLClassLoader.findClass(URLClassLoader.java:354)
	at java.lang.ClassLoader.loadClass(ClassLoader.java:425)
	at sun.misc.Launcher$AppClassLoader.loadClass(Launcher.java:308)
	at java.lang.ClassLoader.loadClass(ClassLoader.java:358)
	at java.lang.Class.getDeclaredConstructors0(Native Method)
	at java.lang.Class.privateGetDeclaredConstructors(Class.java:2493)
	at java.lang.Class.getDeclaredConstructors(Class.java:1901)
	at org.mockito.internal.creation.jmock.ClassImposterizer.setConstructorsAccessible(ClassImposterizer.java:58)
	at org.mockito.internal.creation.jmock.ClassImposterizer.imposterise(ClassImposterizer.java:53)
	at org.mockito.internal.util.MockUtil.createMock(MockUtil.java:54)
	at org.mockito.internal.MockitoCore.mock(MockitoCore.java:45)
	at org.mockito.Mockito.mock(Mockito.java:921)
	at org.mockito.Mockito.mock(Mockito.java:816)
	at org.apache.hadoop.yarn.server.resourcemanager.scheduler.capacity.TestUtils.getMockRMContext(TestUtils.java:100)
	at org.apache.hadoop.yarn.server.resourcemanager.security.TestDelegationTokenRenewer.createNewDelegationTokenRenewer(TestDelegationTokenRenewer.java:727)
	at org.apache.hadoop.yarn.server.resourcemanager.security.TestDelegationTokenRenewer.setUp(TestDelegationTokenRenewer.java:204)


FAILED:  org.apache.hadoop.yarn.server.resourcemanager.security.TestDelegationTokenRenewer.testDTKeepAlive2

Error Message:
null

Stack Trace:
java.lang.NullPointerException: null
	at org.apache.hadoop.yarn.server.resourcemanager.security.TestDelegationTokenRenewer.tearDown(TestDelegationTokenRenewer.java:223)


FAILED:  org.apache.hadoop.yarn.server.resourcemanager.security.TestDelegationTokenRenewer.testDTRenewal

Error Message:
org/apache/hadoop/yarn/server/applicationhistoryservice/ApplicationHistoryWriter

Stack Trace:
java.lang.NoClassDefFoundError: org/apache/hadoop/yarn/server/applicationhistoryservice/ApplicationHistoryWriter
	at java.net.URLClassLoader$1.run(URLClassLoader.java:366)
	at java.net.URLClassLoader$1.run(URLClassLoader.java:355)
	at java.security.AccessController.doPrivileged(Native Method)
	at java.net.URLClassLoader.findClass(URLClassLoader.java:354)
	at java.lang.ClassLoader.loadClass(ClassLoader.java:425)
	at sun.misc.Launcher$AppClassLoader.loadClass(Launcher.java:308)
	at java.lang.ClassLoader.loadClass(ClassLoader.java:358)
	at java.lang.Class.getDeclaredConstructors0(Native Method)
	at java.lang.Class.privateGetDeclaredConstructors(Class.java:2493)
	at java.lang.Class.getDeclaredConstructors(Class.java:1901)
	at org.mockito.internal.creation.jmock.ClassImposterizer.setConstructorsAccessible(ClassImposterizer.java:58)
	at org.mockito.internal.creation.jmock.ClassImposterizer.imposterise(ClassImposterizer.java:53)
	at org.mockito.internal.util.MockUtil.createMock(MockUtil.java:54)
	at org.mockito.internal.MockitoCore.mock(MockitoCore.java:45)
	at org.mockito.Mockito.mock(Mockito.java:921)
	at org.mockito.Mockito.mock(Mockito.java:816)
	at org.apache.hadoop.yarn.server.resourcemanager.scheduler.capacity.TestUtils.getMockRMContext(TestUtils.java:100)
	at org.apache.hadoop.yarn.server.resourcemanager.security.TestDelegationTokenRenewer.createNewDelegationTokenRenewer(TestDelegationTokenRenewer.java:727)
	at org.apache.hadoop.yarn.server.resourcemanager.security.TestDelegationTokenRenewer.setUp(TestDelegationTokenRenewer.java:204)


FAILED:  org.apache.hadoop.yarn.server.resourcemanager.security.TestDelegationTokenRenewer.testDTRenewal

Error Message:
null

Stack Trace:
java.lang.NullPointerException: null
	at org.apache.hadoop.yarn.server.resourcemanager.security.TestDelegationTokenRenewer.tearDown(TestDelegationTokenRenewer.java:223)


FAILED:  org.apache.hadoop.yarn.server.resourcemanager.security.TestDelegationTokenRenewer.testConcurrentAddApplication

Error Message:
org/apache/hadoop/yarn/server/applicationhistoryservice/ApplicationHistoryWriter

Stack Trace:
java.lang.NoClassDefFoundError: org/apache/hadoop/yarn/server/applicationhistoryservice/ApplicationHistoryWriter
	at java.net.URLClassLoader$1.run(URLClassLoader.java:366)
	at java.net.URLClassLoader$1.run(URLClassLoader.java:355)
	at java.security.AccessController.doPrivileged(Native Method)
	at java.net.URLClassLoader.findClass(URLClassLoader.java:354)
	at java.lang.ClassLoader.loadClass(ClassLoader.java:425)
	at sun.misc.Launcher$AppClassLoader.loadClass(Launcher.java:308)
	at java.lang.ClassLoader.loadClass(ClassLoader.java:358)
	at java.lang.Class.getDeclaredConstructors0(Native Method)
	at java.lang.Class.privateGetDeclaredConstructors(Class.java:2493)
	at java.lang.Class.getDeclaredConstructors(Class.java:1901)
	at org.mockito.internal.creation.jmock.ClassImposterizer.setConstructorsAccessible(ClassImposterizer.java:58)
	at org.mockito.internal.creation.jmock.ClassImposterizer.imposterise(ClassImposterizer.java:53)
	at org.mockito.internal.util.MockUtil.createMock(MockUtil.java:54)
	at org.mockito.internal.MockitoCore.mock(MockitoCore.java:45)
	at org.mockito.Mockito.mock(Mockito.java:921)
	at org.mockito.Mockito.mock(Mockito.java:816)
	at org.apache.hadoop.yarn.server.resourcemanager.scheduler.capacity.TestUtils.getMockRMContext(TestUtils.java:100)
	at org.apache.hadoop.yarn.server.resourcemanager.security.TestDelegationTokenRenewer.createNewDelegationTokenRenewer(TestDelegationTokenRenewer.java:727)
	at org.apache.hadoop.yarn.server.resourcemanager.security.TestDelegationTokenRenewer.setUp(TestDelegationTokenRenewer.java:204)


FAILED:  org.apache.hadoop.yarn.server.resourcemanager.security.TestDelegationTokenRenewer.testConcurrentAddApplication

Error Message:
null

Stack Trace:
java.lang.NullPointerException: null
	at org.apache.hadoop.yarn.server.resourcemanager.security.TestDelegationTokenRenewer.tearDown(TestDelegationTokenRenewer.java:223)


FAILED:  org.apache.hadoop.yarn.server.resourcemanager.security.TestDelegationTokenRenewer.testCancelWithMultipleAppSubmissions

Error Message:
org/apache/hadoop/yarn/server/applicationhistoryservice/ApplicationHistoryWriter

Stack Trace:
java.lang.NoClassDefFoundError: org/apache/hadoop/yarn/server/applicationhistoryservice/ApplicationHistoryWriter
	at java.net.URLClassLoader$1.run(URLClassLoader.java:366)
	at java.net.URLClassLoader$1.run(URLClassLoader.java:355)
	at java.security.AccessController.doPrivileged(Native Method)
	at java.net.URLClassLoader.findClass(URLClassLoader.java:354)
	at java.lang.ClassLoader.loadClass(ClassLoader.java:425)
	at sun.misc.Launcher$AppClassLoader.loadClass(Launcher.java:308)
	at java.lang.ClassLoader.loadClass(ClassLoader.java:358)
	at java.lang.Class.getDeclaredConstructors0(Native Method)
	at java.lang.Class.privateGetDeclaredConstructors(Class.java:2493)
	at java.lang.Class.getDeclaredConstructors(Class.java:1901)
	at org.mockito.internal.creation.jmock.ClassImposterizer.setConstructorsAccessible(ClassImposterizer.java:58)
	at org.mockito.internal.creation.jmock.ClassImposterizer.imposterise(ClassImposterizer.java:53)
	at org.mockito.internal.util.MockUtil.createMock(MockUtil.java:54)
	at org.mockito.internal.MockitoCore.mock(MockitoCore.java:45)
	at org.mockito.Mockito.mock(Mockito.java:921)
	at org.mockito.Mockito.mock(Mockito.java:816)
	at org.apache.hadoop.yarn.server.resourcemanager.scheduler.capacity.TestUtils.getMockRMContext(TestUtils.java:100)
	at org.apache.hadoop.yarn.server.resourcemanager.security.TestDelegationTokenRenewer.createNewDelegationTokenRenewer(TestDelegationTokenRenewer.java:727)
	at org.apache.hadoop.yarn.server.resourcemanager.security.TestDelegationTokenRenewer.setUp(TestDelegationTokenRenewer.java:204)


FAILED:  org.apache.hadoop.yarn.server.resourcemanager.security.TestDelegationTokenRenewer.testCancelWithMultipleAppSubmissions

Error Message:
null

Stack Trace:
java.lang.NullPointerException: null
	at org.apache.hadoop.yarn.server.resourcemanager.security.TestDelegationTokenRenewer.tearDown(TestDelegationTokenRenewer.java:223)


FAILED:  org.apache.hadoop.yarn.server.resourcemanager.security.TestDelegationTokenRenewer.testReplaceExpiringDelegationToken

Error Message:
org/apache/hadoop/yarn/server/applicationhistoryservice/ApplicationHistoryWriter

Stack Trace:
java.lang.NoClassDefFoundError: org/apache/hadoop/yarn/server/applicationhistoryservice/ApplicationHistoryWriter
	at java.net.URLClassLoader$1.run(URLClassLoader.java:366)
	at java.net.URLClassLoader$1.run(URLClassLoader.java:355)
	at java.security.AccessController.doPrivileged(Native Method)
	at java.net.URLClassLoader.findClass(URLClassLoader.java:354)
	at java.lang.ClassLoader.loadClass(ClassLoader.java:425)
	at sun.misc.Launcher$AppClassLoader.loadClass(Launcher.java:308)
	at java.lang.ClassLoader.loadClass(ClassLoader.java:358)
	at java.lang.Class.getDeclaredConstructors0(Native Method)
	at java.lang.Class.privateGetDeclaredConstructors(Class.java:2493)
	at java.lang.Class.getDeclaredConstructors(Class.java:1901)
	at org.mockito.internal.creation.jmock.ClassImposterizer.setConstructorsAccessible(ClassImposterizer.java:58)
	at org.mockito.internal.creation.jmock.ClassImposterizer.imposterise(ClassImposterizer.java:53)
	at org.mockito.internal.util.MockUtil.createMock(MockUtil.java:54)
	at org.mockito.internal.MockitoCore.mock(MockitoCore.java:45)
	at org.mockito.Mockito.mock(Mockito.java:921)
	at org.mockito.Mockito.mock(Mockito.java:816)
	at org.apache.hadoop.yarn.server.resourcemanager.scheduler.capacity.TestUtils.getMockRMContext(TestUtils.java:100)
	at org.apache.hadoop.yarn.server.resourcemanager.security.TestDelegationTokenRenewer.createNewDelegationTokenRenewer(TestDelegationTokenRenewer.java:727)
	at org.apache.hadoop.yarn.server.resourcemanager.security.TestDelegationTokenRenewer.setUp(TestDelegationTokenRenewer.java:204)


FAILED:  org.apache.hadoop.yarn.server.resourcemanager.security.TestDelegationTokenRenewer.testReplaceExpiringDelegationToken

Error Message:
null

Stack Trace:
java.lang.NullPointerException: null
	at org.apache.hadoop.yarn.server.resourcemanager.security.TestDelegationTokenRenewer.tearDown(TestDelegationTokenRenewer.java:223)


FAILED:  org.apache.hadoop.yarn.server.resourcemanager.security.TestDelegationTokenRenewer.testDTRonAppSubmission

Error Message:
org/apache/hadoop/yarn/server/applicationhistoryservice/ApplicationHistoryWriter

Stack Trace:
java.lang.NoClassDefFoundError: org/apache/hadoop/yarn/server/applicationhistoryservice/ApplicationHistoryWriter
	at java.net.URLClassLoader$1.run(URLClassLoader.java:366)
	at java.net.URLClassLoader$1.run(URLClassLoader.java:355)
	at java.security.AccessController.doPrivileged(Native Method)
	at java.net.URLClassLoader.findClass(URLClassLoader.java:354)
	at java.lang.ClassLoader.loadClass(ClassLoader.java:425)
	at sun.misc.Launcher$AppClassLoader.loadClass(Launcher.java:308)
	at java.lang.ClassLoader.loadClass(ClassLoader.java:358)
	at java.lang.Class.getDeclaredConstructors0(Native Method)
	at java.lang.Class.privateGetDeclaredConstructors(Class.java:2493)
	at java.lang.Class.getDeclaredConstructors(Class.java:1901)
	at org.mockito.internal.creation.jmock.ClassImposterizer.setConstructorsAccessible(ClassImposterizer.java:58)
	at org.mockito.internal.creation.jmock.ClassImposterizer.imposterise(ClassImposterizer.java:53)
	at org.mockito.internal.util.MockUtil.createMock(MockUtil.java:54)
	at org.mockito.internal.MockitoCore.mock(MockitoCore.java:45)
	at org.mockito.Mockito.mock(Mockito.java:921)
	at org.mockito.Mockito.mock(Mockito.java:816)
	at org.apache.hadoop.yarn.server.resourcemanager.scheduler.capacity.TestUtils.getMockRMContext(TestUtils.java:100)
	at org.apache.hadoop.yarn.server.resourcemanager.security.TestDelegationTokenRenewer.createNewDelegationTokenRenewer(TestDelegationTokenRenewer.java:727)
	at org.apache.hadoop.yarn.server.resourcemanager.security.TestDelegationTokenRenewer.setUp(TestDelegationTokenRenewer.java:204)


FAILED:  org.apache.hadoop.yarn.server.resourcemanager.security.TestDelegationTokenRenewer.testDTRonAppSubmission

Error Message:
null

Stack Trace:
java.lang.NullPointerException: null
	at org.apache.hadoop.yarn.server.resourcemanager.security.TestDelegationTokenRenewer.tearDown(TestDelegationTokenRenewer.java:223)


FAILED:  org.apache.hadoop.yarn.server.resourcemanager.security.TestDelegationTokenRenewer.testFSLeakInObtainSystemTokensForUser

Error Message:
org/apache/hadoop/yarn/server/applicationhistoryservice/ApplicationHistoryWriter

Stack Trace:
java.lang.NoClassDefFoundError: org/apache/hadoop/yarn/server/applicationhistoryservice/ApplicationHistoryWriter
	at java.net.URLClassLoader$1.run(URLClassLoader.java:366)
	at java.net.URLClassLoader$1.run(URLClassLoader.java:355)
	at java.security.AccessController.doPrivileged(Native Method)
	at java.net.URLClassLoader.findClass(URLClassLoader.java:354)
	at java.lang.ClassLoader.loadClass(ClassLoader.java:425)
	at sun.misc.Launcher$AppClassLoader.loadClass(Launcher.java:308)
	at java.lang.ClassLoader.loadClass(ClassLoader.java:358)
	at java.lang.Class.getDeclaredConstructors0(Native Method)
	at java.lang.Class.privateGetDeclaredConstructors(Class.java:2493)
	at java.lang.Class.getDeclaredConstructors(Class.java:1901)
	at org.mockito.internal.creation.jmock.ClassImposterizer.setConstructorsAccessible(ClassImposterizer.java:58)
	at org.mockito.internal.creation.jmock.ClassImposterizer.imposterise(ClassImposterizer.java:53)
	at org.mockito.internal.util.MockUtil.createMock(MockUtil.java:54)
	at org.mockito.internal.MockitoCore.mock(MockitoCore.java:45)
	at org.mockito.Mockito.mock(Mockito.java:921)
	at org.mockito.Mockito.mock(Mockito.java:816)
	at org.apache.hadoop.yarn.server.resourcemanager.scheduler.capacity.TestUtils.getMockRMContext(TestUtils.java:100)
	at org.apache.hadoop.yarn.server.resourcemanager.security.TestDelegationTokenRenewer.createNewDelegationTokenRenewer(TestDelegationTokenRenewer.java:727)
	at org.apache.hadoop.yarn.server.resourcemanager.security.TestDelegationTokenRenewer.setUp(TestDelegationTokenRenewer.java:204)


FAILED:  org.apache.hadoop.yarn.server.resourcemanager.security.TestDelegationTokenRenewer.testFSLeakInObtainSystemTokensForUser

Error Message:
null

Stack Trace:
java.lang.NullPointerException: null
	at org.apache.hadoop.yarn.server.resourcemanager.security.TestDelegationTokenRenewer.tearDown(TestDelegationTokenRenewer.java:223)


FAILED:  org.apache.hadoop.yarn.server.resourcemanager.security.TestDelegationTokenRenewer.testAppSubmissionWithInvalidDelegationToken

Error Message:
org/apache/hadoop/yarn/server/applicationhistoryservice/ApplicationHistoryWriter

Stack Trace:
java.lang.NoClassDefFoundError: org/apache/hadoop/yarn/server/applicationhistoryservice/ApplicationHistoryWriter
	at java.net.URLClassLoader$1.run(URLClassLoader.java:366)
	at java.net.URLClassLoader$1.run(URLClassLoader.java:355)
	at java.security.AccessController.doPrivileged(Native Method)
	at java.net.URLClassLoader.findClass(URLClassLoader.java:354)
	at java.lang.ClassLoader.loadClass(ClassLoader.java:425)
	at sun.misc.Launcher$AppClassLoader.loadClass(Launcher.java:308)
	at java.lang.ClassLoader.loadClass(ClassLoader.java:358)
	at java.lang.Class.getDeclaredConstructors0(Native Method)
	at java.lang.Class.privateGetDeclaredConstructors(Class.java:2493)
	at java.lang.Class.getDeclaredConstructors(Class.java:1901)
	at org.mockito.internal.creation.jmock.ClassImposterizer.setConstructorsAccessible(ClassImposterizer.java:58)
	at org.mockito.internal.creation.jmock.ClassImposterizer.imposterise(ClassImposterizer.java:53)
	at org.mockito.internal.util.MockUtil.createMock(MockUtil.java:54)
	at org.mockito.internal.MockitoCore.mock(MockitoCore.java:45)
	at org.mockito.Mockito.mock(Mockito.java:921)
	at org.mockito.Mockito.mock(Mockito.java:816)
	at org.apache.hadoop.yarn.server.resourcemanager.scheduler.capacity.TestUtils.getMockRMContext(TestUtils.java:100)
	at org.apache.hadoop.yarn.server.resourcemanager.security.TestDelegationTokenRenewer.createNewDelegationTokenRenewer(TestDelegationTokenRenewer.java:727)
	at org.apache.hadoop.yarn.server.resourcemanager.security.TestDelegationTokenRenewer.setUp(TestDelegationTokenRenewer.java:204)


FAILED:  org.apache.hadoop.yarn.server.resourcemanager.security.TestDelegationTokenRenewer.testAppSubmissionWithInvalidDelegationToken

Error Message:
null

Stack Trace:
java.lang.NullPointerException: null
	at org.apache.hadoop.yarn.server.resourcemanager.security.TestDelegationTokenRenewer.tearDown(TestDelegationTokenRenewer.java:223)


FAILED:  org.apache.hadoop.yarn.server.resourcemanager.security.TestDelegationTokenRenewer.testAppTokenWithNonRenewer

Error Message:
org/apache/hadoop/yarn/server/applicationhistoryservice/ApplicationHistoryWriter

Stack Trace:
java.lang.NoClassDefFoundError: org/apache/hadoop/yarn/server/applicationhistoryservice/ApplicationHistoryWriter
	at java.net.URLClassLoader$1.run(URLClassLoader.java:366)
	at java.net.URLClassLoader$1.run(URLClassLoader.java:355)
	at java.security.AccessController.doPrivileged(Native Method)
	at java.net.URLClassLoader.findClass(URLClassLoader.java:354)
	at java.lang.ClassLoader.loadClass(ClassLoader.java:425)
	at sun.misc.Launcher$AppClassLoader.loadClass(Launcher.java:308)
	at java.lang.ClassLoader.loadClass(ClassLoader.java:358)
	at java.lang.Class.getDeclaredConstructors0(Native Method)
	at java.lang.Class.privateGetDeclaredConstructors(Class.java:2493)
	at java.lang.Class.getDeclaredConstructors(Class.java:1901)
	at org.mockito.internal.creation.jmock.ClassImposterizer.setConstructorsAccessible(ClassImposterizer.java:58)
	at org.mockito.internal.creation.jmock.ClassImposterizer.imposterise(ClassImposterizer.java:53)
	at org.mockito.internal.util.MockUtil.createMock(MockUtil.java:54)
	at org.mockito.internal.MockitoCore.mock(MockitoCore.java:45)
	at org.mockito.Mockito.mock(Mockito.java:921)
	at org.mockito.Mockito.mock(Mockito.java:816)
	at org.apache.hadoop.yarn.server.resourcemanager.scheduler.capacity.TestUtils.getMockRMContext(TestUtils.java:100)
	at org.apache.hadoop.yarn.server.resourcemanager.security.TestDelegationTokenRenewer.createNewDelegationTokenRenewer(TestDelegationTokenRenewer.java:727)
	at org.apache.hadoop.yarn.server.resourcemanager.security.TestDelegationTokenRenewer.setUp(TestDelegationTokenRenewer.java:204)


FAILED:  org.apache.hadoop.yarn.server.resourcemanager.security.TestDelegationTokenRenewer.testAppTokenWithNonRenewer

Error Message:
null

Stack Trace:
java.lang.NullPointerException: null
	at org.apache.hadoop.yarn.server.resourcemanager.security.TestDelegationTokenRenewer.tearDown(TestDelegationTokenRenewer.java:223)


FAILED:  org.apache.hadoop.yarn.server.resourcemanager.security.TestDelegationTokenRenewer.testAppSubmissionWithoutDelegationToken

Error Message:
org/apache/hadoop/yarn/server/applicationhistoryservice/ApplicationHistoryWriter

Stack Trace:
java.lang.NoClassDefFoundError: org/apache/hadoop/yarn/server/applicationhistoryservice/ApplicationHistoryWriter
	at java.net.URLClassLoader$1.run(URLClassLoader.java:366)
	at java.net.URLClassLoader$1.run(URLClassLoader.java:355)
	at java.security.AccessController.doPrivileged(Native Method)
	at java.net.URLClassLoader.findClass(URLClassLoader.java:354)
	at java.lang.ClassLoader.loadClass(ClassLoader.java:425)
	at sun.misc.Launcher$AppClassLoader.loadClass(Launcher.java:308)
	at java.lang.ClassLoader.loadClass(ClassLoader.java:358)
	at java.lang.Class.getDeclaredConstructors0(Native Method)
	at java.lang.Class.privateGetDeclaredConstructors(Class.java:2493)
	at java.lang.Class.getDeclaredConstructors(Class.java:1901)
	at org.mockito.internal.creation.jmock.ClassImposterizer.setConstructorsAccessible(ClassImposterizer.java:58)
	at org.mockito.internal.creation.jmock.ClassImposterizer.imposterise(ClassImposterizer.java:53)
	at org.mockito.internal.util.MockUtil.createMock(MockUtil.java:54)
	at org.mockito.internal.MockitoCore.mock(MockitoCore.java:45)
	at org.mockito.Mockito.mock(Mockito.java:921)
	at org.mockito.Mockito.mock(Mockito.java:816)
	at org.apache.hadoop.yarn.server.resourcemanager.scheduler.capacity.TestUtils.getMockRMContext(TestUtils.java:100)
	at org.apache.hadoop.yarn.server.resourcemanager.security.TestDelegationTokenRenewer.createNewDelegationTokenRenewer(TestDelegationTokenRenewer.java:727)
	at org.apache.hadoop.yarn.server.resourcemanager.security.TestDelegationTokenRenewer.setUp(TestDelegationTokenRenewer.java:204)


FAILED:  org.apache.hadoop.yarn.server.resourcemanager.security.TestDelegationTokenRenewer.testAppSubmissionWithoutDelegationToken

Error Message:
null

Stack Trace:
java.lang.NullPointerException: null
	at org.apache.hadoop.yarn.server.resourcemanager.security.TestDelegationTokenRenewer.tearDown(TestDelegationTokenRenewer.java:223)


FAILED:  org.apache.hadoop.yarn.server.resourcemanager.webapp.TestNodesPage.testNodesBlockRenderForNodeLabelFilterWithEmptyLabel

Error Message:
org.apache.hadoop.yarn.api.records.Resource.getResources()Ljava/util/Map;

Stack Trace:
java.lang.NoSuchMethodError: org.apache.hadoop.yarn.api.records.Resource.getResources()Ljava/util/Map;
	at org.apache.hadoop.yarn.server.resourcemanager.webapp.dao.ResourceInfo.<init>(ResourceInfo.java:47)
	at org.apache.hadoop.yarn.server.resourcemanager.webapp.dao.SchedulerInfo.<init>(SchedulerInfo.java:55)
	at org.apache.hadoop.yarn.server.resourcemanager.webapp.MetricsOverviewTable.render(MetricsOverviewTable.java:160)
	at org.apache.hadoop.yarn.webapp.view.HtmlBlock.render(HtmlBlock.java:69)
	at org.apache.hadoop.yarn.webapp.view.HtmlBlock.renderPartial(HtmlBlock.java:79)
	at org.apache.hadoop.yarn.webapp.View.render(View.java:235)
	at org.apache.hadoop.yarn.webapp.view.HtmlBlock$Block.subView(HtmlBlock.java:43)
	at org.apache.hadoop.yarn.webapp.hamlet.Hamlet._(Hamlet.java:30347)
	at org.apache.hadoop.yarn.server.resourcemanager.webapp.NodesPage$NodesBlock.render(NodesPage.java:62)
	at org.apache.hadoop.yarn.webapp.view.HtmlBlock.render(HtmlBlock.java:69)
	at org.apache.hadoop.yarn.server.resourcemanager.webapp.TestNodesPage.testNodesBlockRenderForNodeLabelFilterWithEmptyLabel(TestNodesPage.java:129)


FAILED:  org.apache.hadoop.yarn.server.resourcemanager.webapp.TestNodesPage.testNodesBlockRenderForNodeLabelFilterWithNonEmptyLabel

Error Message:
org.apache.hadoop.yarn.api.records.Resource.getResources()Ljava/util/Map;

Stack Trace:
java.lang.NoSuchMethodError: org.apache.hadoop.yarn.api.records.Resource.getResources()Ljava/util/Map;
	at org.apache.hadoop.yarn.server.resourcemanager.webapp.dao.ResourceInfo.<init>(ResourceInfo.java:47)
	at org.apache.hadoop.yarn.server.resourcemanager.webapp.dao.SchedulerInfo.<init>(SchedulerInfo.java:55)
	at org.apache.hadoop.yarn.server.resourcemanager.webapp.MetricsOverviewTable.render(MetricsOverviewTable.java:160)
	at org.apache.hadoop.yarn.webapp.view.HtmlBlock.render(HtmlBlock.java:69)
	at org.apache.hadoop.yarn.webapp.view.HtmlBlock.renderPartial(HtmlBlock.java:79)
	at org.apache.hadoop.yarn.webapp.View.render(View.java:235)
	at org.apache.hadoop.yarn.webapp.view.HtmlBlock$Block.subView(HtmlBlock.java:43)
	at org.apache.hadoop.yarn.webapp.hamlet.Hamlet._(Hamlet.java:30347)
	at org.apache.hadoop.yarn.server.resourcemanager.webapp.NodesPage$NodesBlock.render(NodesPage.java:62)
	at org.apache.hadoop.yarn.webapp.view.HtmlBlock.render(HtmlBlock.java:69)
	at org.apache.hadoop.yarn.server.resourcemanager.webapp.TestNodesPage.testNodesBlockRenderForNodeLabelFilterWithNonEmptyLabel(TestNodesPage.java:114)


FAILED:  org.apache.hadoop.yarn.server.resourcemanager.webapp.TestNodesPage.testNodesBlockRender

Error Message:
org.apache.hadoop.yarn.api.records.Resource.getResources()Ljava/util/Map;

Stack Trace:
java.lang.NoSuchMethodError: org.apache.hadoop.yarn.api.records.Resource.getResources()Ljava/util/Map;
	at org.apache.hadoop.yarn.server.resourcemanager.webapp.dao.ResourceInfo.<init>(ResourceInfo.java:47)
	at org.apache.hadoop.yarn.server.resourcemanager.webapp.dao.SchedulerInfo.<init>(SchedulerInfo.java:55)
	at org.apache.hadoop.yarn.server.resourcemanager.webapp.MetricsOverviewTable.render(MetricsOverviewTable.java:160)
	at org.apache.hadoop.yarn.webapp.view.HtmlBlock.render(HtmlBlock.java:69)
	at org.apache.hadoop.yarn.webapp.view.HtmlBlock.renderPartial(HtmlBlock.java:79)
	at org.apache.hadoop.yarn.webapp.View.render(View.java:235)
	at org.apache.hadoop.yarn.webapp.view.HtmlBlock$Block.subView(HtmlBlock.java:43)
	at org.apache.hadoop.yarn.webapp.hamlet.Hamlet._(Hamlet.java:30347)
	at org.apache.hadoop.yarn.server.resourcemanager.webapp.NodesPage$NodesBlock.render(NodesPage.java:62)
	at org.apache.hadoop.yarn.webapp.view.HtmlBlock.render(HtmlBlock.java:69)
	at org.apache.hadoop.yarn.server.resourcemanager.webapp.TestNodesPage.testNodesBlockRender(TestNodesPage.java:78)


FAILED:  org.apache.hadoop.yarn.server.resourcemanager.webapp.TestNodesPage.testNodesBlockRenderForLostNodes

Error Message:
org.apache.hadoop.yarn.api.records.Resource.getResources()Ljava/util/Map;

Stack Trace:
java.lang.NoSuchMethodError: org.apache.hadoop.yarn.api.records.Resource.getResources()Ljava/util/Map;
	at org.apache.hadoop.yarn.server.resourcemanager.webapp.dao.ResourceInfo.<init>(ResourceInfo.java:47)
	at org.apache.hadoop.yarn.server.resourcemanager.webapp.dao.SchedulerInfo.<init>(SchedulerInfo.java:55)
	at org.apache.hadoop.yarn.server.resourcemanager.webapp.MetricsOverviewTable.render(MetricsOverviewTable.java:160)
	at org.apache.hadoop.yarn.webapp.view.HtmlBlock.render(HtmlBlock.java:69)
	at org.apache.hadoop.yarn.webapp.view.HtmlBlock.renderPartial(HtmlBlock.java:79)
	at org.apache.hadoop.yarn.webapp.View.render(View.java:235)
	at org.apache.hadoop.yarn.webapp.view.HtmlBlock$Block.subView(HtmlBlock.java:43)
	at org.apache.hadoop.yarn.webapp.hamlet.Hamlet._(Hamlet.java:30347)
	at org.apache.hadoop.yarn.server.resourcemanager.webapp.NodesPage$NodesBlock.render(NodesPage.java:62)
	at org.apache.hadoop.yarn.webapp.view.HtmlBlock.render(HtmlBlock.java:69)
	at org.apache.hadoop.yarn.server.resourcemanager.webapp.TestNodesPage.testNodesBlockRenderForLostNodes(TestNodesPage.java:96)


FAILED:  org.apache.hadoop.yarn.server.resourcemanager.webapp.TestNodesPage.testNodesBlockRenderForNodeLabelFilterWithAnyLabel

Error Message:
org.apache.hadoop.yarn.api.records.Resource.getResources()Ljava/util/Map;

Stack Trace:
java.lang.NoSuchMethodError: org.apache.hadoop.yarn.api.records.Resource.getResources()Ljava/util/Map;
	at org.apache.hadoop.yarn.server.resourcemanager.webapp.dao.ResourceInfo.<init>(ResourceInfo.java:47)
	at org.apache.hadoop.yarn.server.resourcemanager.webapp.dao.SchedulerInfo.<init>(SchedulerInfo.java:55)
	at org.apache.hadoop.yarn.server.resourcemanager.webapp.MetricsOverviewTable.render(MetricsOverviewTable.java:160)
	at org.apache.hadoop.yarn.webapp.view.HtmlBlock.render(HtmlBlock.java:69)
	at org.apache.hadoop.yarn.webapp.view.HtmlBlock.renderPartial(HtmlBlock.java:79)
	at org.apache.hadoop.yarn.webapp.View.render(View.java:235)
	at org.apache.hadoop.yarn.webapp.view.HtmlBlock$Block.subView(HtmlBlock.java:43)
	at org.apache.hadoop.yarn.webapp.hamlet.Hamlet._(Hamlet.java:30347)
	at org.apache.hadoop.yarn.server.resourcemanager.webapp.NodesPage$NodesBlock.render(NodesPage.java:62)
	at org.apache.hadoop.yarn.webapp.view.HtmlBlock.render(HtmlBlock.java:69)
	at org.apache.hadoop.yarn.server.resourcemanager.webapp.TestNodesPage.testNodesBlockRenderForNodeLabelFilterWithAnyLabel(TestNodesPage.java:144)


FAILED:  org.apache.hadoop.yarn.server.resourcemanager.webapp.TestRMWebApp.testView

Error Message:
org.apache.hadoop.yarn.api.records.Resource.getResources()Ljava/util/Map;

Stack Trace:
java.lang.NoSuchMethodError: org.apache.hadoop.yarn.api.records.Resource.getResources()Ljava/util/Map;
	at org.apache.hadoop.yarn.server.resourcemanager.webapp.dao.ResourceInfo.<init>(ResourceInfo.java:47)
	at org.apache.hadoop.yarn.server.resourcemanager.webapp.dao.SchedulerInfo.<init>(SchedulerInfo.java:55)
	at org.apache.hadoop.yarn.server.resourcemanager.webapp.MetricsOverviewTable.render(MetricsOverviewTable.java:160)
	at org.apache.hadoop.yarn.webapp.view.HtmlBlock.render(HtmlBlock.java:69)
	at org.apache.hadoop.yarn.webapp.view.HtmlBlock.renderPartial(HtmlBlock.java:79)
	at org.apache.hadoop.yarn.webapp.View.render(View.java:235)
	at org.apache.hadoop.yarn.webapp.view.HtmlBlock$Block.subView(HtmlBlock.java:43)
	at org.apache.hadoop.yarn.webapp.hamlet.Hamlet._(Hamlet.java:30347)
	at org.apache.hadoop.yarn.server.resourcemanager.webapp.AppsBlockWithMetrics.render(AppsBlockWithMetrics.java:29)
	at org.apache.hadoop.yarn.webapp.view.HtmlBlock.render(HtmlBlock.java:69)
	at org.apache.hadoop.yarn.webapp.view.HtmlBlock.renderPartial(HtmlBlock.java:79)
	at org.apache.hadoop.yarn.webapp.View.render(View.java:235)
	at org.apache.hadoop.yarn.webapp.view.HtmlPage$Page.subView(HtmlPage.java:49)
	at org.apache.hadoop.yarn.webapp.hamlet.HamletImpl$EImp._v(HamletImpl.java:117)
	at org.apache.hadoop.yarn.webapp.hamlet.Hamlet$TD._(Hamlet.java:845)
	at org.apache.hadoop.yarn.webapp.view.TwoColumnLayout.render(TwoColumnLayout.java:56)
	at org.apache.hadoop.yarn.webapp.view.HtmlPage.render(HtmlPage.java:82)
	at org.apache.hadoop.yarn.server.resourcemanager.webapp.TestRMWebApp.testView(TestRMWebApp.java:114)


FAILED:  org.apache.hadoop.yarn.server.resourcemanager.webapp.TestRMWebApp.testNodesPage

Error Message:
org.apache.hadoop.yarn.api.records.Resource.getResources()Ljava/util/Map;

Stack Trace:
java.lang.NoSuchMethodError: org.apache.hadoop.yarn.api.records.Resource.getResources()Ljava/util/Map;
	at org.apache.hadoop.yarn.server.resourcemanager.webapp.dao.ResourceInfo.<init>(ResourceInfo.java:47)
	at org.apache.hadoop.yarn.server.resourcemanager.webapp.dao.SchedulerInfo.<init>(SchedulerInfo.java:55)
	at org.apache.hadoop.yarn.server.resourcemanager.webapp.MetricsOverviewTable.render(MetricsOverviewTable.java:160)
	at org.apache.hadoop.yarn.webapp.view.HtmlBlock.render(HtmlBlock.java:69)
	at org.apache.hadoop.yarn.webapp.view.HtmlBlock.renderPartial(HtmlBlock.java:79)
	at org.apache.hadoop.yarn.webapp.View.render(View.java:235)
	at org.apache.hadoop.yarn.webapp.view.HtmlBlock$Block.subView(HtmlBlock.java:43)
	at org.apache.hadoop.yarn.webapp.hamlet.Hamlet._(Hamlet.java:30347)
	at org.apache.hadoop.yarn.server.resourcemanager.webapp.NodesPage$NodesBlock.render(NodesPage.java:62)
	at org.apache.hadoop.yarn.webapp.view.HtmlBlock.render(HtmlBlock.java:69)
	at org.apache.hadoop.yarn.webapp.view.HtmlBlock.renderPartial(HtmlBlock.java:79)
	at org.apache.hadoop.yarn.webapp.View.render(View.java:235)
	at org.apache.hadoop.yarn.webapp.view.HtmlPage$Page.subView(HtmlPage.java:49)
	at org.apache.hadoop.yarn.webapp.hamlet.HamletImpl$EImp._v(HamletImpl.java:117)
	at org.apache.hadoop.yarn.webapp.hamlet.Hamlet$TD._(Hamlet.java:845)
	at org.apache.hadoop.yarn.webapp.view.TwoColumnLayout.render(TwoColumnLayout.java:56)
	at org.apache.hadoop.yarn.webapp.view.HtmlPage.render(HtmlPage.java:82)
	at org.apache.hadoop.yarn.server.resourcemanager.webapp.TestRMWebApp.testNodesPage(TestRMWebApp.java:142)


FAILED:  org.apache.hadoop.yarn.server.resourcemanager.webapp.TestRMWebAppFairScheduler.testFairSchedulerWebAppPageInInconsistentState

Error Message:
org.apache.hadoop.yarn.api.records.Resource.getResources()Ljava/util/Map;

Stack Trace:
java.lang.NoSuchMethodError: org.apache.hadoop.yarn.api.records.Resource.getResources()Ljava/util/Map;
	at org.apache.hadoop.yarn.server.resourcemanager.webapp.dao.ResourceInfo.<init>(ResourceInfo.java:47)
	at org.apache.hadoop.yarn.server.resourcemanager.webapp.dao.SchedulerInfo.<init>(SchedulerInfo.java:55)
	at org.apache.hadoop.yarn.server.resourcemanager.webapp.MetricsOverviewTable.render(MetricsOverviewTable.java:160)
	at org.apache.hadoop.yarn.webapp.view.HtmlBlock.render(HtmlBlock.java:69)
	at org.apache.hadoop.yarn.webapp.view.HtmlBlock.renderPartial(HtmlBlock.java:79)
	at org.apache.hadoop.yarn.webapp.View.render(View.java:235)
	at org.apache.hadoop.yarn.webapp.view.HtmlBlock$Block.subView(HtmlBlock.java:43)
	at org.apache.hadoop.yarn.webapp.hamlet.Hamlet._(Hamlet.java:30347)
	at org.apache.hadoop.yarn.server.resourcemanager.webapp.FairSchedulerPage$QueuesBlock.render(FairSchedulerPage.java:148)
	at org.apache.hadoop.yarn.webapp.view.HtmlBlock.render(HtmlBlock.java:69)
	at org.apache.hadoop.yarn.webapp.view.HtmlBlock.renderPartial(HtmlBlock.java:79)
	at org.apache.hadoop.yarn.webapp.View.render(View.java:235)
	at org.apache.hadoop.yarn.webapp.view.HtmlPage$Page.subView(HtmlPage.java:49)
	at org.apache.hadoop.yarn.webapp.hamlet.HamletImpl$EImp._v(HamletImpl.java:117)
	at org.apache.hadoop.yarn.webapp.hamlet.Hamlet$TD._(Hamlet.java:845)
	at org.apache.hadoop.yarn.webapp.view.TwoColumnLayout.render(TwoColumnLayout.java:56)
	at org.apache.hadoop.yarn.webapp.view.HtmlPage.render(HtmlPage.java:82)
	at org.apache.hadoop.yarn.server.resourcemanager.webapp.TestRMWebAppFairScheduler.testFairSchedulerWebAppPageInInconsistentState(TestRMWebAppFairScheduler.java:129)


FAILED:  org.apache.hadoop.yarn.server.resourcemanager.webapp.TestRMWebAppFairScheduler.testFairSchedulerWebAppPage

Error Message:
org.apache.hadoop.yarn.api.records.Resource.getResources()Ljava/util/Map;

Stack Trace:
java.lang.NoSuchMethodError: org.apache.hadoop.yarn.api.records.Resource.getResources()Ljava/util/Map;
	at org.apache.hadoop.yarn.server.resourcemanager.webapp.dao.ResourceInfo.<init>(ResourceInfo.java:47)
	at org.apache.hadoop.yarn.server.resourcemanager.webapp.dao.SchedulerInfo.<init>(SchedulerInfo.java:55)
	at org.apache.hadoop.yarn.server.resourcemanager.webapp.MetricsOverviewTable.render(MetricsOverviewTable.java:160)
	at org.apache.hadoop.yarn.webapp.view.HtmlBlock.render(HtmlBlock.java:69)
	at org.apache.hadoop.yarn.webapp.view.HtmlBlock.renderPartial(HtmlBlock.java:79)
	at org.apache.hadoop.yarn.webapp.View.render(View.java:235)
	at org.apache.hadoop.yarn.webapp.view.HtmlBlock$Block.subView(HtmlBlock.java:43)
	at org.apache.hadoop.yarn.webapp.hamlet.Hamlet._(Hamlet.java:30347)
	at org.apache.hadoop.yarn.server.resourcemanager.webapp.FairSchedulerPage$QueuesBlock.render(FairSchedulerPage.java:148)
	at org.apache.hadoop.yarn.webapp.view.HtmlBlock.render(HtmlBlock.java:69)
	at org.apache.hadoop.yarn.webapp.view.HtmlBlock.renderPartial(HtmlBlock.java:79)
	at org.apache.hadoop.yarn.webapp.View.render(View.java:235)
	at org.apache.hadoop.yarn.webapp.view.HtmlPage$Page.subView(HtmlPage.java:49)
	at org.apache.hadoop.yarn.webapp.hamlet.HamletImpl$EImp._v(HamletImpl.java:117)
	at org.apache.hadoop.yarn.webapp.hamlet.Hamlet$TD._(Hamlet.java:845)
	at org.apache.hadoop.yarn.webapp.view.TwoColumnLayout.render(TwoColumnLayout.java:56)
	at org.apache.hadoop.yarn.webapp.view.HtmlPage.render(HtmlPage.java:82)
	at org.apache.hadoop.yarn.server.resourcemanager.webapp.TestRMWebAppFairScheduler.testFairSchedulerWebAppPage(TestRMWebAppFairScheduler.java:87)


FAILED:  org.apache.hadoop.yarn.server.resourcemanager.webapp.TestRMWebServicesApps.testAppsQueryStartBeginEnd

Error Message:
expected:<application/json> but was:<text/html; charset=ISO-8859-1>

Stack Trace:
java.lang.AssertionError: expected:<application/json> but was:<text/html; charset=ISO-8859-1>
	at org.junit.Assert.fail(Assert.java:88)
	at org.junit.Assert.failNotEquals(Assert.java:743)
	at org.junit.Assert.assertEquals(Assert.java:118)
	at org.junit.Assert.assertEquals(Assert.java:144)
	at org.apache.hadoop.yarn.server.resourcemanager.webapp.TestRMWebServicesApps.testAppsQueryStartBeginEnd(TestRMWebServicesApps.java:683)


FAILED:  org.apache.hadoop.yarn.server.resourcemanager.webapp.TestRMWebServicesApps.testAppsQueryStartBeginSome

Error Message:
expected:<application/json> but was:<text/html; charset=ISO-8859-1>

Stack Trace:
java.lang.AssertionError: expected:<application/json> but was:<text/html; charset=ISO-8859-1>
	at org.junit.Assert.fail(Assert.java:88)
	at org.junit.Assert.failNotEquals(Assert.java:743)
	at org.junit.Assert.assertEquals(Assert.java:118)
	at org.junit.Assert.assertEquals(Assert.java:144)
	at org.apache.hadoop.yarn.server.resourcemanager.webapp.TestRMWebServicesApps.testAppsQueryStartBeginSome(TestRMWebServicesApps.java:637)


FAILED:  org.apache.hadoop.yarn.server.resourcemanager.webapp.TestRMWebServicesApps.testAppsSlash

Error Message:
expected:<application/json> but was:<text/html; charset=ISO-8859-1>

Stack Trace:
java.lang.AssertionError: expected:<application/json> but was:<text/html; charset=ISO-8859-1>
	at org.junit.Assert.fail(Assert.java:88)
	at org.junit.Assert.failNotEquals(Assert.java:743)
	at org.junit.Assert.assertEquals(Assert.java:118)
	at org.junit.Assert.assertEquals(Assert.java:144)
	at org.apache.hadoop.yarn.server.resourcemanager.webapp.TestRMWebServicesApps.testAppsHelper(TestRMWebServicesApps.java:206)
	at org.apache.hadoop.yarn.server.resourcemanager.webapp.TestRMWebServicesApps.testAppsSlash(TestRMWebServicesApps.java:134)


FAILED:  org.apache.hadoop.yarn.server.resourcemanager.webapp.TestRMWebServicesApps.testAppsQueryFinishBegin

Error Message:
expected:<application/json> but was:<text/html; charset=ISO-8859-1>

Stack Trace:
java.lang.AssertionError: expected:<application/json> but was:<text/html; charset=ISO-8859-1>
	at org.junit.Assert.fail(Assert.java:88)
	at org.junit.Assert.failNotEquals(Assert.java:743)
	at org.junit.Assert.assertEquals(Assert.java:118)
	at org.junit.Assert.assertEquals(Assert.java:144)
	at org.apache.hadoop.yarn.server.resourcemanager.webapp.TestRMWebServicesApps.testAppsQueryFinishBegin(TestRMWebServicesApps.java:715)


FAILED:  org.apache.hadoop.yarn.server.resourcemanager.webapp.TestRMWebServicesApps.testAppsQueryStates

Error Message:
expected:<application/json> but was:<text/html; charset=ISO-8859-1>

Stack Trace:
java.lang.AssertionError: expected:<application/json> but was:<text/html; charset=ISO-8859-1>
	at org.junit.Assert.fail(Assert.java:88)
	at org.junit.Assert.failNotEquals(Assert.java:743)
	at org.junit.Assert.assertEquals(Assert.java:118)
	at org.junit.Assert.assertEquals(Assert.java:144)
	at org.apache.hadoop.yarn.server.resourcemanager.webapp.TestRMWebServicesApps.testAppsQueryStates(TestRMWebServicesApps.java:256)


FAILED:  org.apache.hadoop.yarn.server.resourcemanager.webapp.TestRMWebServicesApps.testAppsXML

Error Message:
expected:<application/xml> but was:<text/html; charset=ISO-8859-1>

Stack Trace:
java.lang.AssertionError: expected:<application/xml> but was:<text/html; charset=ISO-8859-1>
	at org.junit.Assert.fail(Assert.java:88)
	at org.junit.Assert.failNotEquals(Assert.java:743)
	at org.junit.Assert.assertEquals(Assert.java:118)
	at org.junit.Assert.assertEquals(Assert.java:144)
	at org.apache.hadoop.yarn.server.resourcemanager.webapp.TestRMWebServicesApps.testAppsXML(TestRMWebServicesApps.java:158)


FAILED:  org.apache.hadoop.yarn.server.resourcemanager.webapp.TestRMWebServicesApps.testApps

Error Message:
expected:<application/json> but was:<text/html; charset=ISO-8859-1>

Stack Trace:
java.lang.AssertionError: expected:<application/json> but was:<text/html; charset=ISO-8859-1>
	at org.junit.Assert.fail(Assert.java:88)
	at org.junit.Assert.failNotEquals(Assert.java:743)
	at org.junit.Assert.assertEquals(Assert.java:118)
	at org.junit.Assert.assertEquals(Assert.java:144)
	at org.apache.hadoop.yarn.server.resourcemanager.webapp.TestRMWebServicesApps.testAppsHelper(TestRMWebServicesApps.java:206)
	at org.apache.hadoop.yarn.server.resourcemanager.webapp.TestRMWebServicesApps.testApps(TestRMWebServicesApps.java:124)


FAILED:  org.apache.hadoop.yarn.server.resourcemanager.webapp.TestRMWebServicesApps.testAppsQueryFinalStatusNone

Error Message:
expected:<application/json> but was:<text/html; charset=ISO-8859-1>

Stack Trace:
java.lang.AssertionError: expected:<application/json> but was:<text/html; charset=ISO-8859-1>
	at org.junit.Assert.fail(Assert.java:88)
	at org.junit.Assert.failNotEquals(Assert.java:743)
	at org.junit.Assert.assertEquals(Assert.java:118)
	at org.junit.Assert.assertEquals(Assert.java:144)
	at org.apache.hadoop.yarn.server.resourcemanager.webapp.TestRMWebServicesApps.testAppsQueryFinalStatusNone(TestRMWebServicesApps.java:484)


FAILED:  org.apache.hadoop.yarn.server.resourcemanager.webapp.TestRMWebServicesApps.testSingleAppsXML

Error Message:
expected:<application/xml> but was:<text/html; charset=ISO-8859-1>

Stack Trace:
java.lang.AssertionError: expected:<application/xml> but was:<text/html; charset=ISO-8859-1>
	at org.junit.Assert.fail(Assert.java:88)
	at org.junit.Assert.failNotEquals(Assert.java:743)
	at org.junit.Assert.assertEquals(Assert.java:118)
	at org.junit.Assert.assertEquals(Assert.java:144)
	at org.apache.hadoop.yarn.server.resourcemanager.webapp.TestRMWebServicesApps.testSingleAppsXML(TestRMWebServicesApps.java:1267)


FAILED:  org.apache.hadoop.yarn.server.resourcemanager.webapp.TestRMWebServicesApps.testSingleAppsSlash

Error Message:
expected:<application/json> but was:<text/html; charset=ISO-8859-1>

Stack Trace:
java.lang.AssertionError: expected:<application/json> but was:<text/html; charset=ISO-8859-1>
	at org.junit.Assert.fail(Assert.java:88)
	at org.junit.Assert.failNotEquals(Assert.java:743)
	at org.junit.Assert.assertEquals(Assert.java:118)
	at org.junit.Assert.assertEquals(Assert.java:144)
	at org.apache.hadoop.yarn.server.resourcemanager.webapp.TestRMWebServicesApps.testSingleAppsHelper(TestRMWebServicesApps.java:1250)
	at org.apache.hadoop.yarn.server.resourcemanager.webapp.TestRMWebServicesApps.testSingleAppsSlash(TestRMWebServicesApps.java:1157)


FAILED:  org.apache.hadoop.yarn.server.resourcemanager.webapp.TestRMWebServicesApps.testAppsQueryStartBegin

Error Message:
expected:<application/json> but was:<text/html; charset=ISO-8859-1>

Stack Trace:
java.lang.AssertionError: expected:<application/json> but was:<text/html; charset=ISO-8859-1>
	at org.junit.Assert.fail(Assert.java:88)
	at org.junit.Assert.failNotEquals(Assert.java:743)
	at org.junit.Assert.assertEquals(Assert.java:118)
	at org.junit.Assert.assertEquals(Assert.java:144)
	at org.apache.hadoop.yarn.server.resourcemanager.webapp.TestRMWebServicesApps.testAppsQueryStartBegin(TestRMWebServicesApps.java:614)


FAILED:  org.apache.hadoop.yarn.server.resourcemanager.webapp.TestRMWebServicesApps.testSingleApp

Error Message:
expected:<application/json> but was:<text/html; charset=ISO-8859-1>

Stack Trace:
java.lang.AssertionError: expected:<application/json> but was:<text/html; charset=ISO-8859-1>
	at org.junit.Assert.fail(Assert.java:88)
	at org.junit.Assert.failNotEquals(Assert.java:743)
	at org.junit.Assert.assertEquals(Assert.java:118)
	at org.junit.Assert.assertEquals(Assert.java:144)
	at org.apache.hadoop.yarn.server.resourcemanager.webapp.TestRMWebServicesApps.testSingleAppsHelper(TestRMWebServicesApps.java:1250)
	at org.apache.hadoop.yarn.server.resourcemanager.webapp.TestRMWebServicesApps.testSingleApp(TestRMWebServicesApps.java:1146)


FAILED:  org.apache.hadoop.yarn.server.resourcemanager.webapp.TestRMWebServicesApps.testAppsQueryStatesComma

Error Message:
expected:<application/json> but was:<text/html; charset=ISO-8859-1>

Stack Trace:
java.lang.AssertionError: expected:<application/json> but was:<text/html; charset=ISO-8859-1>
	at org.junit.Assert.fail(Assert.java:88)
	at org.junit.Assert.failNotEquals(Assert.java:743)
	at org.junit.Assert.assertEquals(Assert.java:118)
	at org.junit.Assert.assertEquals(Assert.java:144)
	at org.apache.hadoop.yarn.server.resourcemanager.webapp.TestRMWebServicesApps.testAppsQueryStatesComma(TestRMWebServicesApps.java:305)


FAILED:  org.apache.hadoop.yarn.server.resourcemanager.webapp.TestRMWebServicesApps.testAppsQueryFinalStatus

Error Message:
expected:<application/json> but was:<text/html; charset=ISO-8859-1>

Stack Trace:
java.lang.AssertionError: expected:<application/json> but was:<text/html; charset=ISO-8859-1>
	at org.junit.Assert.fail(Assert.java:88)
	at org.junit.Assert.failNotEquals(Assert.java:743)
	at org.junit.Assert.assertEquals(Assert.java:118)
	at org.junit.Assert.assertEquals(Assert.java:144)
	at org.apache.hadoop.yarn.server.resourcemanager.webapp.TestRMWebServicesApps.testAppsQueryFinalStatus(TestRMWebServicesApps.java:461)


FAILED:  org.apache.hadoop.yarn.server.resourcemanager.webapp.TestRMWebServicesApps.testAppsXMLMulti

Error Message:
expected:<application/xml> but was:<text/html; charset=ISO-8859-1>

Stack Trace:
java.lang.AssertionError: expected:<application/xml> but was:<text/html; charset=ISO-8859-1>
	at org.junit.Assert.fail(Assert.java:88)
	at org.junit.Assert.failNotEquals(Assert.java:743)
	at org.junit.Assert.assertEquals(Assert.java:118)
	at org.junit.Assert.assertEquals(Assert.java:144)
	at org.apache.hadoop.yarn.server.resourcemanager.webapp.TestRMWebServicesApps.testAppsXMLMulti(TestRMWebServicesApps.java:186)


FAILED:  org.apache.hadoop.yarn.server.resourcemanager.webapp.TestRMWebServicesApps.testAppsQueryUser

Error Message:
expected:<application/json> but was:<text/html; charset=ISO-8859-1>

Stack Trace:
java.lang.AssertionError: expected:<application/json> but was:<text/html; charset=ISO-8859-1>
	at org.junit.Assert.fail(Assert.java:88)
	at org.junit.Assert.failNotEquals(Assert.java:743)
	at org.junit.Assert.assertEquals(Assert.java:118)
	at org.junit.Assert.assertEquals(Assert.java:144)
	at org.apache.hadoop.yarn.server.resourcemanager.webapp.TestRMWebServicesApps.testAppsQueryUser(TestRMWebServicesApps.java:546)


FAILED:  org.apache.hadoop.yarn.server.resourcemanager.webapp.TestRMWebServicesApps.testAppsQueryFinishEnd

Error Message:
expected:<application/json> but was:<text/html; charset=ISO-8859-1>

Stack Trace:
java.lang.AssertionError: expected:<application/json> but was:<text/html; charset=ISO-8859-1>
	at org.junit.Assert.fail(Assert.java:88)
	at org.junit.Assert.failNotEquals(Assert.java:743)
	at org.junit.Assert.assertEquals(Assert.java:118)
	at org.junit.Assert.assertEquals(Assert.java:144)
	at org.apache.hadoop.yarn.server.resourcemanager.webapp.TestRMWebServicesApps.testAppsQueryFinishEnd(TestRMWebServicesApps.java:747)


FAILED:  org.apache.hadoop.yarn.server.resourcemanager.webapp.TestRMWebServicesApps.testAppsQueryLimit

Error Message:
expected:<application/json> but was:<text/html; charset=ISO-8859-1>

Stack Trace:
java.lang.AssertionError: expected:<application/json> but was:<text/html; charset=ISO-8859-1>
	at org.junit.Assert.fail(Assert.java:88)
	at org.junit.Assert.failNotEquals(Assert.java:743)
	at org.junit.Assert.assertEquals(Assert.java:118)
	at org.junit.Assert.assertEquals(Assert.java:144)
	at org.apache.hadoop.yarn.server.resourcemanager.webapp.TestRMWebServicesApps.testAppsQueryLimit(TestRMWebServicesApps.java:591)


FAILED:  org.apache.hadoop.yarn.server.resourcemanager.webapp.TestRMWebServicesApps.testAppsQueryQueue

Error Message:
expected:<application/json> but was:<text/html; charset=ISO-8859-1>

Stack Trace:
java.lang.AssertionError: expected:<application/json> but was:<text/html; charset=ISO-8859-1>
	at org.junit.Assert.fail(Assert.java:88)
	at org.junit.Assert.failNotEquals(Assert.java:743)
	at org.junit.Assert.assertEquals(Assert.java:118)
	at org.junit.Assert.assertEquals(Assert.java:144)
	at org.apache.hadoop.yarn.server.resourcemanager.webapp.TestRMWebServicesApps.testAppsQueryQueue(TestRMWebServicesApps.java:570)


FAILED:  org.apache.hadoop.yarn.server.resourcemanager.webapp.TestRMWebServicesApps.testAppsQueryState

Error Message:
expected:<application/json> but was:<text/html; charset=ISO-8859-1>

Stack Trace:
java.lang.AssertionError: expected:<application/json> but was:<text/html; charset=ISO-8859-1>
	at org.junit.Assert.fail(Assert.java:88)
	at org.junit.Assert.failNotEquals(Assert.java:743)
	at org.junit.Assert.assertEquals(Assert.java:118)
	at org.junit.Assert.assertEquals(Assert.java:144)
	at org.apache.hadoop.yarn.server.resourcemanager.webapp.TestRMWebServicesApps.testAppsQueryState(TestRMWebServicesApps.java:229)


FAILED:  org.apache.hadoop.yarn.server.resourcemanager.webapp.TestRMWebServicesApps.testSingleAppsDefault

Error Message:
expected:<application/json> but was:<text/html; charset=ISO-8859-1>

Stack Trace:
java.lang.AssertionError: expected:<application/json> but was:<text/html; charset=ISO-8859-1>
	at org.junit.Assert.fail(Assert.java:88)
	at org.junit.Assert.failNotEquals(Assert.java:743)
	at org.junit.Assert.assertEquals(Assert.java:118)
	at org.junit.Assert.assertEquals(Assert.java:144)
	at org.apache.hadoop.yarn.server.resourcemanager.webapp.TestRMWebServicesApps.testSingleAppsHelper(TestRMWebServicesApps.java:1250)
	at org.apache.hadoop.yarn.server.resourcemanager.webapp.TestRMWebServicesApps.testSingleAppsDefault(TestRMWebServicesApps.java:1168)


FAILED:  org.apache.hadoop.yarn.server.resourcemanager.webapp.TestRMWebServicesApps.testAppsQueryAppTypes

Error Message:
expected:<application/json> but was:<text/html; charset=ISO-8859-1>

Stack Trace:
java.lang.AssertionError: expected:<application/json> but was:<text/html; charset=ISO-8859-1>
	at org.junit.Assert.fail(Assert.java:88)
	at org.junit.Assert.failNotEquals(Assert.java:743)
	at org.junit.Assert.assertEquals(Assert.java:118)
	at org.junit.Assert.assertEquals(Assert.java:144)
	at org.apache.hadoop.yarn.server.resourcemanager.webapp.TestRMWebServicesApps.testAppsQueryAppTypes(TestRMWebServicesApps.java:816)


FAILED:  org.apache.hadoop.yarn.server.resourcemanager.webapp.TestRMWebServicesApps.testAppsQueryFinalStatusInvalid

Error Message:
expected:<Bad Request> but was:<Internal Server Error>

Stack Trace:
java.lang.AssertionError: expected:<Bad Request> but was:<Internal Server Error>
	at org.junit.Assert.fail(Assert.java:88)
	at org.junit.Assert.failNotEquals(Assert.java:743)
	at org.junit.Assert.assertEquals(Assert.java:118)
	at org.junit.Assert.assertEquals(Assert.java:144)
	at org.apache.hadoop.yarn.server.resourcemanager.webapp.TestRMWebServicesApps.testAppsQueryFinalStatusInvalid(TestRMWebServicesApps.java:506)


FAILED:  org.apache.hadoop.yarn.server.resourcemanager.webapp.TestRMWebServicesApps.testAppsDefault

Error Message:
expected:<application/json> but was:<text/html; charset=ISO-8859-1>

Stack Trace:
java.lang.AssertionError: expected:<application/json> but was:<text/html; charset=ISO-8859-1>
	at org.junit.Assert.fail(Assert.java:88)
	at org.junit.Assert.failNotEquals(Assert.java:743)
	at org.junit.Assert.assertEquals(Assert.java:118)
	at org.junit.Assert.assertEquals(Assert.java:144)
	at org.apache.hadoop.yarn.server.resourcemanager.webapp.TestRMWebServicesApps.testAppsHelper(TestRMWebServicesApps.java:206)
	at org.apache.hadoop.yarn.server.resourcemanager.webapp.TestRMWebServicesApps.testAppsDefault(TestRMWebServicesApps.java:144)


FAILED:  org.apache.hadoop.yarn.server.resourcemanager.webapp.TestRMWebServicesApps.testAppsQueryFinishBeginEnd

Error Message:
expected:<application/json> but was:<text/html; charset=ISO-8859-1>

Stack Trace:
java.lang.AssertionError: expected:<application/json> but was:<text/html; charset=ISO-8859-1>
	at org.junit.Assert.fail(Assert.java:88)
	at org.junit.Assert.failNotEquals(Assert.java:743)
	at org.junit.Assert.assertEquals(Assert.java:118)
	at org.junit.Assert.assertEquals(Assert.java:144)
	at org.apache.hadoop.yarn.server.resourcemanager.webapp.TestRMWebServicesApps.testAppsQueryFinishBeginEnd(TestRMWebServicesApps.java:782)


FAILED:  org.apache.hadoop.yarn.server.resourcemanager.webapp.TestRMWebServicesAppsModification.testGetNewApplication[1]

Error Message:
expected:<OK> but was:<Internal Server Error>

Stack Trace:
java.lang.AssertionError: expected:<OK> but was:<Internal Server Error>
	at org.junit.Assert.fail(Assert.java:88)
	at org.junit.Assert.failNotEquals(Assert.java:743)
	at org.junit.Assert.assertEquals(Assert.java:118)
	at org.junit.Assert.assertEquals(Assert.java:144)
	at org.apache.hadoop.yarn.server.resourcemanager.webapp.TestRMWebServicesAppsModification.validateResponseStatus(TestRMWebServicesAppsModification.java:628)
	at org.apache.hadoop.yarn.server.resourcemanager.webapp.TestRMWebServicesAppsModification.validateResponseStatus(TestRMWebServicesAppsModification.java:606)
	at org.apache.hadoop.yarn.server.resourcemanager.webapp.TestRMWebServicesAppsModification.testGetNewApplication(TestRMWebServicesAppsModification.java:650)
	at org.apache.hadoop.yarn.server.resourcemanager.webapp.TestRMWebServicesAppsModification.testGetNewApplication(TestRMWebServicesAppsModification.java:640)


FAILED:  org.apache.hadoop.yarn.server.resourcemanager.webapp.TestRMWebServicesAppsModification.testGetNewApplicationAndSubmit[1]

Error Message:
expected:<OK> but was:<Internal Server Error>

Stack Trace:
java.lang.AssertionError: expected:<OK> but was:<Internal Server Error>
	at org.junit.Assert.fail(Assert.java:88)
	at org.junit.Assert.failNotEquals(Assert.java:743)
	at org.junit.Assert.assertEquals(Assert.java:118)
	at org.junit.Assert.assertEquals(Assert.java:144)
	at org.apache.hadoop.yarn.server.resourcemanager.webapp.TestRMWebServicesAppsModification.validateResponseStatus(TestRMWebServicesAppsModification.java:628)
	at org.apache.hadoop.yarn.server.resourcemanager.webapp.TestRMWebServicesAppsModification.validateResponseStatus(TestRMWebServicesAppsModification.java:606)
	at org.apache.hadoop.yarn.server.resourcemanager.webapp.TestRMWebServicesAppsModification.testGetNewApplication(TestRMWebServicesAppsModification.java:650)
	at org.apache.hadoop.yarn.server.resourcemanager.webapp.TestRMWebServicesAppsModification.testAppSubmit(TestRMWebServicesAppsModification.java:741)
	at org.apache.hadoop.yarn.server.resourcemanager.webapp.TestRMWebServicesAppsModification.testGetNewApplicationAndSubmit(TestRMWebServicesAppsModification.java:722)


FAILED:  org.apache.hadoop.yarn.server.resourcemanager.webapp.TestRMWebServicesAppsModification.testGetNewApplication[3]

Error Message:
expected:<OK> but was:<Internal Server Error>

Stack Trace:
java.lang.AssertionError: expected:<OK> but was:<Internal Server Error>
	at org.junit.Assert.fail(Assert.java:88)
	at org.junit.Assert.failNotEquals(Assert.java:743)
	at org.junit.Assert.assertEquals(Assert.java:118)
	at org.junit.Assert.assertEquals(Assert.java:144)
	at org.apache.hadoop.yarn.server.resourcemanager.webapp.TestRMWebServicesAppsModification.validateResponseStatus(TestRMWebServicesAppsModification.java:628)
	at org.apache.hadoop.yarn.server.resourcemanager.webapp.TestRMWebServicesAppsModification.validateResponseStatus(TestRMWebServicesAppsModification.java:606)
	at org.apache.hadoop.yarn.server.resourcemanager.webapp.TestRMWebServicesAppsModification.testGetNewApplication(TestRMWebServicesAppsModification.java:650)
	at org.apache.hadoop.yarn.server.resourcemanager.webapp.TestRMWebServicesAppsModification.testGetNewApplication(TestRMWebServicesAppsModification.java:640)


FAILED:  org.apache.hadoop.yarn.server.resourcemanager.webapp.TestRMWebServicesAppsModification.testGetNewApplicationAndSubmit[3]

Error Message:
expected:<OK> but was:<Internal Server Error>

Stack Trace:
java.lang.AssertionError: expected:<OK> but was:<Internal Server Error>
	at org.junit.Assert.fail(Assert.java:88)
	at org.junit.Assert.failNotEquals(Assert.java:743)
	at org.junit.Assert.assertEquals(Assert.java:118)
	at org.junit.Assert.assertEquals(Assert.java:144)
	at org.apache.hadoop.yarn.server.resourcemanager.webapp.TestRMWebServicesAppsModification.validateResponseStatus(TestRMWebServicesAppsModification.java:628)
	at org.apache.hadoop.yarn.server.resourcemanager.webapp.TestRMWebServicesAppsModification.validateResponseStatus(TestRMWebServicesAppsModification.java:606)
	at org.apache.hadoop.yarn.server.resourcemanager.webapp.TestRMWebServicesAppsModification.testGetNewApplication(TestRMWebServicesAppsModification.java:650)
	at org.apache.hadoop.yarn.server.resourcemanager.webapp.TestRMWebServicesAppsModification.testAppSubmit(TestRMWebServicesAppsModification.java:741)
	at org.apache.hadoop.yarn.server.resourcemanager.webapp.TestRMWebServicesAppsModification.testGetNewApplicationAndSubmit(TestRMWebServicesAppsModification.java:722)


FAILED:  org.apache.hadoop.yarn.server.resourcemanager.webapp.TestRMWebServicesCapacitySched.testPerUserResourcesXML

Error Message:
expected:<application/xml> but was:<text/html; charset=ISO-8859-1>

Stack Trace:
java.lang.AssertionError: expected:<application/xml> but was:<text/html; charset=ISO-8859-1>
	at org.junit.Assert.fail(Assert.java:88)
	at org.junit.Assert.failNotEquals(Assert.java:743)
	at org.junit.Assert.assertEquals(Assert.java:118)
	at org.junit.Assert.assertEquals(Assert.java:144)
	at org.apache.hadoop.yarn.server.resourcemanager.webapp.TestRMWebServicesCapacitySched.testPerUserResourcesXML(TestRMWebServicesCapacitySched.java:482)


FAILED:  org.apache.hadoop.yarn.server.resourcemanager.webapp.TestRMWebServicesCapacitySched.testClusterSchedulerXML

Error Message:
expected:<application/xml> but was:<text/html; charset=ISO-8859-1>

Stack Trace:
java.lang.AssertionError: expected:<application/xml> but was:<text/html; charset=ISO-8859-1>
	at org.junit.Assert.fail(Assert.java:88)
	at org.junit.Assert.failNotEquals(Assert.java:743)
	at org.junit.Assert.assertEquals(Assert.java:118)
	at org.junit.Assert.assertEquals(Assert.java:144)
	at org.apache.hadoop.yarn.server.resourcemanager.webapp.TestRMWebServicesCapacitySched.testClusterSchedulerXML(TestRMWebServicesCapacitySched.java:210)


FAILED:  org.apache.hadoop.yarn.server.resourcemanager.webapp.TestRMWebServicesCapacitySched.testClusterScheduler

Error Message:
expected:<application/json> but was:<text/html; charset=ISO-8859-1>

Stack Trace:
java.lang.AssertionError: expected:<application/json> but was:<text/html; charset=ISO-8859-1>
	at org.junit.Assert.fail(Assert.java:88)
	at org.junit.Assert.failNotEquals(Assert.java:743)
	at org.junit.Assert.assertEquals(Assert.java:118)
	at org.junit.Assert.assertEquals(Assert.java:144)
	at org.apache.hadoop.yarn.server.resourcemanager.webapp.TestRMWebServicesCapacitySched.testClusterScheduler(TestRMWebServicesCapacitySched.java:178)


FAILED:  org.apache.hadoop.yarn.server.resourcemanager.webapp.TestRMWebServicesCapacitySched.testResourceInfo

Error Message:
expected:<<memory:10, vCores:1[, yarn.io/vcores: 1, yarn.io/memory: 10M]>> but was:<<memory:10, vCores:1[]>>

Stack Trace:
org.junit.ComparisonFailure: expected:<<memory:10, vCores:1[, yarn.io/vcores: 1, yarn.io/memory: 10M]>> but was:<<memory:10, vCores:1[]>>
	at org.junit.Assert.assertEquals(Assert.java:115)
	at org.junit.Assert.assertEquals(Assert.java:144)
	at org.apache.hadoop.yarn.server.resourcemanager.webapp.TestRMWebServicesCapacitySched.testResourceInfo(TestRMWebServicesCapacitySched.java:600)


FAILED:  org.apache.hadoop.yarn.server.resourcemanager.webapp.TestRMWebServicesCapacitySched.testPerUserResourcesJSON

Error Message:
expected:<application/json> but was:<text/html; charset=ISO-8859-1>

Stack Trace:
java.lang.AssertionError: expected:<application/json> but was:<text/html; charset=ISO-8859-1>
	at org.junit.Assert.fail(Assert.java:88)
	at org.junit.Assert.failNotEquals(Assert.java:743)
	at org.junit.Assert.assertEquals(Assert.java:118)
	at org.junit.Assert.assertEquals(Assert.java:144)
	at org.apache.hadoop.yarn.server.resourcemanager.webapp.TestRMWebServicesCapacitySched.testPerUserResourcesJSON(TestRMWebServicesCapacitySched.java:563)


FAILED:  org.apache.hadoop.yarn.server.resourcemanager.webapp.TestRMWebServicesCapacitySched.testClusterSchedulerDefault

Error Message:
expected:<application/json> but was:<text/html; charset=ISO-8859-1>

Stack Trace:
java.lang.AssertionError: expected:<application/json> but was:<text/html; charset=ISO-8859-1>
	at org.junit.Assert.fail(Assert.java:88)
	at org.junit.Assert.failNotEquals(Assert.java:743)
	at org.junit.Assert.assertEquals(Assert.java:118)
	at org.junit.Assert.assertEquals(Assert.java:144)
	at org.apache.hadoop.yarn.server.resourcemanager.webapp.TestRMWebServicesCapacitySched.testClusterSchedulerDefault(TestRMWebServicesCapacitySched.java:199)


FAILED:  org.apache.hadoop.yarn.server.resourcemanager.webapp.TestRMWebServicesCapacitySched.testClusterSchedulerSlash

Error Message:
expected:<application/json> but was:<text/html; charset=ISO-8859-1>

Stack Trace:
java.lang.AssertionError: expected:<application/json> but was:<text/html; charset=ISO-8859-1>
	at org.junit.Assert.fail(Assert.java:88)
	at org.junit.Assert.failNotEquals(Assert.java:743)
	at org.junit.Assert.assertEquals(Assert.java:118)
	at org.junit.Assert.assertEquals(Assert.java:144)
	at org.apache.hadoop.yarn.server.resourcemanager.webapp.TestRMWebServicesCapacitySched.testClusterSchedulerSlash(TestRMWebServicesCapacitySched.java:189)


FAILED:  org.apache.hadoop.yarn.server.resourcemanager.webapp.TestRMWebServicesFairScheduler.testClusterScheduler

Error Message:
expected:<application/json> but was:<text/html; charset=ISO-8859-1>

Stack Trace:
java.lang.AssertionError: expected:<application/json> but was:<text/html; charset=ISO-8859-1>
	at org.junit.Assert.fail(Assert.java:88)
	at org.junit.Assert.failNotEquals(Assert.java:743)
	at org.junit.Assert.assertEquals(Assert.java:118)
	at org.junit.Assert.assertEquals(Assert.java:144)
	at org.apache.hadoop.yarn.server.resourcemanager.webapp.TestRMWebServicesFairScheduler.testClusterScheduler(TestRMWebServicesFairScheduler.java:89)


FAILED:  org.apache.hadoop.yarn.server.resourcemanager.webapp.TestRMWebServicesFairScheduler.testClusterSchedulerWithSubQueues

Error Message:
expected:<application/json> but was:<text/html; charset=ISO-8859-1>

Stack Trace:
java.lang.AssertionError: expected:<application/json> but was:<text/html; charset=ISO-8859-1>
	at org.junit.Assert.fail(Assert.java:88)
	at org.junit.Assert.failNotEquals(Assert.java:743)
	at org.junit.Assert.assertEquals(Assert.java:118)
	at org.junit.Assert.assertEquals(Assert.java:144)
	at org.apache.hadoop.yarn.server.resourcemanager.webapp.TestRMWebServicesFairScheduler.testClusterSchedulerWithSubQueues(TestRMWebServicesFairScheduler.java:118)


FAILED:  org.apache.hadoop.yarn.server.resourcemanager.webapp.TestRMWebServicesFairScheduler.testClusterSchedulerSlash

Error Message:
expected:<application/json> but was:<text/html; charset=ISO-8859-1>

Stack Trace:
java.lang.AssertionError: expected:<application/json> but was:<text/html; charset=ISO-8859-1>
	at org.junit.Assert.fail(Assert.java:88)
	at org.junit.Assert.failNotEquals(Assert.java:743)
	at org.junit.Assert.assertEquals(Assert.java:118)
	at org.junit.Assert.assertEquals(Assert.java:144)
	at org.apache.hadoop.yarn.server.resourcemanager.webapp.TestRMWebServicesFairScheduler.testClusterSchedulerSlash(TestRMWebServicesFairScheduler.java:100)


FAILED:  org.apache.hadoop.yarn.server.resourcemanager.webapp.TestRMWebappAuthentication.testSimpleAuth[0]

Error Message:
Fetching url failed

Stack Trace:
java.lang.AssertionError: Fetching url failed
	at org.junit.Assert.fail(Assert.java:88)
	at org.apache.hadoop.yarn.server.resourcemanager.webapp.TestRMWebappAuthentication.testSimpleAuth(TestRMWebappAuthentication.java:157)


FAILED:  org.apache.hadoop.yarn.server.resourcemanager.webapp.TestRMWebappAuthentication.testSimpleAuth[1]

Error Message:
Error starting http server

Stack Trace:
org.apache.hadoop.yarn.webapp.WebAppException: Error starting http server
	at sun.nio.ch.Net.bind0(Native Method)
	at sun.nio.ch.Net.bind(Net.java:444)
	at sun.nio.ch.Net.bind(Net.java:436)
	at sun.nio.ch.ServerSocketChannelImpl.bind(ServerSocketChannelImpl.java:214)
	at sun.nio.ch.ServerSocketAdaptor.bind(ServerSocketAdaptor.java:74)
	at org.mortbay.jetty.nio.SelectChannelConnector.open(SelectChannelConnector.java:216)
	at org.apache.hadoop.http.HttpServer2.openListeners(HttpServer2.java:882)
	at org.apache.hadoop.http.HttpServer2.start(HttpServer2.java:824)
	at org.apache.hadoop.yarn.webapp.WebApps$Builder.start(WebApps.java:274)
	at org.apache.hadoop.yarn.server.resourcemanager.ResourceManager.startWepApp(ResourceManager.java:944)
	at org.apache.hadoop.yarn.server.resourcemanager.MockRM.startWepApp(MockRM.java:713)
	at org.apache.hadoop.yarn.server.resourcemanager.ResourceManager.serviceStart(ResourceManager.java:1044)
	at org.apache.hadoop.service.AbstractService.start(AbstractService.java:193)
	at org.apache.hadoop.yarn.server.resourcemanager.webapp.TestRMWebappAuthentication.testSimpleAuth(TestRMWebappAuthentication.java:147)


FAILED:  org.apache.hadoop.yarn.server.resourcemanager.webapp.dao.TestFairSchedulerQueueInfo.testEmptyChildQueues

Error Message:
org.apache.hadoop.yarn.api.records.Resource.getResources()Ljava/util/Map;

Stack Trace:
java.lang.NoSuchMethodError: org.apache.hadoop.yarn.api.records.Resource.getResources()Ljava/util/Map;
	at org.apache.hadoop.yarn.server.resourcemanager.webapp.dao.ResourceInfo.<init>(ResourceInfo.java:47)
	at org.apache.hadoop.yarn.server.resourcemanager.webapp.dao.FairSchedulerQueueInfo.<init>(FairSchedulerQueueInfo.java:75)
	at org.apache.hadoop.yarn.server.resourcemanager.webapp.dao.TestFairSchedulerQueueInfo.testEmptyChildQueues(TestFairSchedulerQueueInfo.java:52)



Mime
  • Unnamed multipart/mixed (inline, None, 0 bytes)
View raw message