hadoop-yarn-dev mailing list archives

Site index · List index
Message view « Date » · « Thread »
Top « Date » · « Thread »
From Apache Jenkins Server <jenk...@builds.apache.org>
Subject Failed: YARN-4103 PreCommit Build #8976
Date Wed, 02 Sep 2015 16:22:14 GMT
Jira: https://issues.apache.org/jira/browse/YARN-4103
Build: https://builds.apache.org/job/PreCommit-YARN-Build/8976/

###################################################################################
########################## LAST 60 LINES OF THE CONSOLE ###########################
[...truncated 295 lines...]
|      |                     |            | whitespace.
|  +1  |            install  |  1m 31s    | mvn install still works. 
|  +1  |    eclipse:eclipse  |  0m 32s    | The patch built with 
|      |                     |            | eclipse:eclipse.
|  +1  |           findbugs  |  1m 28s    | The patch does not introduce any 
|      |                     |            | new Findbugs (version 3.0.0)
|      |                     |            | warnings.
|  -1  |         yarn tests  |  54m 19s   | Tests failed in 
|      |                     |            | hadoop-yarn-server-resourcemanager.
|      |                     |  93m 50s   | 


             Reason | Tests
 Failed unit tests  |  hadoop.yarn.server.resourcemanager.scheduler.fair.TestAllocationFileLoaderService

                    |  hadoop.yarn.server.resourcemanager.webapp.TestRMWebServicesApps 


|| Subsystem || Report/Notes ||
============================================================================
| Patch URL | http://issues.apache.org/jira/secure/attachment/12753780/YARN-4103.2.patch |
| Optional Tests | javadoc javac unit findbugs checkstyle |
| git revision | trunk / 7d6687f |
| Pre-patch Findbugs warnings | /home/jenkins/jenkins-slave/workspace/PreCommit-YARN-Build@2/patchprocess/trunkFindbugsWarningshadoop-yarn-server-resourcemanager.html
|
| hadoop-yarn-server-resourcemanager test log | /home/jenkins/jenkins-slave/workspace/PreCommit-YARN-Build@2/patchprocess/testrun_hadoop-yarn-server-resourcemanager.txt
|
| Test Results | https://builds.apache.org/job/PreCommit-YARN-Build/8976/testReport/ |
| Java | 1.7.0_55 |
| uname | Linux asf905.gq1.ygridcore.net 3.13.0-36-lowlatency #63-Ubuntu SMP PREEMPT Wed Sep
3 21:56:12 UTC 2014 x86_64 x86_64 x86_64 GNU/Linux |


============================================================================
============================================================================
                          Adding comment to JIRA
============================================================================
============================================================================


Comment added.
10a617d536db92cc1c01021375637f22767927c4 logged out


============================================================================
============================================================================
                              Finished build.
============================================================================
============================================================================


Build step 'Execute shell' marked build as failure
Archiving artifacts
Sending artifact delta relative to PreCommit-YARN-Build #8944
Archived 29 artifacts
Archive block size is 32768
Received 8 blocks and 13224351 bytes
Compression is 1.9%
Took 2.9 sec
[description-setter] Could not determine description.
Recording test results
Email was triggered for: Failure
Sending email for trigger: Failure



###################################################################################
############################## FAILED TESTS (if any) ##############################
6 tests failed.
REGRESSION:  org.apache.hadoop.yarn.server.resourcemanager.scheduler.fair.TestAllocationFileLoaderService.testGetAllocationFileFromClasspath

Error Message:
null

Stack Trace:
java.lang.AssertionError: null
	at org.junit.Assert.fail(Assert.java:86)
	at org.junit.Assert.assertTrue(Assert.java:41)
	at org.junit.Assert.assertTrue(Assert.java:52)
	at org.apache.hadoop.yarn.server.resourcemanager.scheduler.fair.TestAllocationFileLoaderService.testGetAllocationFileFromClasspath(TestAllocationFileLoaderService.java:54)


REGRESSION:  org.apache.hadoop.yarn.server.resourcemanager.webapp.TestRMWebServicesApps.testAppAttemptsSlash

Error Message:
logsLink doesn't match

Stack Trace:
java.lang.AssertionError: logsLink doesn't match
	at org.junit.Assert.fail(Assert.java:88)
	at org.junit.Assert.assertTrue(Assert.java:41)
	at org.apache.hadoop.yarn.server.resourcemanager.webapp.TestRMWebServicesApps.verifyAppAttemptInfoGeneric(TestRMWebServicesApps.java:1638)
	at org.apache.hadoop.yarn.server.resourcemanager.webapp.TestRMWebServicesApps.verifyAppAttemptsInfo(TestRMWebServicesApps.java:1617)
	at org.apache.hadoop.yarn.server.resourcemanager.webapp.TestRMWebServicesApps.testAppAttemptsHelper(TestRMWebServicesApps.java:1561)
	at org.apache.hadoop.yarn.server.resourcemanager.webapp.TestRMWebServicesApps.testAppAttemptsSlash(TestRMWebServicesApps.java:1453)


REGRESSION:  org.apache.hadoop.yarn.server.resourcemanager.webapp.TestRMWebServicesApps.testAppAttemtpsDefault

Error Message:
logsLink doesn't match

Stack Trace:
java.lang.AssertionError: logsLink doesn't match
	at org.junit.Assert.fail(Assert.java:88)
	at org.junit.Assert.assertTrue(Assert.java:41)
	at org.apache.hadoop.yarn.server.resourcemanager.webapp.TestRMWebServicesApps.verifyAppAttemptInfoGeneric(TestRMWebServicesApps.java:1638)
	at org.apache.hadoop.yarn.server.resourcemanager.webapp.TestRMWebServicesApps.verifyAppAttemptsInfo(TestRMWebServicesApps.java:1617)
	at org.apache.hadoop.yarn.server.resourcemanager.webapp.TestRMWebServicesApps.testAppAttemptsHelper(TestRMWebServicesApps.java:1561)
	at org.apache.hadoop.yarn.server.resourcemanager.webapp.TestRMWebServicesApps.testAppAttemtpsDefault(TestRMWebServicesApps.java:1464)


REGRESSION:  org.apache.hadoop.yarn.server.resourcemanager.webapp.TestRMWebServicesApps.testAppAttemptsXML

Error Message:
logsLink doesn't match

Stack Trace:
java.lang.AssertionError: logsLink doesn't match
	at org.junit.Assert.fail(Assert.java:88)
	at org.junit.Assert.assertTrue(Assert.java:41)
	at org.apache.hadoop.yarn.server.resourcemanager.webapp.TestRMWebServicesApps.verifyAppAttemptInfoGeneric(TestRMWebServicesApps.java:1638)
	at org.apache.hadoop.yarn.server.resourcemanager.webapp.TestRMWebServicesApps.verifyAppAttemptsXML(TestRMWebServicesApps.java:1601)
	at org.apache.hadoop.yarn.server.resourcemanager.webapp.TestRMWebServicesApps.testAppAttemptsXML(TestRMWebServicesApps.java:1590)


REGRESSION:  org.apache.hadoop.yarn.server.resourcemanager.webapp.TestRMWebServicesApps.testAppAttempts

Error Message:
logsLink doesn't match

Stack Trace:
java.lang.AssertionError: logsLink doesn't match
	at org.junit.Assert.fail(Assert.java:88)
	at org.junit.Assert.assertTrue(Assert.java:41)
	at org.apache.hadoop.yarn.server.resourcemanager.webapp.TestRMWebServicesApps.verifyAppAttemptInfoGeneric(TestRMWebServicesApps.java:1638)
	at org.apache.hadoop.yarn.server.resourcemanager.webapp.TestRMWebServicesApps.verifyAppAttemptsInfo(TestRMWebServicesApps.java:1617)
	at org.apache.hadoop.yarn.server.resourcemanager.webapp.TestRMWebServicesApps.testAppAttemptsHelper(TestRMWebServicesApps.java:1561)
	at org.apache.hadoop.yarn.server.resourcemanager.webapp.TestRMWebServicesApps.testAppAttempts(TestRMWebServicesApps.java:1411)


REGRESSION:  org.apache.hadoop.yarn.server.resourcemanager.webapp.TestRMWebServicesApps.testMultipleAppAttempts

Error Message:
logsLink doesn't match

Stack Trace:
java.lang.AssertionError: logsLink doesn't match
	at org.junit.Assert.fail(Assert.java:88)
	at org.junit.Assert.assertTrue(Assert.java:41)
	at org.apache.hadoop.yarn.server.resourcemanager.webapp.TestRMWebServicesApps.verifyAppAttemptInfoGeneric(TestRMWebServicesApps.java:1638)
	at org.apache.hadoop.yarn.server.resourcemanager.webapp.TestRMWebServicesApps.verifyAppAttemptsInfo(TestRMWebServicesApps.java:1617)
	at org.apache.hadoop.yarn.server.resourcemanager.webapp.TestRMWebServicesApps.testAppAttemptsHelper(TestRMWebServicesApps.java:1561)
	at org.apache.hadoop.yarn.server.resourcemanager.webapp.TestRMWebServicesApps.testMultipleAppAttempts(TestRMWebServicesApps.java:1442)



Mime
  • Unnamed multipart/mixed (inline, None, 0 bytes)
View raw message