hadoop-yarn-dev mailing list archives

Site index · List index
Message view « Date » · « Thread »
Top « Date » · « Thread »
From Apache Jenkins Server <jenk...@builds.apache.org>
Subject Build failed in Jenkins: Hadoop-Yarn-trunk #1128
Date Tue, 15 Sep 2015 18:15:29 GMT
See <https://builds.apache.org/job/Hadoop-Yarn-trunk/1128/changes>

Changes:

[vinayakumarb] HDFS-9067. o.a.h.hdfs.server.datanode.fsdataset.impl.TestLazyWriter is failing
in trunk (Contributed by Surendra Singh Lilhore)

[junping_du] YARN-313. Add Admin API for supporting node resource configuration in command
line. (Contributed by Inigo Goiri, Kenji Kikushima and Junping Du)

[mingma] HDFS-9008. Balancer#Parameters class could use a builder pattern. (Chris Trezzo via
mingma)

[cnauroth] HADOOP-12413. AccessControlList should avoid calling getGroupNames in isUserInList
with empty groups. Contributed by Zhihai Xu.

------------------------------------------
[...truncated 8248 lines...]
	at com.sun.org.apache.xerces.internal.jaxp.DocumentBuilderImpl.parse(DocumentBuilderImpl.java:347)
	at javax.xml.parsers.DocumentBuilder.parse(DocumentBuilder.java:150)
	at org.apache.hadoop.conf.Configuration.parse(Configuration.java:2546)
	at org.apache.hadoop.conf.Configuration.parse(Configuration.java:2534)
	at org.apache.hadoop.conf.Configuration.loadResource(Configuration.java:2605)
	at org.apache.hadoop.conf.Configuration.loadResources(Configuration.java:2558)
	at org.apache.hadoop.conf.Configuration.getProps(Configuration.java:2469)
	at org.apache.hadoop.conf.Configuration.get(Configuration.java:1043)
	at org.apache.hadoop.conf.Configuration.getTrimmed(Configuration.java:1093)
	at org.apache.hadoop.conf.Configuration.getInt(Configuration.java:1313)
	at org.apache.hadoop.yarn.server.security.BaseContainerTokenSecretManager.<init>(BaseContainerTokenSecretManager.java:62)
	at org.apache.hadoop.yarn.server.nodemanager.security.NMContainerTokenSecretManager.<init>(NMContainerTokenSecretManager.java:66)
	at org.apache.hadoop.yarn.server.nodemanager.security.NMContainerTokenSecretManager.<init>(NMContainerTokenSecretManager.java:61)
	at org.apache.hadoop.yarn.server.nodemanager.containermanager.BaseContainerManagerTest.<init>(BaseContainerManagerTest.java:108)
	at org.apache.hadoop.yarn.server.nodemanager.containermanager.logaggregation.TestLogAggregationService.<init>(TestLogAggregationService.java:152)

testFailedDirsLocalFileDeletionAfterUpload(org.apache.hadoop.yarn.server.nodemanager.containermanager.logaggregation.TestLogAggregationService)
 Time elapsed: 0.001 sec  <<< ERROR!
java.lang.RuntimeException: java.util.zip.ZipException: invalid block type
	at java.util.zip.InflaterInputStream.read(InflaterInputStream.java:164)
	at java.util.zip.InflaterInputStream.read(InflaterInputStream.java:122)
	at java.io.FilterInputStream.read(FilterInputStream.java:83)
	at com.sun.org.apache.xerces.internal.impl.XMLEntityManager$RewindableInputStream.read(XMLEntityManager.java:2873)
	at com.sun.org.apache.xerces.internal.impl.XMLEntityManager.setupCurrentEntity(XMLEntityManager.java:664)
	at com.sun.org.apache.xerces.internal.impl.XMLVersionDetector.determineDocVersion(XMLVersionDetector.java:189)
	at com.sun.org.apache.xerces.internal.parsers.XML11Configuration.parse(XML11Configuration.java:812)
	at com.sun.org.apache.xerces.internal.parsers.XML11Configuration.parse(XML11Configuration.java:777)
	at com.sun.org.apache.xerces.internal.parsers.XMLParser.parse(XMLParser.java:141)
	at com.sun.org.apache.xerces.internal.parsers.DOMParser.parse(DOMParser.java:243)
	at com.sun.org.apache.xerces.internal.jaxp.DocumentBuilderImpl.parse(DocumentBuilderImpl.java:347)
	at javax.xml.parsers.DocumentBuilder.parse(DocumentBuilder.java:150)
	at org.apache.hadoop.conf.Configuration.parse(Configuration.java:2546)
	at org.apache.hadoop.conf.Configuration.parse(Configuration.java:2534)
	at org.apache.hadoop.conf.Configuration.loadResource(Configuration.java:2605)
	at org.apache.hadoop.conf.Configuration.loadResources(Configuration.java:2558)
	at org.apache.hadoop.conf.Configuration.getProps(Configuration.java:2469)
	at org.apache.hadoop.conf.Configuration.get(Configuration.java:1043)
	at org.apache.hadoop.conf.Configuration.getTrimmed(Configuration.java:1093)
	at org.apache.hadoop.conf.Configuration.getInt(Configuration.java:1313)
	at org.apache.hadoop.yarn.server.security.BaseContainerTokenSecretManager.<init>(BaseContainerTokenSecretManager.java:62)
	at org.apache.hadoop.yarn.server.nodemanager.security.NMContainerTokenSecretManager.<init>(NMContainerTokenSecretManager.java:66)
	at org.apache.hadoop.yarn.server.nodemanager.security.NMContainerTokenSecretManager.<init>(NMContainerTokenSecretManager.java:61)
	at org.apache.hadoop.yarn.server.nodemanager.containermanager.BaseContainerManagerTest.<init>(BaseContainerManagerTest.java:108)
	at org.apache.hadoop.yarn.server.nodemanager.containermanager.logaggregation.TestLogAggregationService.<init>(TestLogAggregationService.java:152)

testNoLogsUploadedOnAppFinish(org.apache.hadoop.yarn.server.nodemanager.containermanager.logaggregation.TestLogAggregationService)
 Time elapsed: 0 sec  <<< ERROR!
java.lang.RuntimeException: java.util.zip.ZipException: invalid block type
	at java.util.zip.InflaterInputStream.read(InflaterInputStream.java:164)
	at java.util.zip.InflaterInputStream.read(InflaterInputStream.java:122)
	at java.io.FilterInputStream.read(FilterInputStream.java:83)
	at com.sun.org.apache.xerces.internal.impl.XMLEntityManager$RewindableInputStream.read(XMLEntityManager.java:2873)
	at com.sun.org.apache.xerces.internal.impl.XMLEntityManager.setupCurrentEntity(XMLEntityManager.java:664)
	at com.sun.org.apache.xerces.internal.impl.XMLVersionDetector.determineDocVersion(XMLVersionDetector.java:189)
	at com.sun.org.apache.xerces.internal.parsers.XML11Configuration.parse(XML11Configuration.java:812)
	at com.sun.org.apache.xerces.internal.parsers.XML11Configuration.parse(XML11Configuration.java:777)
	at com.sun.org.apache.xerces.internal.parsers.XMLParser.parse(XMLParser.java:141)
	at com.sun.org.apache.xerces.internal.parsers.DOMParser.parse(DOMParser.java:243)
	at com.sun.org.apache.xerces.internal.jaxp.DocumentBuilderImpl.parse(DocumentBuilderImpl.java:347)
	at javax.xml.parsers.DocumentBuilder.parse(DocumentBuilder.java:150)
	at org.apache.hadoop.conf.Configuration.parse(Configuration.java:2546)
	at org.apache.hadoop.conf.Configuration.parse(Configuration.java:2534)
	at org.apache.hadoop.conf.Configuration.loadResource(Configuration.java:2605)
	at org.apache.hadoop.conf.Configuration.loadResources(Configuration.java:2558)
	at org.apache.hadoop.conf.Configuration.getProps(Configuration.java:2469)
	at org.apache.hadoop.conf.Configuration.get(Configuration.java:1043)
	at org.apache.hadoop.conf.Configuration.getTrimmed(Configuration.java:1093)
	at org.apache.hadoop.conf.Configuration.getInt(Configuration.java:1313)
	at org.apache.hadoop.yarn.server.security.BaseContainerTokenSecretManager.<init>(BaseContainerTokenSecretManager.java:62)
	at org.apache.hadoop.yarn.server.nodemanager.security.NMContainerTokenSecretManager.<init>(NMContainerTokenSecretManager.java:66)
	at org.apache.hadoop.yarn.server.nodemanager.security.NMContainerTokenSecretManager.<init>(NMContainerTokenSecretManager.java:61)
	at org.apache.hadoop.yarn.server.nodemanager.containermanager.BaseContainerManagerTest.<init>(BaseContainerManagerTest.java:108)
	at org.apache.hadoop.yarn.server.nodemanager.containermanager.logaggregation.TestLogAggregationService.<init>(TestLogAggregationService.java:152)

#
# A fatal error has been detected by the Java Runtime Environment:
#
#  SIGSEGV (0xb) at pc=0x00007fc339ebbfbc, pid=20352, tid=140476124010240
#
# JRE version: Java(TM) SE Runtime Environment (7.0_55-b13) (build 1.7.0_55-b13)
# Java VM: Java HotSpot(TM) 64-Bit Server VM (24.55-b03 mixed mode linux-amd64 compressed
oops)
# Problematic frame:
# C  [libc.so.6+0x150fbc]  __nss_hosts_lookup+0x19d3c
#
# Failed to write core dump. Core dumps have been disabled. To enable core dumping, try "ulimit
-c unlimited" before starting Java again
#
# An error report file with more information is saved as:
# <https://builds.apache.org/job/Hadoop-Yarn-trunk/ws/hadoop-yarn-project/hadoop-yarn/hadoop-yarn-server/hadoop-yarn-server-nodemanager/hs_err_pid20352.log>
#
# If you would like to submit a bug report, please visit:
#   http://bugreport.sun.com/bugreport/crash.jsp
# The crash happened outside the Java Virtual Machine in native code.
# See problematic frame for where to report the bug.
#
Aborted
Running org.apache.hadoop.yarn.server.nodemanager.containermanager.linux.privileged.TestPrivilegedOperationExecutor
Tests run: 4, Failures: 0, Errors: 0, Skipped: 0, Time elapsed: 0.705 sec - in org.apache.hadoop.yarn.server.nodemanager.containermanager.linux.privileged.TestPrivilegedOperationExecutor
Running org.apache.hadoop.yarn.server.nodemanager.containermanager.linux.runtime.TestDockerContainerRuntime
Tests run: 2, Failures: 0, Errors: 0, Skipped: 0, Time elapsed: 0.758 sec - in org.apache.hadoop.yarn.server.nodemanager.containermanager.linux.runtime.TestDockerContainerRuntime
Running org.apache.hadoop.yarn.server.nodemanager.containermanager.linux.resources.TestTrafficController
Tests run: 5, Failures: 0, Errors: 0, Skipped: 0, Time elapsed: 1.024 sec - in org.apache.hadoop.yarn.server.nodemanager.containermanager.linux.resources.TestTrafficController
Running org.apache.hadoop.yarn.server.nodemanager.containermanager.linux.resources.TestCGroupsBlkioResourceHandlerImpl
Tests run: 5, Failures: 0, Errors: 0, Skipped: 0, Time elapsed: 0.466 sec - in org.apache.hadoop.yarn.server.nodemanager.containermanager.linux.resources.TestCGroupsBlkioResourceHandlerImpl
Running org.apache.hadoop.yarn.server.nodemanager.containermanager.linux.resources.TestTrafficControlBandwidthHandlerImpl
Tests run: 2, Failures: 0, Errors: 0, Skipped: 0, Time elapsed: 0.926 sec - in org.apache.hadoop.yarn.server.nodemanager.containermanager.linux.resources.TestTrafficControlBandwidthHandlerImpl
Running org.apache.hadoop.yarn.server.nodemanager.containermanager.linux.resources.TestResourceHandlerModule
Tests run: 2, Failures: 0, Errors: 0, Skipped: 0, Time elapsed: 0.702 sec - in org.apache.hadoop.yarn.server.nodemanager.containermanager.linux.resources.TestResourceHandlerModule
Running org.apache.hadoop.yarn.server.nodemanager.containermanager.linux.resources.TestCGroupsHandlerImpl
Tests run: 4, Failures: 0, Errors: 0, Skipped: 0, Time elapsed: 0.965 sec - in org.apache.hadoop.yarn.server.nodemanager.containermanager.linux.resources.TestCGroupsHandlerImpl
Running org.apache.hadoop.yarn.server.nodemanager.containermanager.TestAuxServices
Tests run: 6, Failures: 0, Errors: 0, Skipped: 0, Time elapsed: 1.107 sec - in org.apache.hadoop.yarn.server.nodemanager.containermanager.TestAuxServices
Running org.apache.hadoop.yarn.server.nodemanager.containermanager.TestContainerManagerRecovery
Tests run: 2, Failures: 0, Errors: 0, Skipped: 0, Time elapsed: 10.247 sec - in org.apache.hadoop.yarn.server.nodemanager.containermanager.TestContainerManagerRecovery
Running org.apache.hadoop.yarn.server.nodemanager.containermanager.TestContainerManager
Tests run: 11, Failures: 0, Errors: 0, Skipped: 0, Time elapsed: 25.567 sec - in org.apache.hadoop.yarn.server.nodemanager.containermanager.TestContainerManager
Running org.apache.hadoop.yarn.server.nodemanager.containermanager.application.TestApplication
Tests run: 8, Failures: 0, Errors: 0, Skipped: 0, Time elapsed: 5.591 sec - in org.apache.hadoop.yarn.server.nodemanager.containermanager.application.TestApplication
Running org.apache.hadoop.yarn.server.nodemanager.containermanager.TestNMProxy
Tests run: 2, Failures: 0, Errors: 0, Skipped: 0, Time elapsed: 4.258 sec - in org.apache.hadoop.yarn.server.nodemanager.containermanager.TestNMProxy
Running org.apache.hadoop.yarn.server.nodemanager.containermanager.monitor.TestContainerMetrics
Tests run: 2, Failures: 0, Errors: 0, Skipped: 0, Time elapsed: 0.934 sec - in org.apache.hadoop.yarn.server.nodemanager.containermanager.monitor.TestContainerMetrics
Running org.apache.hadoop.yarn.server.nodemanager.containermanager.monitor.TestContainersMonitor
Tests run: 3, Failures: 0, Errors: 0, Skipped: 0, Time elapsed: 7.392 sec - in org.apache.hadoop.yarn.server.nodemanager.containermanager.monitor.TestContainersMonitor
Running org.apache.hadoop.yarn.server.nodemanager.containermanager.launcher.TestContainerLaunch
Tests run: 17, Failures: 0, Errors: 0, Skipped: 5, Time elapsed: 20.716 sec - in org.apache.hadoop.yarn.server.nodemanager.containermanager.launcher.TestContainerLaunch
Running org.apache.hadoop.yarn.server.nodemanager.containermanager.loghandler.TestNonAggregatingLogHandler
Tests run: 6, Failures: 0, Errors: 0, Skipped: 0, Time elapsed: 1.723 sec - in org.apache.hadoop.yarn.server.nodemanager.containermanager.loghandler.TestNonAggregatingLogHandler
Running org.apache.hadoop.yarn.server.nodemanager.containermanager.container.TestContainer
Tests run: 18, Failures: 0, Errors: 0, Skipped: 0, Time elapsed: 2.295 sec - in org.apache.hadoop.yarn.server.nodemanager.containermanager.container.TestContainer
Running org.apache.hadoop.yarn.server.nodemanager.containermanager.localizer.TestLocalCacheDirectoryManager
Tests run: 5, Failures: 0, Errors: 0, Skipped: 0, Time elapsed: 1.651 sec - in org.apache.hadoop.yarn.server.nodemanager.containermanager.localizer.TestLocalCacheDirectoryManager
Running org.apache.hadoop.yarn.server.nodemanager.containermanager.localizer.TestResourceLocalizationService
Tests run: 13, Failures: 0, Errors: 0, Skipped: 0, Time elapsed: 6.422 sec - in org.apache.hadoop.yarn.server.nodemanager.containermanager.localizer.TestResourceLocalizationService
Running org.apache.hadoop.yarn.server.nodemanager.containermanager.localizer.TestLocalResourcesTrackerImpl
Tests run: 9, Failures: 0, Errors: 0, Skipped: 0, Time elapsed: 1.49 sec - in org.apache.hadoop.yarn.server.nodemanager.containermanager.localizer.TestLocalResourcesTrackerImpl
Running org.apache.hadoop.yarn.server.nodemanager.containermanager.localizer.TestLocalizedResource
Tests run: 1, Failures: 0, Errors: 0, Skipped: 0, Time elapsed: 0.65 sec - in org.apache.hadoop.yarn.server.nodemanager.containermanager.localizer.TestLocalizedResource
Running org.apache.hadoop.yarn.server.nodemanager.containermanager.localizer.sharedcache.TestSharedCacheUploadService
Tests run: 2, Failures: 0, Errors: 0, Skipped: 0, Time elapsed: 0.967 sec - in org.apache.hadoop.yarn.server.nodemanager.containermanager.localizer.sharedcache.TestSharedCacheUploadService
Running org.apache.hadoop.yarn.server.nodemanager.containermanager.localizer.sharedcache.TestSharedCacheUploader
Tests run: 6, Failures: 0, Errors: 0, Skipped: 0, Time elapsed: 1.175 sec - in org.apache.hadoop.yarn.server.nodemanager.containermanager.localizer.sharedcache.TestSharedCacheUploader
Running org.apache.hadoop.yarn.server.nodemanager.containermanager.localizer.TestContainerLocalizer
Tests run: 3, Failures: 0, Errors: 0, Skipped: 0, Time elapsed: 1.558 sec - in org.apache.hadoop.yarn.server.nodemanager.containermanager.localizer.TestContainerLocalizer
Running org.apache.hadoop.yarn.server.nodemanager.containermanager.localizer.TestLocalResource
Tests run: 2, Failures: 0, Errors: 0, Skipped: 0, Time elapsed: 0.419 sec - in org.apache.hadoop.yarn.server.nodemanager.containermanager.localizer.TestLocalResource
Running org.apache.hadoop.yarn.server.nodemanager.containermanager.localizer.TestResourceRetention
Tests run: 1, Failures: 0, Errors: 0, Skipped: 0, Time elapsed: 0.942 sec - in org.apache.hadoop.yarn.server.nodemanager.containermanager.localizer.TestResourceRetention
Running org.apache.hadoop.yarn.server.nodemanager.TestNodeStatusUpdater
Tests run: 15, Failures: 0, Errors: 0, Skipped: 0, Time elapsed: 65.783 sec - in org.apache.hadoop.yarn.server.nodemanager.TestNodeStatusUpdater
Running org.apache.hadoop.yarn.server.nodemanager.TestDefaultContainerExecutor
Tests run: 3, Failures: 0, Errors: 0, Skipped: 0, Time elapsed: 11.847 sec - in org.apache.hadoop.yarn.server.nodemanager.TestDefaultContainerExecutor
Running org.apache.hadoop.yarn.server.nodemanager.amrmproxy.TestAMRMProxyService
Tests run: 16, Failures: 0, Errors: 0, Skipped: 0, Time elapsed: 2.185 sec - in org.apache.hadoop.yarn.server.nodemanager.amrmproxy.TestAMRMProxyService
Running org.apache.hadoop.yarn.server.nodemanager.TestNodeResourceMonitor
Tests run: 1, Failures: 0, Errors: 0, Skipped: 0, Time elapsed: 1.483 sec - in org.apache.hadoop.yarn.server.nodemanager.TestNodeResourceMonitor
Running org.apache.hadoop.yarn.server.nodemanager.recovery.TestNMLeveldbStateStoreService
Tests run: 12, Failures: 0, Errors: 0, Skipped: 0, Time elapsed: 8.192 sec - in org.apache.hadoop.yarn.server.nodemanager.recovery.TestNMLeveldbStateStoreService
Running org.apache.hadoop.yarn.server.nodemanager.util.TestCgroupsLCEResourcesHandler
Tests run: 5, Failures: 0, Errors: 0, Skipped: 0, Time elapsed: 1.391 sec - in org.apache.hadoop.yarn.server.nodemanager.util.TestCgroupsLCEResourcesHandler
Running org.apache.hadoop.yarn.server.nodemanager.util.TestProcessIdFileReader
Tests run: 3, Failures: 0, Errors: 0, Skipped: 0, Time elapsed: 0.213 sec - in org.apache.hadoop.yarn.server.nodemanager.util.TestProcessIdFileReader
Running org.apache.hadoop.yarn.server.nodemanager.util.TestNodeManagerHardwareUtils
Tests run: 3, Failures: 0, Errors: 0, Skipped: 0, Time elapsed: 0.879 sec - in org.apache.hadoop.yarn.server.nodemanager.util.TestNodeManagerHardwareUtils
Running org.apache.hadoop.yarn.server.nodemanager.TestDirectoryCollection
Tests run: 7, Failures: 0, Errors: 0, Skipped: 0, Time elapsed: 0.925 sec - in org.apache.hadoop.yarn.server.nodemanager.TestDirectoryCollection
Running org.apache.hadoop.yarn.server.nodemanager.TestDeletionService
Tests run: 6, Failures: 0, Errors: 0, Skipped: 0, Time elapsed: 23.176 sec - in org.apache.hadoop.yarn.server.nodemanager.TestDeletionService
Running org.apache.hadoop.yarn.server.nodemanager.TestDockerContainerExecutorWithMocks
Tests run: 4, Failures: 0, Errors: 0, Skipped: 0, Time elapsed: 1.315 sec - in org.apache.hadoop.yarn.server.nodemanager.TestDockerContainerExecutorWithMocks
Running org.apache.hadoop.yarn.server.nodemanager.TestNodeManagerShutdown
Tests run: 2, Failures: 0, Errors: 0, Skipped: 0, Time elapsed: 6.432 sec - in org.apache.hadoop.yarn.server.nodemanager.TestNodeManagerShutdown

Results :

Tests in error: 
  TestLogAggregationService.tearDown:173->BaseContainerManagerTest.tearDown:258->BaseContainerManagerTest.createContainerExecutor:149
» Runtime
  TestLogAggregationService.<init>:152->BaseContainerManagerTest.<init>:108
» Runtime
  TestLogAggregationService.<init>:152->BaseContainerManagerTest.<init>:108
» Runtime
  TestLogAggregationService.<init>:152->BaseContainerManagerTest.<init>:108
» Runtime
  TestLogAggregationService.<init>:152->BaseContainerManagerTest.<init>:108
» Runtime
  TestLogAggregationService.<init>:152->BaseContainerManagerTest.<init>:108
» Runtime
  TestLogAggregationService.<init>:152->BaseContainerManagerTest.<init>:108
» Runtime
  TestLogAggregationService.<init>:152->BaseContainerManagerTest.<init>:108
» Runtime
  TestLogAggregationService.<init>:152->BaseContainerManagerTest.<init>:108
» Runtime
  TestLogAggregationService.<init>:152->BaseContainerManagerTest.<init>:108
» Runtime
  TestLogAggregationService.<init>:152->BaseContainerManagerTest.<init>:108
» Runtime
  TestLogAggregationService.<init>:152->BaseContainerManagerTest.<init>:108
» Runtime
  TestLogAggregationService.<init>:152->BaseContainerManagerTest.<init>:108
» Runtime
  TestLogAggregationService.<init>:152->BaseContainerManagerTest.<init>:108
» Runtime
  TestLogAggregationService.<init>:152->BaseContainerManagerTest.<init>:108
» Runtime
  TestLogAggregationService.<init>:152->BaseContainerManagerTest.<init>:108
» Runtime
  TestLogAggregationService.<init>:152->BaseContainerManagerTest.<init>:108
» Runtime
  TestLogAggregationService.<init>:152->BaseContainerManagerTest.<init>:108
» Runtime
  TestLogAggregationService.<init>:152->BaseContainerManagerTest.<init>:108
» Runtime
  TestLogAggregationService.<init>:152->BaseContainerManagerTest.<init>:108
» Runtime
  TestLogAggregationService.<init>:152->BaseContainerManagerTest.<init>:108
» Runtime
  TestLogAggregationService.<init>:152->BaseContainerManagerTest.<init>:108
» Runtime
  TestLogAggregationService.<init>:152->BaseContainerManagerTest.<init>:108
» Runtime
  TestLogAggregationService.<init>:152->BaseContainerManagerTest.<init>:108
» Runtime
  TestLogAggregationService.<init>:152->BaseContainerManagerTest.<init>:108
» Runtime
  TestLogAggregationService.<init>:152->BaseContainerManagerTest.<init>:108
» Runtime
  TestLogAggregationService.<init>:152->BaseContainerManagerTest.<init>:108
» Runtime
  TestLogAggregationService.<init>:152->BaseContainerManagerTest.<init>:108
» Runtime

Tests run: 366, Failures: 0, Errors: 28, Skipped: 17

[INFO] ------------------------------------------------------------------------
[INFO] Reactor Summary:
[INFO] 
[INFO] Apache Hadoop YARN ................................ SUCCESS [  3.242 s]
[INFO] Apache Hadoop YARN API ............................ SUCCESS [03:56 min]
[INFO] Apache Hadoop YARN Common ......................... SUCCESS [02:58 min]
[INFO] Apache Hadoop YARN Server ......................... SUCCESS [  0.092 s]
[INFO] Apache Hadoop YARN Server Common .................. SUCCESS [ 46.697 s]
[INFO] Apache Hadoop YARN NodeManager .................... FAILURE [05:51 min]
[INFO] Apache Hadoop YARN Web Proxy ...................... SKIPPED
[INFO] Apache Hadoop YARN ApplicationHistoryService ...... SKIPPED
[INFO] Apache Hadoop YARN ResourceManager ................ SKIPPED
[INFO] Apache Hadoop YARN Server Tests ................... SKIPPED
[INFO] Apache Hadoop YARN Client ......................... SKIPPED
[INFO] Apache Hadoop YARN SharedCacheManager ............. SKIPPED
[INFO] Apache Hadoop YARN Applications ................... SKIPPED
[INFO] Apache Hadoop YARN DistributedShell ............... SKIPPED
[INFO] Apache Hadoop YARN Unmanaged Am Launcher .......... SKIPPED
[INFO] Apache Hadoop YARN Site ........................... SKIPPED
[INFO] Apache Hadoop YARN Registry ....................... SKIPPED
[INFO] Apache Hadoop YARN Project ........................ SKIPPED
[INFO] ------------------------------------------------------------------------
[INFO] BUILD FAILURE
[INFO] ------------------------------------------------------------------------
[INFO] Total time: 13:38 min
[INFO] Finished at: 2015-09-15T18:15:25+00:00
[INFO] Final Memory: 74M/987M
[INFO] ------------------------------------------------------------------------
[ERROR] Failed to execute goal org.apache.maven.plugins:maven-surefire-plugin:2.17:test (default-test)
on project hadoop-yarn-server-nodemanager: ExecutionException: org.apache.maven.surefire.booter.SurefireBooterForkException:
Error occurred in starting fork, check output in log -> [Help 1]
[ERROR] 
[ERROR] To see the full stack trace of the errors, re-run Maven with the -e switch.
[ERROR] Re-run Maven using the -X switch to enable full debug logging.
[ERROR] 
[ERROR] For more information about the errors and possible solutions, please read the following
articles:
[ERROR] [Help 1] http://cwiki.apache.org/confluence/display/MAVEN/MojoFailureException
[ERROR] 
[ERROR] After correcting the problems, you can resume the build with the command
[ERROR]   mvn <goals> -rf :hadoop-yarn-server-nodemanager
Build step 'Execute shell' marked build as failure
Archiving artifacts
Recording test results
Updating HADOOP-12413
Updating YARN-313
Updating HDFS-9008
Updating HDFS-9067

Mime
View raw message