hadoop-yarn-dev mailing list archives

Site index · List index
Message view « Date » · « Thread »
Top « Date » · « Thread »
From Apache Jenkins Server <jenk...@builds.apache.org>
Subject Failed: YARN-3717 PreCommit Build #8909
Date Tue, 25 Aug 2015 20:40:26 GMT
Jira: https://issues.apache.org/jira/browse/YARN-3717
Build: https://builds.apache.org/job/PreCommit-YARN-Build/8909/

###################################################################################
########################## LAST 60 LINES OF THE CONSOLE ###########################
[...truncated 504 lines...]
|      |                     |            | hadoop-yarn-server-resourcemanager.
|      |                     |  121m 41s  | 


             Reason | Tests
          FindBugs  |  module:hadoop-yarn-server-common 
 Failed unit tests  |  hadoop.yarn.server.resourcemanager.rmapp.TestRMAppTransitions 
                    |  hadoop.yarn.server.resourcemanager.webapp.TestRMWebAppFairScheduler

                    |  hadoop.yarn.server.resourcemanager.webapp.TestRMWebServicesApps 


|| Subsystem || Report/Notes ||
============================================================================
| Patch URL | http://issues.apache.org/jira/secure/attachment/12752284/YARN-3717.20150825-1.patch
|
| Optional Tests | javadoc javac unit findbugs checkstyle site |
| git revision | trunk / eee0d45 |
| checkstyle |  /home/jenkins/jenkins-slave/workspace/PreCommit-YARN-Build/patchprocess/diffcheckstylehadoop-yarn-api.txt
|
| Findbugs warnings | /home/jenkins/jenkins-slave/workspace/PreCommit-YARN-Build/patchprocess/newPatchFindbugsWarningshadoop-yarn-server-common.html
|
| hadoop-yarn-api test log | /home/jenkins/jenkins-slave/workspace/PreCommit-YARN-Build/patchprocess/testrun_hadoop-yarn-api.txt
|
| hadoop-yarn-client test log | /home/jenkins/jenkins-slave/workspace/PreCommit-YARN-Build/patchprocess/testrun_hadoop-yarn-client.txt
|
| hadoop-yarn-common test log | /home/jenkins/jenkins-slave/workspace/PreCommit-YARN-Build/patchprocess/testrun_hadoop-yarn-common.txt
|
| hadoop-yarn-server-applicationhistoryservice test log | /home/jenkins/jenkins-slave/workspace/PreCommit-YARN-Build/patchprocess/testrun_hadoop-yarn-server-applicationhistoryservice.txt
|
| hadoop-yarn-server-common test log | /home/jenkins/jenkins-slave/workspace/PreCommit-YARN-Build/patchprocess/testrun_hadoop-yarn-server-common.txt
|
| hadoop-yarn-server-resourcemanager test log | /home/jenkins/jenkins-slave/workspace/PreCommit-YARN-Build/patchprocess/testrun_hadoop-yarn-server-resourcemanager.txt
|
| Test Results | https://builds.apache.org/job/PreCommit-YARN-Build/8909/testReport/ |
| Java | 1.7.0_55 |
| uname | Linux asf905.gq1.ygridcore.net 3.13.0-36-lowlatency #63-Ubuntu SMP PREEMPT Wed Sep
3 21:56:12 UTC 2014 x86_64 x86_64 x86_64 GNU/Linux |


============================================================================
============================================================================
                          Adding comment to JIRA
============================================================================
============================================================================


Comment added.
2f6b5eb833091dbc12c7cd3a78bde945f0490164 logged out


============================================================================
============================================================================
                              Finished build.
============================================================================
============================================================================


Build step 'Execute shell' marked build as failure
Archiving artifacts
Sending artifact delta relative to PreCommit-YARN-Build #8899
Archived 92 artifacts
Archive block size is 32768
Received 203 blocks and 23600518 bytes
Compression is 22.0%
Took 5.1 sec
[description-setter] Could not determine description.
Recording test results
Email was triggered for: Failure
Sending email for trigger: Failure



###################################################################################
############################## FAILED TESTS (if any) ##############################
11 tests failed.
REGRESSION:  org.apache.hadoop.yarn.server.resourcemanager.rmapp.TestRMAppTransitions.testGetAppReport[0]

Error Message:
null

Stack Trace:
java.lang.NullPointerException: null
	at org.apache.hadoop.yarn.server.resourcemanager.rmapp.RMAppImpl.getAmNodeLabelExpression(RMAppImpl.java:1681)
	at org.apache.hadoop.yarn.server.resourcemanager.rmapp.RMAppImpl.createAndGetApplicationReport(RMAppImpl.java:671)
	at org.apache.hadoop.yarn.server.resourcemanager.rmapp.TestRMAppTransitions.testGetAppReport(TestRMAppTransitions.java:1010)


REGRESSION:  org.apache.hadoop.yarn.server.resourcemanager.rmapp.TestRMAppTransitions.testGetAppReport[1]

Error Message:
null

Stack Trace:
java.lang.NullPointerException: null
	at org.apache.hadoop.yarn.server.resourcemanager.rmapp.RMAppImpl.getAmNodeLabelExpression(RMAppImpl.java:1681)
	at org.apache.hadoop.yarn.server.resourcemanager.rmapp.RMAppImpl.createAndGetApplicationReport(RMAppImpl.java:671)
	at org.apache.hadoop.yarn.server.resourcemanager.rmapp.TestRMAppTransitions.testGetAppReport(TestRMAppTransitions.java:1010)


REGRESSION:  org.apache.hadoop.yarn.server.resourcemanager.webapp.TestRMWebAppFairScheduler.testFairSchedulerWebAppPageInInconsistentState

Error Message:
Failed to render FairSchedulerPage: java.lang.NullPointerException
 at org.apache.hadoop.yarn.server.resourcemanager.rmapp.MockRMApp.getAmNodeLabelExpression(MockRMApp.java:289)
 at org.apache.hadoop.yarn.server.resourcemanager.webapp.dao.AppInfo.<init>(AppInfo.java:201)
 at org.apache.hadoop.yarn.server.resourcemanager.webapp.FairSchedulerAppsBlock.render(FairSchedulerAppsBlock.java:115)
 at org.apache.hadoop.yarn.webapp.view.HtmlBlock.render(HtmlBlock.java:69)
 at org.apache.hadoop.yarn.webapp.view.HtmlBlock.renderPartial(HtmlBlock.java:79)
 at org.apache.hadoop.yarn.webapp.View.render(View.java:235)
 at org.apache.hadoop.yarn.webapp.view.HtmlBlock$Block.subView(HtmlBlock.java:43)
 at org.apache.hadoop.yarn.webapp.hamlet.Hamlet._(Hamlet.java:30347)
 at org.apache.hadoop.yarn.server.resourcemanager.webapp.FairSchedulerPage$QueuesBlock.render(FairSchedulerPage.java:193)
 at org.apache.hadoop.yarn.webapp.view.HtmlBlock.render(HtmlBlock.java:69)
 at org.apache.hadoop.yarn.webapp.view.HtmlBlock.renderPartial(HtmlBlock.java:79)
 at org.apache.hadoop.yarn.webapp.View.render(View.java:235)
 at org.apache.hadoop.yarn.webapp.view.HtmlPage$Page.subView(HtmlPage.java:49)
 at org.apache.hadoop.yarn.webapp.hamlet.HamletImpl$EImp._v(HamletImpl.java:117)
 at org.apache.hadoop.yarn.webapp.hamlet.Hamlet$TD._(Hamlet.java:845)
 at org.apache.hadoop.yarn.webapp.view.TwoColumnLayout.render(TwoColumnLayout.java:56)
 at org.apache.hadoop.yarn.webapp.view.HtmlPage.render(HtmlPage.java:82)
 at org.apache.hadoop.yarn.server.resourcemanager.webapp.TestRMWebAppFairScheduler.testFairSchedulerWebAppPageInInconsistentState(TestRMWebAppFairScheduler.java:129)
 at sun.reflect.NativeMethodAccessorImpl.invoke0(Native Method)
 at sun.reflect.NativeMethodAccessorImpl.invoke(NativeMethodAccessorImpl.java:57)
 at sun.reflect.DelegatingMethodAccessorImpl.invoke(DelegatingMethodAccessorImpl.java:43)
 at java.lang.reflect.Method.invoke(Method.java:606)
 at org.junit.runners.model.FrameworkMethod$1.runReflectiveCall(FrameworkMethod.java:47)
 at org.junit.internal.runners.model.ReflectiveCallable.run(ReflectiveCallable.java:12)
 at org.junit.runners.model.FrameworkMethod.invokeExplosively(FrameworkMethod.java:44)
 at org.junit.internal.runners.statements.InvokeMethod.evaluate(InvokeMethod.java:17)
 at org.junit.runners.ParentRunner.runLeaf(ParentRunner.java:271)
 at org.junit.runners.BlockJUnit4ClassRunner.runChild(BlockJUnit4ClassRunner.java:70)
 at org.junit.runners.BlockJUnit4ClassRunner.runChild(BlockJUnit4ClassRunner.java:50)
 at org.junit.runners.ParentRunner$3.run(ParentRunner.java:238)
 at org.junit.runners.ParentRunner$1.schedule(ParentRunner.java:63)
 at org.junit.runners.ParentRunner.runChildren(ParentRunner.java:236)
 at org.junit.runners.ParentRunner.access$000(ParentRunner.java:53)
 at org.junit.runners.ParentRunner$2.evaluate(ParentRunner.java:229)
 at org.junit.runners.ParentRunner.run(ParentRunner.java:309)
 at org.apache.maven.surefire.junit4.JUnit4Provider.execute(JUnit4Provider.java:264)
 at org.apache.maven.surefire.junit4.JUnit4Provider.executeTestSet(JUnit4Provider.java:153)
 at org.apache.maven.surefire.junit4.JUnit4Provider.invoke(JUnit4Provider.java:124)
 at org.apache.maven.surefire.booter.ForkedBooter.invokeProviderInSameClassLoader(ForkedBooter.java:200)
 at org.apache.maven.surefire.booter.ForkedBooter.runSuitesInProcess(ForkedBooter.java:153)
 at org.apache.maven.surefire.booter.ForkedBooter.main(ForkedBooter.java:103)


Stack Trace:
java.lang.AssertionError: Failed to render FairSchedulerPage: java.lang.NullPointerException
	at org.apache.hadoop.yarn.server.resourcemanager.rmapp.MockRMApp.getAmNodeLabelExpression(MockRMApp.java:289)
	at org.apache.hadoop.yarn.server.resourcemanager.webapp.dao.AppInfo.<init>(AppInfo.java:201)
	at org.apache.hadoop.yarn.server.resourcemanager.webapp.FairSchedulerAppsBlock.render(FairSchedulerAppsBlock.java:115)
	at org.apache.hadoop.yarn.webapp.view.HtmlBlock.render(HtmlBlock.java:69)
	at org.apache.hadoop.yarn.webapp.view.HtmlBlock.renderPartial(HtmlBlock.java:79)
	at org.apache.hadoop.yarn.webapp.View.render(View.java:235)
	at org.apache.hadoop.yarn.webapp.view.HtmlBlock$Block.subView(HtmlBlock.java:43)
	at org.apache.hadoop.yarn.webapp.hamlet.Hamlet._(Hamlet.java:30347)
	at org.apache.hadoop.yarn.server.resourcemanager.webapp.FairSchedulerPage$QueuesBlock.render(FairSchedulerPage.java:193)
	at org.apache.hadoop.yarn.webapp.view.HtmlBlock.render(HtmlBlock.java:69)
	at org.apache.hadoop.yarn.webapp.view.HtmlBlock.renderPartial(HtmlBlock.java:79)
	at org.apache.hadoop.yarn.webapp.View.render(View.java:235)
	at org.apache.hadoop.yarn.webapp.view.HtmlPage$Page.subView(HtmlPage.java:49)
	at org.apache.hadoop.yarn.webapp.hamlet.HamletImpl$EImp._v(HamletImpl.java:117)
	at org.apache.hadoop.yarn.webapp.hamlet.Hamlet$TD._(Hamlet.java:845)
	at org.apache.hadoop.yarn.webapp.view.TwoColumnLayout.render(TwoColumnLayout.java:56)
	at org.apache.hadoop.yarn.webapp.view.HtmlPage.render(HtmlPage.java:82)
	at org.apache.hadoop.yarn.server.resourcemanager.webapp.TestRMWebAppFairScheduler.testFairSchedulerWebAppPageInInconsistentState(TestRMWebAppFairScheduler.java:129)
	at sun.reflect.NativeMethodAccessorImpl.invoke0(Native Method)
	at sun.reflect.NativeMethodAccessorImpl.invoke(NativeMethodAccessorImpl.java:57)
	at sun.reflect.DelegatingMethodAccessorImpl.invoke(DelegatingMethodAccessorImpl.java:43)
	at java.lang.reflect.Method.invoke(Method.java:606)
	at org.junit.runners.model.FrameworkMethod$1.runReflectiveCall(FrameworkMethod.java:47)
	at org.junit.internal.runners.model.ReflectiveCallable.run(ReflectiveCallable.java:12)
	at org.junit.runners.model.FrameworkMethod.invokeExplosively(FrameworkMethod.java:44)
	at org.junit.internal.runners.statements.InvokeMethod.evaluate(InvokeMethod.java:17)
	at org.junit.runners.ParentRunner.runLeaf(ParentRunner.java:271)
	at org.junit.runners.BlockJUnit4ClassRunner.runChild(BlockJUnit4ClassRunner.java:70)
	at org.junit.runners.BlockJUnit4ClassRunner.runChild(BlockJUnit4ClassRunner.java:50)
	at org.junit.runners.ParentRunner$3.run(ParentRunner.java:238)
	at org.junit.runners.ParentRunner$1.schedule(ParentRunner.java:63)
	at org.junit.runners.ParentRunner.runChildren(ParentRunner.java:236)
	at org.junit.runners.ParentRunner.access$000(ParentRunner.java:53)
	at org.junit.runners.ParentRunner$2.evaluate(ParentRunner.java:229)
	at org.junit.runners.ParentRunner.run(ParentRunner.java:309)
	at org.apache.maven.surefire.junit4.JUnit4Provider.execute(JUnit4Provider.java:264)
	at org.apache.maven.surefire.junit4.JUnit4Provider.executeTestSet(JUnit4Provider.java:153)
	at org.apache.maven.surefire.junit4.JUnit4Provider.invoke(JUnit4Provider.java:124)
	at org.apache.maven.surefire.booter.ForkedBooter.invokeProviderInSameClassLoader(ForkedBooter.java:200)
	at org.apache.maven.surefire.booter.ForkedBooter.runSuitesInProcess(ForkedBooter.java:153)
	at org.apache.maven.surefire.booter.ForkedBooter.main(ForkedBooter.java:103)

	at org.junit.Assert.fail(Assert.java:88)
	at org.apache.hadoop.yarn.server.resourcemanager.webapp.TestRMWebAppFairScheduler.testFairSchedulerWebAppPageInInconsistentState(TestRMWebAppFairScheduler.java:131)


REGRESSION:  org.apache.hadoop.yarn.server.resourcemanager.webapp.TestRMWebServicesApps.testAppsSlash

Error Message:
incorrect number of elements expected:<30> but was:<31>

Stack Trace:
java.lang.AssertionError: incorrect number of elements expected:<30> but was:<31>
	at org.junit.Assert.fail(Assert.java:88)
	at org.junit.Assert.failNotEquals(Assert.java:743)
	at org.junit.Assert.assertEquals(Assert.java:118)
	at org.junit.Assert.assertEquals(Assert.java:555)
	at org.apache.hadoop.yarn.server.resourcemanager.webapp.TestRMWebServicesApps.verifyAppInfo(TestRMWebServicesApps.java:1320)
	at org.apache.hadoop.yarn.server.resourcemanager.webapp.TestRMWebServicesApps.testAppsHelper(TestRMWebServicesApps.java:213)
	at org.apache.hadoop.yarn.server.resourcemanager.webapp.TestRMWebServicesApps.testAppsSlash(TestRMWebServicesApps.java:134)


REGRESSION:  org.apache.hadoop.yarn.server.resourcemanager.webapp.TestRMWebServicesApps.testApps

Error Message:
incorrect number of elements expected:<30> but was:<31>

Stack Trace:
java.lang.AssertionError: incorrect number of elements expected:<30> but was:<31>
	at org.junit.Assert.fail(Assert.java:88)
	at org.junit.Assert.failNotEquals(Assert.java:743)
	at org.junit.Assert.assertEquals(Assert.java:118)
	at org.junit.Assert.assertEquals(Assert.java:555)
	at org.apache.hadoop.yarn.server.resourcemanager.webapp.TestRMWebServicesApps.verifyAppInfo(TestRMWebServicesApps.java:1320)
	at org.apache.hadoop.yarn.server.resourcemanager.webapp.TestRMWebServicesApps.testAppsHelper(TestRMWebServicesApps.java:213)
	at org.apache.hadoop.yarn.server.resourcemanager.webapp.TestRMWebServicesApps.testApps(TestRMWebServicesApps.java:124)


REGRESSION:  org.apache.hadoop.yarn.server.resourcemanager.webapp.TestRMWebServicesApps.testSingleAppsSlash

Error Message:
incorrect number of elements expected:<30> but was:<31>

Stack Trace:
java.lang.AssertionError: incorrect number of elements expected:<30> but was:<31>
	at org.junit.Assert.fail(Assert.java:88)
	at org.junit.Assert.failNotEquals(Assert.java:743)
	at org.junit.Assert.assertEquals(Assert.java:118)
	at org.junit.Assert.assertEquals(Assert.java:555)
	at org.apache.hadoop.yarn.server.resourcemanager.webapp.TestRMWebServicesApps.verifyAppInfo(TestRMWebServicesApps.java:1320)
	at org.apache.hadoop.yarn.server.resourcemanager.webapp.TestRMWebServicesApps.testSingleAppsHelper(TestRMWebServicesApps.java:1254)
	at org.apache.hadoop.yarn.server.resourcemanager.webapp.TestRMWebServicesApps.testSingleAppsSlash(TestRMWebServicesApps.java:1157)


REGRESSION:  org.apache.hadoop.yarn.server.resourcemanager.webapp.TestRMWebServicesApps.testSingleApp

Error Message:
incorrect number of elements expected:<30> but was:<31>

Stack Trace:
java.lang.AssertionError: incorrect number of elements expected:<30> but was:<31>
	at org.junit.Assert.fail(Assert.java:88)
	at org.junit.Assert.failNotEquals(Assert.java:743)
	at org.junit.Assert.assertEquals(Assert.java:118)
	at org.junit.Assert.assertEquals(Assert.java:555)
	at org.apache.hadoop.yarn.server.resourcemanager.webapp.TestRMWebServicesApps.verifyAppInfo(TestRMWebServicesApps.java:1320)
	at org.apache.hadoop.yarn.server.resourcemanager.webapp.TestRMWebServicesApps.testSingleAppsHelper(TestRMWebServicesApps.java:1254)
	at org.apache.hadoop.yarn.server.resourcemanager.webapp.TestRMWebServicesApps.testSingleApp(TestRMWebServicesApps.java:1146)


REGRESSION:  org.apache.hadoop.yarn.server.resourcemanager.webapp.TestRMWebServicesApps.testAppsQueryFinalStatus

Error Message:
incorrect number of elements expected:<30> but was:<31>

Stack Trace:
java.lang.AssertionError: incorrect number of elements expected:<30> but was:<31>
	at org.junit.Assert.fail(Assert.java:88)
	at org.junit.Assert.failNotEquals(Assert.java:743)
	at org.junit.Assert.assertEquals(Assert.java:118)
	at org.junit.Assert.assertEquals(Assert.java:555)
	at org.apache.hadoop.yarn.server.resourcemanager.webapp.TestRMWebServicesApps.verifyAppInfo(TestRMWebServicesApps.java:1320)
	at org.apache.hadoop.yarn.server.resourcemanager.webapp.TestRMWebServicesApps.testAppsQueryFinalStatus(TestRMWebServicesApps.java:469)


REGRESSION:  org.apache.hadoop.yarn.server.resourcemanager.webapp.TestRMWebServicesApps.testAppsQueryState

Error Message:
incorrect number of elements expected:<30> but was:<31>

Stack Trace:
java.lang.AssertionError: incorrect number of elements expected:<30> but was:<31>
	at org.junit.Assert.fail(Assert.java:88)
	at org.junit.Assert.failNotEquals(Assert.java:743)
	at org.junit.Assert.assertEquals(Assert.java:118)
	at org.junit.Assert.assertEquals(Assert.java:555)
	at org.apache.hadoop.yarn.server.resourcemanager.webapp.TestRMWebServicesApps.verifyAppInfo(TestRMWebServicesApps.java:1320)
	at org.apache.hadoop.yarn.server.resourcemanager.webapp.TestRMWebServicesApps.testAppsQueryState(TestRMWebServicesApps.java:236)


REGRESSION:  org.apache.hadoop.yarn.server.resourcemanager.webapp.TestRMWebServicesApps.testSingleAppsDefault

Error Message:
incorrect number of elements expected:<30> but was:<31>

Stack Trace:
java.lang.AssertionError: incorrect number of elements expected:<30> but was:<31>
	at org.junit.Assert.fail(Assert.java:88)
	at org.junit.Assert.failNotEquals(Assert.java:743)
	at org.junit.Assert.assertEquals(Assert.java:118)
	at org.junit.Assert.assertEquals(Assert.java:555)
	at org.apache.hadoop.yarn.server.resourcemanager.webapp.TestRMWebServicesApps.verifyAppInfo(TestRMWebServicesApps.java:1320)
	at org.apache.hadoop.yarn.server.resourcemanager.webapp.TestRMWebServicesApps.testSingleAppsHelper(TestRMWebServicesApps.java:1254)
	at org.apache.hadoop.yarn.server.resourcemanager.webapp.TestRMWebServicesApps.testSingleAppsDefault(TestRMWebServicesApps.java:1168)


REGRESSION:  org.apache.hadoop.yarn.server.resourcemanager.webapp.TestRMWebServicesApps.testAppsDefault

Error Message:
incorrect number of elements expected:<30> but was:<31>

Stack Trace:
java.lang.AssertionError: incorrect number of elements expected:<30> but was:<31>
	at org.junit.Assert.fail(Assert.java:88)
	at org.junit.Assert.failNotEquals(Assert.java:743)
	at org.junit.Assert.assertEquals(Assert.java:118)
	at org.junit.Assert.assertEquals(Assert.java:555)
	at org.apache.hadoop.yarn.server.resourcemanager.webapp.TestRMWebServicesApps.verifyAppInfo(TestRMWebServicesApps.java:1320)
	at org.apache.hadoop.yarn.server.resourcemanager.webapp.TestRMWebServicesApps.testAppsHelper(TestRMWebServicesApps.java:213)
	at org.apache.hadoop.yarn.server.resourcemanager.webapp.TestRMWebServicesApps.testAppsDefault(TestRMWebServicesApps.java:144)



Mime
  • Unnamed multipart/mixed (inline, None, 0 bytes)
View raw message