hadoop-yarn-dev mailing list archives

Site index · List index
Message view « Date » · « Thread »
Top « Date » · « Thread »
From Apache Jenkins Server <jenk...@builds.apache.org>
Subject Failed: YARN-3975 PreCommit Build #8812
Date Mon, 10 Aug 2015 16:35:23 GMT
Jira: https://issues.apache.org/jira/browse/YARN-3975
Build: https://builds.apache.org/job/PreCommit-YARN-Build/8812/

###################################################################################
########################## LAST 60 LINES OF THE CONSOLE ###########################
[...truncated 338 lines...]
|      |                     |            | warnings.
|  +1  |         yarn tests  |  0m 23s    | Tests passed in hadoop-yarn-api. 
|  -1  |         yarn tests  |  1m 54s    | Tests failed in hadoop-yarn-common. 
|  +1  |         yarn tests  |  0m 22s    | Tests passed in 
|      |                     |            | hadoop-yarn-server-web-proxy.
|      |                     |  45m 8s    | 


             Reason | Tests
          FindBugs  |  module:hadoop-yarn-common 
 Failed unit tests  |  hadoop.yarn.util.TestRackResolver 
                    |  hadoop.yarn.api.TestPBImplRecords 


|| Subsystem || Report/Notes ||
============================================================================
| Patch URL | http://issues.apache.org/jira/secure/attachment/12749603/YARN-3975.3.patch |
| Optional Tests | javadoc javac unit findbugs checkstyle |
| git revision | trunk / 8f73bdd |
| javadoc | /home/jenkins/jenkins-slave/workspace/PreCommit-YARN-Build/patchprocess/diffJavadocWarnings.txt
|
| Findbugs warnings | /home/jenkins/jenkins-slave/workspace/PreCommit-YARN-Build/patchprocess/newPatchFindbugsWarningshadoop-yarn-common.html
|
| hadoop-yarn-api test log | /home/jenkins/jenkins-slave/workspace/PreCommit-YARN-Build/patchprocess/testrun_hadoop-yarn-api.txt
|
| hadoop-yarn-common test log | /home/jenkins/jenkins-slave/workspace/PreCommit-YARN-Build/patchprocess/testrun_hadoop-yarn-common.txt
|
| hadoop-yarn-server-web-proxy test log | /home/jenkins/jenkins-slave/workspace/PreCommit-YARN-Build/patchprocess/testrun_hadoop-yarn-server-web-proxy.txt
|
| Test Results | https://builds.apache.org/job/PreCommit-YARN-Build/8812/testReport/ |
| Java | 1.7.0_55 |
| uname | Linux asf906.gq1.ygridcore.net 3.13.0-36-lowlatency #63-Ubuntu SMP PREEMPT Wed Sep
3 21:56:12 UTC 2014 x86_64 x86_64 x86_64 GNU/Linux |


============================================================================
============================================================================
                          Adding comment to JIRA
============================================================================
============================================================================


Comment added.
855eeb7fe10c8d5daaccedcda72a22057eeea82b logged out


============================================================================
============================================================================
                              Finished build.
============================================================================
============================================================================


Build step 'Execute shell' marked build as failure
Archiving artifacts
Sending artifact delta relative to PreCommit-YARN-Build #8782
Archived 56 artifacts
Archive block size is 32768
Received 38 blocks and 26828242 bytes
Compression is 4.4%
Took 5.6 sec
[description-setter] Could not determine description.
Recording test results
Email was triggered for: Failure
Sending email for trigger: Failure



###################################################################################
############################## FAILED TESTS (if any) ##############################
2 tests failed.
FAILED:  org.apache.hadoop.yarn.api.TestPBImplRecords.testApplicationReportPBImpl

Error Message:
null

Stack Trace:
java.lang.reflect.InvocationTargetException: null
	at org.apache.hadoop.yarn.api.records.impl.pb.ApplicationReportPBImpl.getAppReportSource(ApplicationReportPBImpl.java:637)
	at sun.reflect.NativeMethodAccessorImpl.invoke0(Native Method)
	at sun.reflect.NativeMethodAccessorImpl.invoke(NativeMethodAccessorImpl.java:57)
	at sun.reflect.DelegatingMethodAccessorImpl.invoke(DelegatingMethodAccessorImpl.java:43)
	at java.lang.reflect.Method.invoke(Method.java:606)
	at org.apache.hadoop.yarn.api.TestPBImplRecords.validatePBImplRecord(TestPBImplRecords.java:602)
	at org.apache.hadoop.yarn.api.TestPBImplRecords.testApplicationReportPBImpl(TestPBImplRecords.java:912)


FAILED:  org.apache.hadoop.yarn.util.TestRackResolver.testCaching

Error Message:
expected:</[default-rack]> but was:</[rack1]>

Stack Trace:
org.junit.ComparisonFailure: expected:</[default-rack]> but was:</[rack1]>
	at org.junit.Assert.assertEquals(Assert.java:115)
	at org.junit.Assert.assertEquals(Assert.java:144)
	at org.apache.hadoop.yarn.util.TestRackResolver.testCaching(TestRackResolver.java:102)



Mime
  • Unnamed multipart/mixed (inline, None, 0 bytes)
View raw message