hadoop-yarn-dev mailing list archives

Site index · List index
Message view « Date » · « Thread »
Top « Date » · « Thread »
From Apache Jenkins Server <jenk...@builds.apache.org>
Subject Hadoop-Yarn-trunk - Build # 1044 - Still Failing
Date Thu, 27 Aug 2015 18:27:09 GMT
See https://builds.apache.org/job/Hadoop-Yarn-trunk/1044/

###################################################################################
########################## LAST 60 LINES OF THE CONSOLE ###########################
[...truncated 10914 lines...]

Tests in error: 
  TestDistributedShell.tearDown:133 » Runtime java.util.zip.ZipException: invali...
  TestDistributedShell.setup:71->setupInternal:79 » Runtime java.util.zip.ZipExc...
  TestDistributedShell.tearDown:133 » Runtime java.util.zip.ZipException: invali...
  TestDistributedShell.setup:71->setupInternal:79 » Runtime java.util.zip.ZipExc...
  TestDistributedShell.tearDown:133 » Runtime java.util.zip.ZipException: invali...

Tests run: 16, Failures: 0, Errors: 5, Skipped: 0

[INFO] ------------------------------------------------------------------------
[INFO] Reactor Summary:
[INFO] 
[INFO] Apache Hadoop YARN ................................ SUCCESS [  3.228 s]
[INFO] Apache Hadoop YARN API ............................ SUCCESS [03:42 min]
[INFO] Apache Hadoop YARN Common ......................... SUCCESS [02:53 min]
[INFO] Apache Hadoop YARN Server ......................... SUCCESS [  0.092 s]
[INFO] Apache Hadoop YARN Server Common .................. SUCCESS [ 44.892 s]
[INFO] Apache Hadoop YARN NodeManager .................... SUCCESS [07:55 min]
[INFO] Apache Hadoop YARN Web Proxy ...................... SUCCESS [ 25.732 s]
[INFO] Apache Hadoop YARN ApplicationHistoryService ...... SUCCESS [03:17 min]
[INFO] Apache Hadoop YARN ResourceManager ................ SUCCESS [54:24 min]
[INFO] Apache Hadoop YARN Server Tests ................... SUCCESS [01:51 min]
[INFO] Apache Hadoop YARN Client ......................... SUCCESS [07:01 min]
[INFO] Apache Hadoop YARN SharedCacheManager ............. SUCCESS [ 26.622 s]
[INFO] Apache Hadoop YARN Applications ................... SUCCESS [  0.051 s]
[INFO] Apache Hadoop YARN DistributedShell ............... FAILURE [05:43 min]
[INFO] Apache Hadoop YARN Unmanaged Am Launcher .......... SKIPPED
[INFO] Apache Hadoop YARN Site ........................... SKIPPED
[INFO] Apache Hadoop YARN Registry ....................... SKIPPED
[INFO] Apache Hadoop YARN Project ........................ SKIPPED
[INFO] ------------------------------------------------------------------------
[INFO] BUILD FAILURE
[INFO] ------------------------------------------------------------------------
[INFO] Total time: 01:28 h
[INFO] Finished at: 2015-08-27T18:28:09+00:00
[INFO] Final Memory: 81M/981M
[INFO] ------------------------------------------------------------------------
[ERROR] Failed to execute goal org.apache.maven.plugins:maven-surefire-plugin:2.17:test (default-test)
on project hadoop-yarn-applications-distributedshell: There are test failures.
[ERROR] 
[ERROR] Please refer to /home/jenkins/jenkins-slave/workspace/Hadoop-Yarn-trunk/hadoop-yarn-project/hadoop-yarn/hadoop-yarn-applications/hadoop-yarn-applications-distributedshell/target/surefire-reports
for the individual test results.
[ERROR] -> [Help 1]
[ERROR] 
[ERROR] To see the full stack trace of the errors, re-run Maven with the -e switch.
[ERROR] Re-run Maven using the -X switch to enable full debug logging.
[ERROR] 
[ERROR] For more information about the errors and possible solutions, please read the following
articles:
[ERROR] [Help 1] http://cwiki.apache.org/confluence/display/MAVEN/MojoFailureException
[ERROR] 
[ERROR] After correcting the problems, you can resume the build with the command
[ERROR]   mvn <goals> -rf :hadoop-yarn-applications-distributedshell
Build step 'Execute shell' marked build as failure
Archiving artifacts
Recording test results
Updating HDFS-8961
Updating HDFS-8962
Sending e-mails to: yarn-dev@hadoop.apache.org
Email was triggered for: Failure
Sending email for trigger: Failure



###################################################################################
############################## FAILED TESTS (if any) ##############################
5 tests failed.
FAILED:  org.apache.hadoop.yarn.applications.distributedshell.TestDistributedShell.testDSRestartWithPreviousRunningContainers

Error Message:
java.util.zip.ZipException: invalid code lengths set

Stack Trace:
java.lang.RuntimeException: java.util.zip.ZipException: invalid code lengths set
	at java.util.zip.InflaterInputStream.read(InflaterInputStream.java:164)
	at java.util.zip.InflaterInputStream.read(InflaterInputStream.java:122)
	at java.io.FilterInputStream.read(FilterInputStream.java:83)
	at com.sun.org.apache.xerces.internal.impl.XMLEntityManager$RewindableInputStream.read(XMLEntityManager.java:2873)
	at com.sun.org.apache.xerces.internal.impl.XMLEntityManager.setupCurrentEntity(XMLEntityManager.java:664)
	at com.sun.org.apache.xerces.internal.impl.XMLVersionDetector.determineDocVersion(XMLVersionDetector.java:189)
	at com.sun.org.apache.xerces.internal.parsers.XML11Configuration.parse(XML11Configuration.java:812)
	at com.sun.org.apache.xerces.internal.parsers.XML11Configuration.parse(XML11Configuration.java:777)
	at com.sun.org.apache.xerces.internal.parsers.XMLParser.parse(XMLParser.java:141)
	at com.sun.org.apache.xerces.internal.parsers.DOMParser.parse(DOMParser.java:243)
	at com.sun.org.apache.xerces.internal.jaxp.DocumentBuilderImpl.parse(DocumentBuilderImpl.java:347)
	at javax.xml.parsers.DocumentBuilder.parse(DocumentBuilder.java:150)
	at org.apache.hadoop.conf.Configuration.parse(Configuration.java:2551)
	at org.apache.hadoop.conf.Configuration.parse(Configuration.java:2539)
	at org.apache.hadoop.conf.Configuration.loadResource(Configuration.java:2610)
	at org.apache.hadoop.conf.Configuration.loadResources(Configuration.java:2563)
	at org.apache.hadoop.conf.Configuration.getProps(Configuration.java:2474)
	at org.apache.hadoop.conf.Configuration.get(Configuration.java:1048)
	at org.apache.hadoop.conf.Configuration.getTrimmed(Configuration.java:1098)
	at org.apache.hadoop.conf.Configuration.getClass(Configuration.java:2258)
	at org.apache.hadoop.fs.AbstractFileSystem.createFileSystem(AbstractFileSystem.java:159)
	at org.apache.hadoop.fs.AbstractFileSystem.get(AbstractFileSystem.java:250)
	at org.apache.hadoop.fs.FileContext$2.run(FileContext.java:329)
	at org.apache.hadoop.fs.FileContext$2.run(FileContext.java:326)
	at java.security.AccessController.doPrivileged(Native Method)
	at javax.security.auth.Subject.doAs(Subject.java:415)
	at org.apache.hadoop.security.UserGroupInformation.doAs(UserGroupInformation.java:1667)
	at org.apache.hadoop.fs.FileContext.getAbstractFileSystem(FileContext.java:326)
	at org.apache.hadoop.fs.FileContext.getFileContext(FileContext.java:443)
	at org.apache.hadoop.fs.FileContext.getFileContext(FileContext.java:420)
	at org.apache.hadoop.fs.FileContext.getLocalFSFileContext(FileContext.java:406)
	at org.apache.hadoop.yarn.applications.distributedshell.TestDistributedShell.tearDown(TestDistributedShell.java:133)


FAILED:  org.apache.hadoop.yarn.applications.distributedshell.TestDistributedShell.testDSShellWithCustomLogPropertyFile

Error Message:
java.util.zip.ZipException: invalid code lengths set

Stack Trace:
java.lang.RuntimeException: java.util.zip.ZipException: invalid code lengths set
	at java.util.zip.InflaterInputStream.read(InflaterInputStream.java:164)
	at java.util.zip.InflaterInputStream.read(InflaterInputStream.java:122)
	at java.io.FilterInputStream.read(FilterInputStream.java:83)
	at com.sun.org.apache.xerces.internal.impl.XMLEntityManager$RewindableInputStream.read(XMLEntityManager.java:2873)
	at com.sun.org.apache.xerces.internal.impl.XMLEntityManager.setupCurrentEntity(XMLEntityManager.java:664)
	at com.sun.org.apache.xerces.internal.impl.XMLVersionDetector.determineDocVersion(XMLVersionDetector.java:189)
	at com.sun.org.apache.xerces.internal.parsers.XML11Configuration.parse(XML11Configuration.java:812)
	at com.sun.org.apache.xerces.internal.parsers.XML11Configuration.parse(XML11Configuration.java:777)
	at com.sun.org.apache.xerces.internal.parsers.XMLParser.parse(XMLParser.java:141)
	at com.sun.org.apache.xerces.internal.parsers.DOMParser.parse(DOMParser.java:243)
	at com.sun.org.apache.xerces.internal.jaxp.DocumentBuilderImpl.parse(DocumentBuilderImpl.java:347)
	at javax.xml.parsers.DocumentBuilder.parse(DocumentBuilder.java:150)
	at org.apache.hadoop.conf.Configuration.parse(Configuration.java:2551)
	at org.apache.hadoop.conf.Configuration.parse(Configuration.java:2539)
	at org.apache.hadoop.conf.Configuration.loadResource(Configuration.java:2610)
	at org.apache.hadoop.conf.Configuration.loadResources(Configuration.java:2563)
	at org.apache.hadoop.conf.Configuration.getProps(Configuration.java:2474)
	at org.apache.hadoop.conf.Configuration.set(Configuration.java:1210)
	at org.apache.hadoop.conf.Configuration.set(Configuration.java:1182)
	at org.apache.hadoop.conf.Configuration.setInt(Configuration.java:1354)
	at org.apache.hadoop.yarn.applications.distributedshell.TestDistributedShell.setupInternal(TestDistributedShell.java:79)
	at org.apache.hadoop.yarn.applications.distributedshell.TestDistributedShell.setup(TestDistributedShell.java:71)


FAILED:  org.apache.hadoop.yarn.applications.distributedshell.TestDistributedShell.testDSShellWithCustomLogPropertyFile

Error Message:
java.util.zip.ZipException: invalid code lengths set

Stack Trace:
java.lang.RuntimeException: java.util.zip.ZipException: invalid code lengths set
	at java.util.zip.InflaterInputStream.read(InflaterInputStream.java:164)
	at java.util.zip.InflaterInputStream.read(InflaterInputStream.java:122)
	at java.io.FilterInputStream.read(FilterInputStream.java:83)
	at com.sun.org.apache.xerces.internal.impl.XMLEntityManager$RewindableInputStream.read(XMLEntityManager.java:2873)
	at com.sun.org.apache.xerces.internal.impl.XMLEntityManager.setupCurrentEntity(XMLEntityManager.java:664)
	at com.sun.org.apache.xerces.internal.impl.XMLVersionDetector.determineDocVersion(XMLVersionDetector.java:189)
	at com.sun.org.apache.xerces.internal.parsers.XML11Configuration.parse(XML11Configuration.java:812)
	at com.sun.org.apache.xerces.internal.parsers.XML11Configuration.parse(XML11Configuration.java:777)
	at com.sun.org.apache.xerces.internal.parsers.XMLParser.parse(XMLParser.java:141)
	at com.sun.org.apache.xerces.internal.parsers.DOMParser.parse(DOMParser.java:243)
	at com.sun.org.apache.xerces.internal.jaxp.DocumentBuilderImpl.parse(DocumentBuilderImpl.java:347)
	at javax.xml.parsers.DocumentBuilder.parse(DocumentBuilder.java:150)
	at org.apache.hadoop.conf.Configuration.parse(Configuration.java:2551)
	at org.apache.hadoop.conf.Configuration.parse(Configuration.java:2539)
	at org.apache.hadoop.conf.Configuration.loadResource(Configuration.java:2610)
	at org.apache.hadoop.conf.Configuration.loadResources(Configuration.java:2563)
	at org.apache.hadoop.conf.Configuration.getProps(Configuration.java:2474)
	at org.apache.hadoop.conf.Configuration.get(Configuration.java:1048)
	at org.apache.hadoop.conf.Configuration.getTrimmed(Configuration.java:1098)
	at org.apache.hadoop.conf.Configuration.getClass(Configuration.java:2258)
	at org.apache.hadoop.fs.AbstractFileSystem.createFileSystem(AbstractFileSystem.java:159)
	at org.apache.hadoop.fs.AbstractFileSystem.get(AbstractFileSystem.java:250)
	at org.apache.hadoop.fs.FileContext$2.run(FileContext.java:329)
	at org.apache.hadoop.fs.FileContext$2.run(FileContext.java:326)
	at java.security.AccessController.doPrivileged(Native Method)
	at javax.security.auth.Subject.doAs(Subject.java:415)
	at org.apache.hadoop.security.UserGroupInformation.doAs(UserGroupInformation.java:1667)
	at org.apache.hadoop.fs.FileContext.getAbstractFileSystem(FileContext.java:326)
	at org.apache.hadoop.fs.FileContext.getFileContext(FileContext.java:443)
	at org.apache.hadoop.fs.FileContext.getFileContext(FileContext.java:420)
	at org.apache.hadoop.fs.FileContext.getLocalFSFileContext(FileContext.java:406)
	at org.apache.hadoop.yarn.applications.distributedshell.TestDistributedShell.tearDown(TestDistributedShell.java:133)


FAILED:  org.apache.hadoop.yarn.applications.distributedshell.TestDistributedShell.testContainerLaunchFailureHandling

Error Message:
java.util.zip.ZipException: invalid code lengths set

Stack Trace:
java.lang.RuntimeException: java.util.zip.ZipException: invalid code lengths set
	at java.util.zip.InflaterInputStream.read(InflaterInputStream.java:164)
	at java.util.zip.InflaterInputStream.read(InflaterInputStream.java:122)
	at java.io.FilterInputStream.read(FilterInputStream.java:83)
	at com.sun.org.apache.xerces.internal.impl.XMLEntityManager$RewindableInputStream.read(XMLEntityManager.java:2873)
	at com.sun.org.apache.xerces.internal.impl.XMLEntityManager.setupCurrentEntity(XMLEntityManager.java:664)
	at com.sun.org.apache.xerces.internal.impl.XMLVersionDetector.determineDocVersion(XMLVersionDetector.java:189)
	at com.sun.org.apache.xerces.internal.parsers.XML11Configuration.parse(XML11Configuration.java:812)
	at com.sun.org.apache.xerces.internal.parsers.XML11Configuration.parse(XML11Configuration.java:777)
	at com.sun.org.apache.xerces.internal.parsers.XMLParser.parse(XMLParser.java:141)
	at com.sun.org.apache.xerces.internal.parsers.DOMParser.parse(DOMParser.java:243)
	at com.sun.org.apache.xerces.internal.jaxp.DocumentBuilderImpl.parse(DocumentBuilderImpl.java:347)
	at javax.xml.parsers.DocumentBuilder.parse(DocumentBuilder.java:150)
	at org.apache.hadoop.conf.Configuration.parse(Configuration.java:2551)
	at org.apache.hadoop.conf.Configuration.parse(Configuration.java:2539)
	at org.apache.hadoop.conf.Configuration.loadResource(Configuration.java:2610)
	at org.apache.hadoop.conf.Configuration.loadResources(Configuration.java:2563)
	at org.apache.hadoop.conf.Configuration.getProps(Configuration.java:2474)
	at org.apache.hadoop.conf.Configuration.set(Configuration.java:1210)
	at org.apache.hadoop.conf.Configuration.set(Configuration.java:1182)
	at org.apache.hadoop.conf.Configuration.setInt(Configuration.java:1354)
	at org.apache.hadoop.yarn.applications.distributedshell.TestDistributedShell.setupInternal(TestDistributedShell.java:79)
	at org.apache.hadoop.yarn.applications.distributedshell.TestDistributedShell.setup(TestDistributedShell.java:71)


FAILED:  org.apache.hadoop.yarn.applications.distributedshell.TestDistributedShell.testContainerLaunchFailureHandling

Error Message:
java.util.zip.ZipException: invalid code lengths set

Stack Trace:
java.lang.RuntimeException: java.util.zip.ZipException: invalid code lengths set
	at java.util.zip.InflaterInputStream.read(InflaterInputStream.java:164)
	at java.util.zip.InflaterInputStream.read(InflaterInputStream.java:122)
	at java.io.FilterInputStream.read(FilterInputStream.java:83)
	at com.sun.org.apache.xerces.internal.impl.XMLEntityManager$RewindableInputStream.read(XMLEntityManager.java:2873)
	at com.sun.org.apache.xerces.internal.impl.XMLEntityManager.setupCurrentEntity(XMLEntityManager.java:664)
	at com.sun.org.apache.xerces.internal.impl.XMLVersionDetector.determineDocVersion(XMLVersionDetector.java:189)
	at com.sun.org.apache.xerces.internal.parsers.XML11Configuration.parse(XML11Configuration.java:812)
	at com.sun.org.apache.xerces.internal.parsers.XML11Configuration.parse(XML11Configuration.java:777)
	at com.sun.org.apache.xerces.internal.parsers.XMLParser.parse(XMLParser.java:141)
	at com.sun.org.apache.xerces.internal.parsers.DOMParser.parse(DOMParser.java:243)
	at com.sun.org.apache.xerces.internal.jaxp.DocumentBuilderImpl.parse(DocumentBuilderImpl.java:347)
	at javax.xml.parsers.DocumentBuilder.parse(DocumentBuilder.java:150)
	at org.apache.hadoop.conf.Configuration.parse(Configuration.java:2551)
	at org.apache.hadoop.conf.Configuration.parse(Configuration.java:2539)
	at org.apache.hadoop.conf.Configuration.loadResource(Configuration.java:2610)
	at org.apache.hadoop.conf.Configuration.loadResources(Configuration.java:2563)
	at org.apache.hadoop.conf.Configuration.getProps(Configuration.java:2474)
	at org.apache.hadoop.conf.Configuration.get(Configuration.java:1048)
	at org.apache.hadoop.conf.Configuration.getTrimmed(Configuration.java:1098)
	at org.apache.hadoop.conf.Configuration.getClass(Configuration.java:2258)
	at org.apache.hadoop.fs.AbstractFileSystem.createFileSystem(AbstractFileSystem.java:159)
	at org.apache.hadoop.fs.AbstractFileSystem.get(AbstractFileSystem.java:250)
	at org.apache.hadoop.fs.FileContext$2.run(FileContext.java:329)
	at org.apache.hadoop.fs.FileContext$2.run(FileContext.java:326)
	at java.security.AccessController.doPrivileged(Native Method)
	at javax.security.auth.Subject.doAs(Subject.java:415)
	at org.apache.hadoop.security.UserGroupInformation.doAs(UserGroupInformation.java:1667)
	at org.apache.hadoop.fs.FileContext.getAbstractFileSystem(FileContext.java:326)
	at org.apache.hadoop.fs.FileContext.getFileContext(FileContext.java:443)
	at org.apache.hadoop.fs.FileContext.getFileContext(FileContext.java:420)
	at org.apache.hadoop.fs.FileContext.getLocalFSFileContext(FileContext.java:406)
	at org.apache.hadoop.yarn.applications.distributedshell.TestDistributedShell.tearDown(TestDistributedShell.java:133)



Mime
  • Unnamed multipart/mixed (inline, None, 0 bytes)
View raw message