hadoop-yarn-dev mailing list archives

Site index · List index
Message view « Date » · « Thread »
Top « Date » · « Thread »
From Apache Jenkins Server <jenk...@builds.apache.org>
Subject Hadoop-Yarn-trunk-Java8 - Build # 297 - Still Failing
Date Sat, 22 Aug 2015 07:47:40 GMT
See https://builds.apache.org/job/Hadoop-Yarn-trunk-Java8/297/

###################################################################################
########################## LAST 60 LINES OF THE CONSOLE ###########################
[...truncated 4617 lines...]
Failed tests: 
  TestLogAggregationService.testLogAggregationServiceWithInterval:1351->testLogAggregationService:1461
expected:<-1> but was:<1>
  TestContainerManager.testContainerLaunchAndExitSuccess:448->testContainerLaunchAndExit:436
expected:<0> but was:<-1>

Tests in error: 
  TestContainerManager>BaseContainerManagerTest.tearDown:259->BaseContainerManagerTest.createContainerExecutor:150
» Runtime
  TestContainerManager.<init>:94->BaseContainerManagerTest.<init>:109 » Runtime
...
  TestContainerManager.<init>:94->BaseContainerManagerTest.<init>:109 » Runtime
...

Tests run: 333, Failures: 2, Errors: 3, Skipped: 17

[INFO] ------------------------------------------------------------------------
[INFO] Reactor Summary:
[INFO] 
[INFO] Apache Hadoop YARN ................................ SUCCESS [  3.243 s]
[INFO] Apache Hadoop YARN API ............................ SUCCESS [01:14 min]
[INFO] Apache Hadoop YARN Common ......................... SUCCESS [02:17 min]
[INFO] Apache Hadoop YARN Server ......................... SUCCESS [  0.059 s]
[INFO] Apache Hadoop YARN Server Common .................. SUCCESS [ 36.987 s]
[INFO] Apache Hadoop YARN NodeManager .................... FAILURE [05:50 min]
[INFO] Apache Hadoop YARN Web Proxy ...................... SKIPPED
[INFO] Apache Hadoop YARN ApplicationHistoryService ...... SKIPPED
[INFO] Apache Hadoop YARN ResourceManager ................ SKIPPED
[INFO] Apache Hadoop YARN Server Tests ................... SKIPPED
[INFO] Apache Hadoop YARN Client ......................... SKIPPED
[INFO] Apache Hadoop YARN SharedCacheManager ............. SKIPPED
[INFO] Apache Hadoop YARN Applications ................... SKIPPED
[INFO] Apache Hadoop YARN DistributedShell ............... SKIPPED
[INFO] Apache Hadoop YARN Unmanaged Am Launcher .......... SKIPPED
[INFO] Apache Hadoop YARN Site ........................... SKIPPED
[INFO] Apache Hadoop YARN Registry ....................... SKIPPED
[INFO] Apache Hadoop YARN Project ........................ SKIPPED
[INFO] ------------------------------------------------------------------------
[INFO] BUILD FAILURE
[INFO] ------------------------------------------------------------------------
[INFO] Total time: 10:03 min
[INFO] Finished at: 2015-08-22T07:48:37+00:00
[INFO] Final Memory: 79M/1025M
[INFO] ------------------------------------------------------------------------
[ERROR] Failed to execute goal org.apache.maven.plugins:maven-surefire-plugin:2.17:test (default-test)
on project hadoop-yarn-server-nodemanager: There are test failures.
[ERROR] 
[ERROR] Please refer to /home/jenkins/jenkins-slave/workspace/Hadoop-Yarn-trunk-Java8/hadoop-yarn-project/hadoop-yarn/hadoop-yarn-server/hadoop-yarn-server-nodemanager/target/surefire-reports
for the individual test results.
[ERROR] -> [Help 1]
[ERROR] 
[ERROR] To see the full stack trace of the errors, re-run Maven with the -e switch.
[ERROR] Re-run Maven using the -X switch to enable full debug logging.
[ERROR] 
[ERROR] For more information about the errors and possible solutions, please read the following
articles:
[ERROR] [Help 1] http://cwiki.apache.org/confluence/display/MAVEN/MojoFailureException
[ERROR] 
[ERROR] After correcting the problems, you can resume the build with the command
[ERROR]   mvn <goals> -rf :hadoop-yarn-server-nodemanager
Build step 'Execute shell' marked build as failure
Archiving artifacts
Recording test results
Updating HDFS-8823
Sending e-mails to: yarn-dev@hadoop.apache.org
Email was triggered for: Failure
Sending email for trigger: Failure



###################################################################################
############################## FAILED TESTS (if any) ##############################
5 tests failed.
REGRESSION:  org.apache.hadoop.yarn.server.nodemanager.containermanager.TestContainerManager.testContainerLaunchAndExitSuccess

Error Message:
expected:<0> but was:<-1>

Stack Trace:
java.lang.AssertionError: expected:<0> but was:<-1>
	at org.junit.Assert.fail(Assert.java:88)
	at org.junit.Assert.failNotEquals(Assert.java:743)
	at org.junit.Assert.assertEquals(Assert.java:118)
	at org.junit.Assert.assertEquals(Assert.java:555)
	at org.junit.Assert.assertEquals(Assert.java:542)
	at org.apache.hadoop.yarn.server.nodemanager.containermanager.TestContainerManager.testContainerLaunchAndExit(TestContainerManager.java:436)
	at org.apache.hadoop.yarn.server.nodemanager.containermanager.TestContainerManager.testContainerLaunchAndExitSuccess(TestContainerManager.java:448)


REGRESSION:  org.apache.hadoop.yarn.server.nodemanager.containermanager.TestContainerManager.testContainerLaunchAndExitSuccess

Error Message:
java.util.zip.ZipException: invalid code lengths set

Stack Trace:
java.lang.RuntimeException: java.util.zip.ZipException: invalid code lengths set
	at org.apache.hadoop.conf.Configuration.loadResource(Configuration.java:2720)
	at org.apache.hadoop.conf.Configuration.loadResources(Configuration.java:2558)
	at org.apache.hadoop.conf.Configuration.getProps(Configuration.java:2469)
	at org.apache.hadoop.conf.Configuration.get(Configuration.java:1043)
	at org.apache.hadoop.conf.Configuration.getTrimmed(Configuration.java:1093)
	at org.apache.hadoop.conf.Configuration.getClass(Configuration.java:2253)
	at org.apache.hadoop.fs.AbstractFileSystem.createFileSystem(AbstractFileSystem.java:159)
	at org.apache.hadoop.fs.AbstractFileSystem.get(AbstractFileSystem.java:250)
	at org.apache.hadoop.fs.FileContext$2.run(FileContext.java:329)
	at org.apache.hadoop.fs.FileContext$2.run(FileContext.java:326)
	at java.security.AccessController.doPrivileged(Native Method)
	at javax.security.auth.Subject.doAs(Subject.java:422)
	at org.apache.hadoop.security.UserGroupInformation.doAs(UserGroupInformation.java:1667)
	at org.apache.hadoop.fs.FileContext.getAbstractFileSystem(FileContext.java:326)
	at org.apache.hadoop.fs.FileContext.getFileContext(FileContext.java:443)
	at org.apache.hadoop.fs.FileContext.getFileContext(FileContext.java:420)
	at org.apache.hadoop.fs.FileContext.getLocalFSFileContext(FileContext.java:406)
	at org.apache.hadoop.yarn.server.nodemanager.DefaultContainerExecutor.<init>(DefaultContainerExecutor.java:78)
	at org.apache.hadoop.yarn.server.nodemanager.containermanager.BaseContainerManagerTest.createContainerExecutor(BaseContainerManagerTest.java:150)
	at org.apache.hadoop.yarn.server.nodemanager.containermanager.BaseContainerManagerTest.tearDown(BaseContainerManagerTest.java:259)
	at sun.reflect.NativeMethodAccessorImpl.invoke0(Native Method)
	at sun.reflect.NativeMethodAccessorImpl.invoke(NativeMethodAccessorImpl.java:62)
	at sun.reflect.DelegatingMethodAccessorImpl.invoke(DelegatingMethodAccessorImpl.java:43)
	at java.lang.reflect.Method.invoke(Method.java:483)
	at org.junit.runners.model.FrameworkMethod$1.runReflectiveCall(FrameworkMethod.java:47)
	at org.junit.internal.runners.model.ReflectiveCallable.run(ReflectiveCallable.java:12)
	at org.junit.runners.model.FrameworkMethod.invokeExplosively(FrameworkMethod.java:44)
	at org.junit.internal.runners.statements.RunAfters.evaluate(RunAfters.java:33)
	at org.junit.runners.ParentRunner.runLeaf(ParentRunner.java:271)
	at org.junit.runners.BlockJUnit4ClassRunner.runChild(BlockJUnit4ClassRunner.java:70)
	at org.junit.runners.BlockJUnit4ClassRunner.runChild(BlockJUnit4ClassRunner.java:50)
	at org.junit.runners.ParentRunner$3.run(ParentRunner.java:238)
	at org.junit.runners.ParentRunner$1.schedule(ParentRunner.java:63)
	at org.junit.runners.ParentRunner.runChildren(ParentRunner.java:236)
	at org.junit.runners.ParentRunner.access$000(ParentRunner.java:53)
	at org.junit.runners.ParentRunner$2.evaluate(ParentRunner.java:229)
	at org.junit.runners.ParentRunner.run(ParentRunner.java:309)
	at org.apache.maven.surefire.junit4.JUnit4Provider.execute(JUnit4Provider.java:264)
	at org.apache.maven.surefire.junit4.JUnit4Provider.executeTestSet(JUnit4Provider.java:153)
	at org.apache.maven.surefire.junit4.JUnit4Provider.invoke(JUnit4Provider.java:124)
	at org.apache.maven.surefire.booter.ForkedBooter.invokeProviderInSameClassLoader(ForkedBooter.java:200)
	at org.apache.maven.surefire.booter.ForkedBooter.runSuitesInProcess(ForkedBooter.java:153)
	at org.apache.maven.surefire.booter.ForkedBooter.main(ForkedBooter.java:103)
Caused by: java.util.zip.ZipException: invalid code lengths set
	at java.util.zip.InflaterInputStream.read(InflaterInputStream.java:164)
	at java.util.zip.InflaterInputStream.read(InflaterInputStream.java:122)
	at java.io.FilterInputStream.read(FilterInputStream.java:83)
	at com.sun.org.apache.xerces.internal.impl.XMLEntityManager$RewindableInputStream.read(XMLEntityManager.java:2876)
	at com.sun.org.apache.xerces.internal.impl.XMLEntityManager.setupCurrentEntity(XMLEntityManager.java:667)
	at com.sun.org.apache.xerces.internal.impl.XMLVersionDetector.determineDocVersion(XMLVersionDetector.java:189)
	at com.sun.org.apache.xerces.internal.parsers.XML11Configuration.parse(XML11Configuration.java:812)
	at com.sun.org.apache.xerces.internal.parsers.XML11Configuration.parse(XML11Configuration.java:777)
	at com.sun.org.apache.xerces.internal.parsers.XMLParser.parse(XMLParser.java:141)
	at com.sun.org.apache.xerces.internal.parsers.DOMParser.parse(DOMParser.java:243)
	at com.sun.org.apache.xerces.internal.jaxp.DocumentBuilderImpl.parse(DocumentBuilderImpl.java:348)
	at javax.xml.parsers.DocumentBuilder.parse(DocumentBuilder.java:150)
	at org.apache.hadoop.conf.Configuration.parse(Configuration.java:2546)
	at org.apache.hadoop.conf.Configuration.parse(Configuration.java:2534)
	at org.apache.hadoop.conf.Configuration.loadResource(Configuration.java:2605)
	at org.apache.hadoop.conf.Configuration.loadResources(Configuration.java:2558)
	at org.apache.hadoop.conf.Configuration.getProps(Configuration.java:2469)
	at org.apache.hadoop.conf.Configuration.get(Configuration.java:1043)
	at org.apache.hadoop.conf.Configuration.getTrimmed(Configuration.java:1093)
	at org.apache.hadoop.conf.Configuration.getClass(Configuration.java:2253)
	at org.apache.hadoop.fs.AbstractFileSystem.createFileSystem(AbstractFileSystem.java:159)
	at org.apache.hadoop.fs.AbstractFileSystem.get(AbstractFileSystem.java:250)
	at org.apache.hadoop.fs.FileContext$2.run(FileContext.java:329)
	at org.apache.hadoop.fs.FileContext$2.run(FileContext.java:326)
	at java.security.AccessController.doPrivileged(Native Method)
	at javax.security.auth.Subject.doAs(Subject.java:422)
	at org.apache.hadoop.security.UserGroupInformation.doAs(UserGroupInformation.java:1667)
	at org.apache.hadoop.fs.FileContext.getAbstractFileSystem(FileContext.java:326)
	at org.apache.hadoop.fs.FileContext.getFileContext(FileContext.java:443)
	at org.apache.hadoop.fs.FileContext.getFileContext(FileContext.java:420)
	at org.apache.hadoop.fs.FileContext.getLocalFSFileContext(FileContext.java:406)
	at org.apache.hadoop.yarn.server.nodemanager.DefaultContainerExecutor.<init>(DefaultContainerExecutor.java:78)
	at org.apache.hadoop.yarn.server.nodemanager.containermanager.BaseContainerManagerTest.createContainerExecutor(BaseContainerManagerTest.java:150)
	at org.apache.hadoop.yarn.server.nodemanager.containermanager.BaseContainerManagerTest.tearDown(BaseContainerManagerTest.java:259)
	at sun.reflect.NativeMethodAccessorImpl.invoke0(Native Method)
	at sun.reflect.NativeMethodAccessorImpl.invoke(NativeMethodAccessorImpl.java:62)
	at sun.reflect.DelegatingMethodAccessorImpl.invoke(DelegatingMethodAccessorImpl.java:43)
	at java.lang.reflect.Method.invoke(Method.java:483)
	at org.junit.runners.model.FrameworkMethod$1.runReflectiveCall(FrameworkMethod.java:47)
	at org.junit.internal.runners.model.ReflectiveCallable.run(ReflectiveCallable.java:12)
	at org.junit.runners.model.FrameworkMethod.invokeExplosively(FrameworkMethod.java:44)
	at org.junit.internal.runners.statements.RunAfters.evaluate(RunAfters.java:33)
	at org.junit.runners.ParentRunner.runLeaf(ParentRunner.java:271)
	at org.junit.runners.BlockJUnit4ClassRunner.runChild(BlockJUnit4ClassRunner.java:70)
	at org.junit.runners.BlockJUnit4ClassRunner.runChild(BlockJUnit4ClassRunner.java:50)
	at org.junit.runners.ParentRunner$3.run(ParentRunner.java:238)
	at org.junit.runners.ParentRunner$1.schedule(ParentRunner.java:63)
	at org.junit.runners.ParentRunner.runChildren(ParentRunner.java:236)
	at org.junit.runners.ParentRunner.access$000(ParentRunner.java:53)
	at org.junit.runners.ParentRunner$2.evaluate(ParentRunner.java:229)
	at org.junit.runners.ParentRunner.run(ParentRunner.java:309)
	at org.apache.maven.surefire.junit4.JUnit4Provider.execute(JUnit4Provider.java:264)
	at org.apache.maven.surefire.junit4.JUnit4Provider.executeTestSet(JUnit4Provider.java:153)
	at org.apache.maven.surefire.junit4.JUnit4Provider.invoke(JUnit4Provider.java:124)
	at org.apache.maven.surefire.booter.ForkedBooter.invokeProviderInSameClassLoader(ForkedBooter.java:200)
	at org.apache.maven.surefire.booter.ForkedBooter.runSuitesInProcess(ForkedBooter.java:153)
	at org.apache.maven.surefire.booter.ForkedBooter.main(ForkedBooter.java:103)


REGRESSION:  org.apache.hadoop.yarn.server.nodemanager.containermanager.TestContainerManager.testMultipleContainersLaunch

Error Message:
java.util.zip.ZipException: invalid code lengths set

Stack Trace:
java.lang.RuntimeException: java.util.zip.ZipException: invalid code lengths set
	at java.util.zip.InflaterInputStream.read(InflaterInputStream.java:164)
	at java.util.zip.InflaterInputStream.read(InflaterInputStream.java:122)
	at java.io.FilterInputStream.read(FilterInputStream.java:83)
	at com.sun.org.apache.xerces.internal.impl.XMLEntityManager$RewindableInputStream.read(XMLEntityManager.java:2876)
	at com.sun.org.apache.xerces.internal.impl.XMLEntityManager.setupCurrentEntity(XMLEntityManager.java:667)
	at com.sun.org.apache.xerces.internal.impl.XMLVersionDetector.determineDocVersion(XMLVersionDetector.java:189)
	at com.sun.org.apache.xerces.internal.parsers.XML11Configuration.parse(XML11Configuration.java:812)
	at com.sun.org.apache.xerces.internal.parsers.XML11Configuration.parse(XML11Configuration.java:777)
	at com.sun.org.apache.xerces.internal.parsers.XMLParser.parse(XMLParser.java:141)
	at com.sun.org.apache.xerces.internal.parsers.DOMParser.parse(DOMParser.java:243)
	at com.sun.org.apache.xerces.internal.jaxp.DocumentBuilderImpl.parse(DocumentBuilderImpl.java:348)
	at javax.xml.parsers.DocumentBuilder.parse(DocumentBuilder.java:150)
	at org.apache.hadoop.conf.Configuration.parse(Configuration.java:2546)
	at org.apache.hadoop.conf.Configuration.parse(Configuration.java:2534)
	at org.apache.hadoop.conf.Configuration.loadResource(Configuration.java:2605)
	at org.apache.hadoop.conf.Configuration.loadResources(Configuration.java:2558)
	at org.apache.hadoop.conf.Configuration.getProps(Configuration.java:2469)
	at org.apache.hadoop.conf.Configuration.get(Configuration.java:1043)
	at org.apache.hadoop.conf.Configuration.getTrimmed(Configuration.java:1093)
	at org.apache.hadoop.conf.Configuration.getInt(Configuration.java:1313)
	at org.apache.hadoop.yarn.server.security.BaseContainerTokenSecretManager.<init>(BaseContainerTokenSecretManager.java:63)
	at org.apache.hadoop.yarn.server.nodemanager.security.NMContainerTokenSecretManager.<init>(NMContainerTokenSecretManager.java:66)
	at org.apache.hadoop.yarn.server.nodemanager.security.NMContainerTokenSecretManager.<init>(NMContainerTokenSecretManager.java:61)
	at org.apache.hadoop.yarn.server.nodemanager.containermanager.BaseContainerManagerTest.<init>(BaseContainerManagerTest.java:109)
	at org.apache.hadoop.yarn.server.nodemanager.containermanager.TestContainerManager.<init>(TestContainerManager.java:94)


REGRESSION:  org.apache.hadoop.yarn.server.nodemanager.containermanager.TestContainerManager.testMultipleContainersStopAndGetStatus

Error Message:
java.util.zip.ZipException: invalid code lengths set

Stack Trace:
java.lang.RuntimeException: java.util.zip.ZipException: invalid code lengths set
	at java.util.zip.InflaterInputStream.read(InflaterInputStream.java:164)
	at java.util.zip.InflaterInputStream.read(InflaterInputStream.java:122)
	at java.io.FilterInputStream.read(FilterInputStream.java:83)
	at com.sun.org.apache.xerces.internal.impl.XMLEntityManager$RewindableInputStream.read(XMLEntityManager.java:2876)
	at com.sun.org.apache.xerces.internal.impl.XMLEntityManager.setupCurrentEntity(XMLEntityManager.java:667)
	at com.sun.org.apache.xerces.internal.impl.XMLVersionDetector.determineDocVersion(XMLVersionDetector.java:189)
	at com.sun.org.apache.xerces.internal.parsers.XML11Configuration.parse(XML11Configuration.java:812)
	at com.sun.org.apache.xerces.internal.parsers.XML11Configuration.parse(XML11Configuration.java:777)
	at com.sun.org.apache.xerces.internal.parsers.XMLParser.parse(XMLParser.java:141)
	at com.sun.org.apache.xerces.internal.parsers.DOMParser.parse(DOMParser.java:243)
	at com.sun.org.apache.xerces.internal.jaxp.DocumentBuilderImpl.parse(DocumentBuilderImpl.java:348)
	at javax.xml.parsers.DocumentBuilder.parse(DocumentBuilder.java:150)
	at org.apache.hadoop.conf.Configuration.parse(Configuration.java:2546)
	at org.apache.hadoop.conf.Configuration.parse(Configuration.java:2534)
	at org.apache.hadoop.conf.Configuration.loadResource(Configuration.java:2605)
	at org.apache.hadoop.conf.Configuration.loadResources(Configuration.java:2558)
	at org.apache.hadoop.conf.Configuration.getProps(Configuration.java:2469)
	at org.apache.hadoop.conf.Configuration.get(Configuration.java:1043)
	at org.apache.hadoop.conf.Configuration.getTrimmed(Configuration.java:1093)
	at org.apache.hadoop.conf.Configuration.getInt(Configuration.java:1313)
	at org.apache.hadoop.yarn.server.security.BaseContainerTokenSecretManager.<init>(BaseContainerTokenSecretManager.java:63)
	at org.apache.hadoop.yarn.server.nodemanager.security.NMContainerTokenSecretManager.<init>(NMContainerTokenSecretManager.java:66)
	at org.apache.hadoop.yarn.server.nodemanager.security.NMContainerTokenSecretManager.<init>(NMContainerTokenSecretManager.java:61)
	at org.apache.hadoop.yarn.server.nodemanager.containermanager.BaseContainerManagerTest.<init>(BaseContainerManagerTest.java:109)
	at org.apache.hadoop.yarn.server.nodemanager.containermanager.TestContainerManager.<init>(TestContainerManager.java:94)


REGRESSION:  org.apache.hadoop.yarn.server.nodemanager.containermanager.logaggregation.TestLogAggregationService.testLogAggregationServiceWithInterval

Error Message:
expected:<-1> but was:<1>

Stack Trace:
java.lang.AssertionError: expected:<-1> but was:<1>
	at org.junit.Assert.fail(Assert.java:88)
	at org.junit.Assert.failNotEquals(Assert.java:743)
	at org.junit.Assert.assertEquals(Assert.java:118)
	at org.junit.Assert.assertEquals(Assert.java:555)
	at org.junit.Assert.assertEquals(Assert.java:542)
	at org.apache.hadoop.yarn.server.nodemanager.containermanager.logaggregation.TestLogAggregationService.testLogAggregationService(TestLogAggregationService.java:1461)
	at org.apache.hadoop.yarn.server.nodemanager.containermanager.logaggregation.TestLogAggregationService.testLogAggregationServiceWithInterval(TestLogAggregationService.java:1351)



Mime
  • Unnamed multipart/mixed (inline, None, 0 bytes)
View raw message