hadoop-yarn-dev mailing list archives

Site index · List index
Message view « Date » · « Thread »
Top « Date » · « Thread »
From Apache Jenkins Server <jenk...@builds.apache.org>
Subject Failed: YARN-2672 PreCommit Build #8773
Date Wed, 05 Aug 2015 18:30:35 GMT
Jira: https://issues.apache.org/jira/browse/YARN-2672
Build: https://builds.apache.org/job/PreCommit-YARN-Build/8773/

###################################################################################
########################## LAST 60 LINES OF THE CONSOLE ###########################
[...truncated 379 lines...]
|      |                        |            | new Findbugs (version 3.0.0)
|      |                        |            | warnings.
|  -1  |    tools/hadoop tests  |  11m 11s   | Tests failed in hadoop-gridmix. 
|      |                        |  50m 12s   | 


             Reason | Tests
          FindBugs  |  module:hadoop-gridmix 
 Failed unit tests  |  hadoop.mapred.gridmix.TestGridmixMemoryEmulation 
                    |  hadoop.mapred.gridmix.TestSleepJob 
                    |  hadoop.mapred.gridmix.TestHighRamJob 
   Timed out tests  |  org.apache.hadoop.mapred.gridmix.TestGridmixSubmission 


|| Subsystem || Report/Notes ||
============================================================================
| Patch URL | http://issues.apache.org/jira/secure/attachment/12748880/YARN-2672.1.patch |
| Optional Tests | javadoc javac unit findbugs checkstyle |
| git revision | trunk / 4ab49a4 |
| Release Audit | /home/jenkins/jenkins-slave/workspace/PreCommit-YARN-Build/patchprocess/patchReleaseAuditProblems.txt
|
| checkstyle |  /home/jenkins/jenkins-slave/workspace/PreCommit-YARN-Build/patchprocess/diffcheckstylehadoop-gridmix.txt
|
| whitespace | /home/jenkins/jenkins-slave/workspace/PreCommit-YARN-Build/patchprocess/whitespace.txt
|
| Findbugs warnings | /home/jenkins/jenkins-slave/workspace/PreCommit-YARN-Build/patchprocess/newPatchFindbugsWarningshadoop-gridmix.html
|
| hadoop-gridmix test log | /home/jenkins/jenkins-slave/workspace/PreCommit-YARN-Build/patchprocess/testrun_hadoop-gridmix.txt
|
| Test Results | https://builds.apache.org/job/PreCommit-YARN-Build/8773/testReport/ |
| Java | 1.7.0_55 |
| uname | Linux asf905.gq1.ygridcore.net 3.13.0-36-lowlatency #63-Ubuntu SMP PREEMPT Wed Sep
3 21:56:12 UTC 2014 x86_64 x86_64 x86_64 GNU/Linux |


============================================================================
============================================================================
                          Adding comment to JIRA
============================================================================
============================================================================


Comment added.
d2aecb757fe3b372a14a36436710522ece8008ba logged out


============================================================================
============================================================================
                              Finished build.
============================================================================
============================================================================


Build step 'Execute shell' marked build as failure
Archiving artifacts
Sending artifact delta relative to PreCommit-YARN-Build #8772
Archived 31 artifacts
Archive block size is 32768
Received 78 blocks and 7147136 bytes
Compression is 26.3%
Took 1.7 sec
[description-setter] Could not determine description.
Recording test results
Email was triggered for: Failure
Sending email for trigger: Failure



###################################################################################
############################## FAILED TESTS (if any) ##############################
5 tests failed.
FAILED:  org.apache.hadoop.mapred.gridmix.TestGridmixMemoryEmulation.testJavaHeapOptionsDisabled

Error Message:
Map heap options works when disabled! expected:<-Xmx1[]m> but was:<-Xmx1[0]m>

Stack Trace:
org.junit.ComparisonFailure: Map heap options works when disabled! expected:<-Xmx1[]m>
but was:<-Xmx1[0]m>
	at org.junit.Assert.assertEquals(Assert.java:125)
	at org.apache.hadoop.mapred.gridmix.TestGridmixMemoryEmulation.testJavaHeapOptionsDisabled(TestGridmixMemoryEmulation.java:450)


FAILED:  org.apache.hadoop.mapred.gridmix.TestHighRamJob.testHighRamFeatureEmulation

Error Message:
expected:<1024> but was:<10>

Stack Trace:
java.lang.AssertionError: expected:<1024> but was:<10>
	at org.junit.Assert.fail(Assert.java:93)
	at org.junit.Assert.failNotEquals(Assert.java:647)
	at org.junit.Assert.assertEquals(Assert.java:128)
	at org.junit.Assert.assertEquals(Assert.java:472)
	at org.junit.Assert.assertEquals(Assert.java:456)
	at org.apache.hadoop.mapred.gridmix.TestHighRamJob.testHighRamConfig(TestHighRamJob.java:99)
	at org.apache.hadoop.mapred.gridmix.TestHighRamJob.testHighRamFeatureEmulation(TestHighRamJob.java:116)


FAILED:  org.apache.hadoop.mapred.gridmix.TestSleepJob.testSerialSubmit

Error Message:
Bad job count expected:<3> but was:<1>

Stack Trace:
java.lang.AssertionError: Bad job count expected:<3> but was:<1>
	at org.junit.Assert.fail(Assert.java:93)
	at org.junit.Assert.failNotEquals(Assert.java:647)
	at org.junit.Assert.assertEquals(Assert.java:128)
	at org.junit.Assert.assertEquals(Assert.java:472)
	at org.apache.hadoop.mapred.gridmix.CommonJobTest$TestMonitor.verify(CommonJobTest.java:117)
	at org.apache.hadoop.mapred.gridmix.CommonJobTest$DebugGridmix.checkMonitor(CommonJobTest.java:90)
	at org.apache.hadoop.mapred.gridmix.CommonJobTest.doSubmission(CommonJobTest.java:376)
	at org.apache.hadoop.mapred.gridmix.TestSleepJob.testSerialSubmit(TestSleepJob.java:99)


FAILED:  org.apache.hadoop.mapred.gridmix.TestSleepJob.testReplaySubmit

Error Message:
Bad job count expected:<3> but was:<1>

Stack Trace:
java.lang.AssertionError: Bad job count expected:<3> but was:<1>
	at org.junit.Assert.fail(Assert.java:93)
	at org.junit.Assert.failNotEquals(Assert.java:647)
	at org.junit.Assert.assertEquals(Assert.java:128)
	at org.junit.Assert.assertEquals(Assert.java:472)
	at org.apache.hadoop.mapred.gridmix.CommonJobTest$TestMonitor.verify(CommonJobTest.java:117)
	at org.apache.hadoop.mapred.gridmix.CommonJobTest$DebugGridmix.checkMonitor(CommonJobTest.java:90)
	at org.apache.hadoop.mapred.gridmix.CommonJobTest.doSubmission(CommonJobTest.java:376)
	at org.apache.hadoop.mapred.gridmix.TestSleepJob.testReplaySubmit(TestSleepJob.java:107)


FAILED:  org.apache.hadoop.mapred.gridmix.TestSleepJob.testStressSubmit

Error Message:
Bad job count expected:<3> but was:<1>

Stack Trace:
java.lang.AssertionError: Bad job count expected:<3> but was:<1>
	at org.junit.Assert.fail(Assert.java:93)
	at org.junit.Assert.failNotEquals(Assert.java:647)
	at org.junit.Assert.assertEquals(Assert.java:128)
	at org.junit.Assert.assertEquals(Assert.java:472)
	at org.apache.hadoop.mapred.gridmix.CommonJobTest$TestMonitor.verify(CommonJobTest.java:117)
	at org.apache.hadoop.mapred.gridmix.CommonJobTest$DebugGridmix.checkMonitor(CommonJobTest.java:90)
	at org.apache.hadoop.mapred.gridmix.CommonJobTest.doSubmission(CommonJobTest.java:376)
	at org.apache.hadoop.mapred.gridmix.TestSleepJob.testStressSubmit(TestSleepJob.java:115)



Mime
  • Unnamed multipart/mixed (inline, None, 0 bytes)
View raw message