hadoop-yarn-dev mailing list archives

Site index · List index
Message view « Date » · « Thread »
Top « Date » · « Thread »
From Apache Jenkins Server <jenk...@builds.apache.org>
Subject Failed: YARN-3983 PreCommit Build #8759
Date Tue, 04 Aug 2015 01:41:41 GMT
Jira: https://issues.apache.org/jira/browse/YARN-3983
Build: https://builds.apache.org/job/PreCommit-YARN-Build/8759/

###################################################################################
########################## LAST 60 LINES OF THE CONSOLE ###########################
[...truncated 371 lines...]
|      |                     |            | --whitespace=fix.
|  +1  |            install  |  1m 36s    | mvn install still works. 
|  +1  |    eclipse:eclipse  |  0m 38s    | The patch built with 
|      |                     |            | eclipse:eclipse.
|  +1  |           findbugs  |  1m 38s    | The patch does not introduce any 
|      |                     |            | new Findbugs (version 3.0.0)
|      |                     |            | warnings.
|  -1  |         yarn tests  |  54m 16s   | Tests failed in 
|      |                     |            | hadoop-yarn-server-resourcemanager.
|      |                     |  97m 46s   | 


             Reason | Tests
 Failed unit tests  |  hadoop.yarn.server.resourcemanager.security.TestRMDelegationTokens



|| Subsystem || Report/Notes ||
============================================================================
| Patch URL | http://issues.apache.org/jira/secure/attachment/12748559/YARN-3983.4.patch |
| Optional Tests | javadoc javac unit findbugs checkstyle |
| git revision | trunk / 0306d90 |
| checkstyle |  /home/jenkins/jenkins-slave/workspace/PreCommit-YARN-Build/patchprocess/diffcheckstylehadoop-yarn-server-resourcemanager.txt
|
| whitespace | /home/jenkins/jenkins-slave/workspace/PreCommit-YARN-Build/patchprocess/whitespace.txt
|
| hadoop-yarn-server-resourcemanager test log | /home/jenkins/jenkins-slave/workspace/PreCommit-YARN-Build/patchprocess/testrun_hadoop-yarn-server-resourcemanager.txt
|
| Test Results | https://builds.apache.org/job/PreCommit-YARN-Build/8759/testReport/ |
| Java | 1.7.0_55 |
| uname | Linux asf903.gq1.ygridcore.net 3.13.0-36-lowlatency #63-Ubuntu SMP PREEMPT Wed Sep
3 21:56:12 UTC 2014 x86_64 x86_64 x86_64 GNU/Linux |


============================================================================
============================================================================
                          Adding comment to JIRA
============================================================================
============================================================================


Comment added.
d4d9c9dab1c4ef8ceed0efbdf41e413127e89798 logged out


============================================================================
============================================================================
                              Finished build.
============================================================================
============================================================================


Build step 'Execute shell' marked build as failure
Archiving artifacts
Sending artifact delta relative to PreCommit-YARN-Build #8752
Archived 30 artifacts
Archive block size is 32768
Received 79 blocks and 10694375 bytes
Compression is 19.5%
Took 2.7 sec
[description-setter] Could not determine description.
Recording test results
Email was triggered for: Failure
Sending email for trigger: Failure



###################################################################################
############################## FAILED TESTS (if any) ##############################
1 tests failed.
FAILED:  org.apache.hadoop.yarn.server.resourcemanager.security.TestRMDelegationTokens.testRMDTMasterKeyStateOnRollingMasterKey

Error Message:
null

Stack Trace:
java.lang.AssertionError: null
	at org.junit.Assert.fail(Assert.java:86)
	at org.junit.Assert.assertTrue(Assert.java:41)
	at org.junit.Assert.assertTrue(Assert.java:52)
	at org.apache.hadoop.yarn.server.resourcemanager.security.TestRMDelegationTokens$TestRMDelegationTokenSecretManager.checkCurrentKeyInStateStore(TestRMDelegationTokens.java:208)
	at org.apache.hadoop.yarn.server.resourcemanager.security.TestRMDelegationTokens.testRMDTMasterKeyStateOnRollingMasterKey(TestRMDelegationTokens.java:112)



Mime
  • Unnamed multipart/mixed (inline, None, 0 bytes)
View raw message