hadoop-yarn-dev mailing list archives

Site index · List index
Message view « Date » · « Thread »
Top « Date » · « Thread »
From Apache Jenkins Server <jenk...@builds.apache.org>
Subject Build failed in Jenkins: Hadoop-Yarn-trunk #1049
Date Fri, 28 Aug 2015 15:10:52 GMT
See <https://builds.apache.org/job/Hadoop-Yarn-trunk/1049/changes>

Changes:

[junping_du] YARN-1556. NPE getting application report with a null appId. Contributed by Weiwei
Yang.

------------------------------------------
[...truncated 8982 lines...]
Running org.apache.hadoop.yarn.server.resourcemanager.scheduler.fair.TestSchedulingPolicy
Tests run: 2, Failures: 0, Errors: 0, Skipped: 0, Time elapsed: 0.756 sec - in org.apache.hadoop.yarn.server.resourcemanager.scheduler.fair.TestSchedulingPolicy
Running org.apache.hadoop.yarn.server.resourcemanager.scheduler.fair.policies.TestEmptyQueues
Tests run: 3, Failures: 0, Errors: 0, Skipped: 0, Time elapsed: 0.546 sec - in org.apache.hadoop.yarn.server.resourcemanager.scheduler.fair.policies.TestEmptyQueues
Running org.apache.hadoop.yarn.server.resourcemanager.scheduler.fair.policies.TestDominantResourceFairnessPolicy
Tests run: 9, Failures: 0, Errors: 0, Skipped: 0, Time elapsed: 0.536 sec - in org.apache.hadoop.yarn.server.resourcemanager.scheduler.fair.policies.TestDominantResourceFairnessPolicy
Running org.apache.hadoop.yarn.server.resourcemanager.scheduler.fair.TestFairScheduler
Tests run: 84, Failures: 0, Errors: 0, Skipped: 0, Time elapsed: 13.637 sec - in org.apache.hadoop.yarn.server.resourcemanager.scheduler.fair.TestFairScheduler
Running org.apache.hadoop.yarn.server.resourcemanager.scheduler.fair.TestFairSchedulerPreemption
Tests run: 1, Failures: 0, Errors: 0, Skipped: 0, Time elapsed: 2.683 sec - in org.apache.hadoop.yarn.server.resourcemanager.scheduler.fair.TestFairSchedulerPreemption
Running org.apache.hadoop.yarn.server.resourcemanager.scheduler.fair.TestSchedulingUpdate
Tests run: 1, Failures: 0, Errors: 0, Skipped: 0, Time elapsed: 1.857 sec - in org.apache.hadoop.yarn.server.resourcemanager.scheduler.fair.TestSchedulingUpdate
Running org.apache.hadoop.yarn.server.resourcemanager.scheduler.fair.TestFairSchedulerFairShare
Tests run: 6, Failures: 0, Errors: 0, Skipped: 0, Time elapsed: 3.864 sec - in org.apache.hadoop.yarn.server.resourcemanager.scheduler.fair.TestFairSchedulerFairShare
Running org.apache.hadoop.yarn.server.resourcemanager.TestClientRMService
Tests run: 25, Failures: 0, Errors: 0, Skipped: 0, Time elapsed: 11.658 sec - in org.apache.hadoop.yarn.server.resourcemanager.TestClientRMService
Running org.apache.hadoop.yarn.server.resourcemanager.TestClientRMTokens
Tests run: 6, Failures: 0, Errors: 0, Skipped: 0, Time elapsed: 17.961 sec - in org.apache.hadoop.yarn.server.resourcemanager.TestClientRMTokens
Running org.apache.hadoop.yarn.server.resourcemanager.TestRMAuditLogger
Tests run: 3, Failures: 0, Errors: 0, Skipped: 0, Time elapsed: 1.228 sec - in org.apache.hadoop.yarn.server.resourcemanager.TestRMAuditLogger
Running org.apache.hadoop.yarn.server.resourcemanager.security.TestDelegationTokenRenewerLifecycle
Tests run: 1, Failures: 0, Errors: 0, Skipped: 0, Time elapsed: 0.769 sec - in org.apache.hadoop.yarn.server.resourcemanager.security.TestDelegationTokenRenewerLifecycle
Running org.apache.hadoop.yarn.server.resourcemanager.security.TestAMRMTokens
Tests run: 6, Failures: 0, Errors: 4, Skipped: 0, Time elapsed: 27.654 sec <<< FAILURE!
- in org.apache.hadoop.yarn.server.resourcemanager.security.TestAMRMTokens
testTokenExpiry[0](org.apache.hadoop.yarn.server.resourcemanager.security.TestAMRMTokens)
 Time elapsed: 0.022 sec  <<< ERROR!
java.lang.RuntimeException: java.lang.RuntimeException: org.xml.sax.SAXParseException; systemId:
jar:file:/home/jenkins/.m2/repository/org/apache/hadoop/hadoop-common/3.0.0-SNAPSHOT/hadoop-common-3.0.0-SNAPSHOT.jar!/core-default.xml;
lineNumber: 1; columnNumber: 1; Content is not allowed in prolog.
	at org.apache.xerces.parsers.DOMParser.parse(Unknown Source)
	at org.apache.xerces.jaxp.DocumentBuilderImpl.parse(Unknown Source)
	at javax.xml.parsers.DocumentBuilder.parse(DocumentBuilder.java:150)
	at org.apache.hadoop.conf.Configuration.parse(Configuration.java:2546)
	at org.apache.hadoop.conf.Configuration.parse(Configuration.java:2534)
	at org.apache.hadoop.conf.Configuration.loadResource(Configuration.java:2605)
	at org.apache.hadoop.conf.Configuration.loadResources(Configuration.java:2558)
	at org.apache.hadoop.conf.Configuration.getProps(Configuration.java:2469)
	at org.apache.hadoop.conf.Configuration.get(Configuration.java:1043)
	at org.apache.hadoop.conf.Configuration.getTrimmed(Configuration.java:1093)
	at org.apache.hadoop.conf.Configuration.getClass(Configuration.java:2253)
	at org.apache.hadoop.conf.Configuration.getClass(Configuration.java:2283)
	at org.apache.hadoop.yarn.conf.ConfigurationProviderFactory.getConfigurationProvider(ConfigurationProviderFactory.java:52)
	at org.apache.hadoop.yarn.server.resourcemanager.ResourceManager.serviceInit(ResourceManager.java:194)
	at org.apache.hadoop.service.AbstractService.init(AbstractService.java:163)
	at org.apache.hadoop.yarn.server.resourcemanager.MockRM.<init>(MockRM.java:120)
	at org.apache.hadoop.yarn.server.resourcemanager.MockRM.<init>(MockRM.java:113)
	at org.apache.hadoop.yarn.server.resourcemanager.MockRM.<init>(MockRM.java:109)
	at org.apache.hadoop.yarn.server.resourcemanager.MockRMWithCustomAMLauncher.<init>(MockRMWithCustomAMLauncher.java:45)
	at org.apache.hadoop.yarn.server.resourcemanager.TestAMAuthorization$MockRMWithAMS.<init>(TestAMAuthorization.java:138)
	at org.apache.hadoop.yarn.server.resourcemanager.security.TestAMRMTokens.testTokenExpiry(TestAMRMTokens.java:118)

testMasterKeyRollOver[1](org.apache.hadoop.yarn.server.resourcemanager.security.TestAMRMTokens)
 Time elapsed: 0.001 sec  <<< ERROR!
java.lang.RuntimeException: org.xml.sax.SAXParseException; systemId: jar:file:/home/jenkins/.m2/repository/org/apache/hadoop/hadoop-common/3.0.0-SNAPSHOT/hadoop-common-3.0.0-SNAPSHOT.jar!/core-default.xml;
lineNumber: 1; columnNumber: 1; Content is not allowed in prolog.
	at org.apache.xerces.parsers.DOMParser.parse(Unknown Source)
	at org.apache.xerces.jaxp.DocumentBuilderImpl.parse(Unknown Source)
	at javax.xml.parsers.DocumentBuilder.parse(DocumentBuilder.java:150)
	at org.apache.hadoop.conf.Configuration.parse(Configuration.java:2546)
	at org.apache.hadoop.conf.Configuration.parse(Configuration.java:2534)
	at org.apache.hadoop.conf.Configuration.loadResource(Configuration.java:2605)
	at org.apache.hadoop.conf.Configuration.loadResources(Configuration.java:2558)
	at org.apache.hadoop.conf.Configuration.getProps(Configuration.java:2469)
	at org.apache.hadoop.conf.Configuration.get(Configuration.java:1294)
	at org.apache.hadoop.security.SecurityUtil.getAuthenticationMethod(SecurityUtil.java:608)
	at org.apache.hadoop.security.UserGroupInformation.initialize(UserGroupInformation.java:273)
	at org.apache.hadoop.security.UserGroupInformation.setConfiguration(UserGroupInformation.java:322)
	at org.apache.hadoop.yarn.server.resourcemanager.security.TestAMRMTokens.<init>(TestAMRMTokens.java:98)

testAMRMMasterKeysUpdate[1](org.apache.hadoop.yarn.server.resourcemanager.security.TestAMRMTokens)
 Time elapsed: 0.006 sec  <<< ERROR!
java.lang.RuntimeException: java.lang.RuntimeException: org.xml.sax.SAXParseException; systemId:
jar:file:/home/jenkins/.m2/repository/org/apache/hadoop/hadoop-common/3.0.0-SNAPSHOT/hadoop-common-3.0.0-SNAPSHOT.jar!/core-default.xml;
lineNumber: 1; columnNumber: 1; Content is not allowed in prolog.
	at org.apache.xerces.parsers.DOMParser.parse(Unknown Source)
	at org.apache.xerces.jaxp.DocumentBuilderImpl.parse(Unknown Source)
	at javax.xml.parsers.DocumentBuilder.parse(DocumentBuilder.java:150)
	at org.apache.hadoop.conf.Configuration.parse(Configuration.java:2546)
	at org.apache.hadoop.conf.Configuration.parse(Configuration.java:2534)
	at org.apache.hadoop.conf.Configuration.loadResource(Configuration.java:2605)
	at org.apache.hadoop.conf.Configuration.loadResources(Configuration.java:2558)
	at org.apache.hadoop.conf.Configuration.getProps(Configuration.java:2469)
	at org.apache.hadoop.conf.Configuration.get(Configuration.java:1043)
	at org.apache.hadoop.conf.Configuration.getTrimmed(Configuration.java:1093)
	at org.apache.hadoop.conf.Configuration.getClass(Configuration.java:2253)
	at org.apache.hadoop.conf.Configuration.getClass(Configuration.java:2283)
	at org.apache.hadoop.yarn.conf.ConfigurationProviderFactory.getConfigurationProvider(ConfigurationProviderFactory.java:52)
	at org.apache.hadoop.yarn.server.resourcemanager.ResourceManager.serviceInit(ResourceManager.java:194)
	at org.apache.hadoop.service.AbstractService.init(AbstractService.java:163)
	at org.apache.hadoop.yarn.server.resourcemanager.MockRM.<init>(MockRM.java:120)
	at org.apache.hadoop.yarn.server.resourcemanager.MockRM.<init>(MockRM.java:113)
	at org.apache.hadoop.yarn.server.resourcemanager.MockRM.<init>(MockRM.java:109)
	at org.apache.hadoop.yarn.server.resourcemanager.security.TestAMRMTokens$1.<init>(TestAMRMTokens.java:355)
	at org.apache.hadoop.yarn.server.resourcemanager.security.TestAMRMTokens.testAMRMMasterKeysUpdate(TestAMRMTokens.java:355)

testTokenExpiry[1](org.apache.hadoop.yarn.server.resourcemanager.security.TestAMRMTokens)
 Time elapsed: 0.006 sec  <<< ERROR!
java.lang.RuntimeException: java.lang.RuntimeException: org.xml.sax.SAXParseException; systemId:
jar:file:/home/jenkins/.m2/repository/org/apache/hadoop/hadoop-common/3.0.0-SNAPSHOT/hadoop-common-3.0.0-SNAPSHOT.jar!/core-default.xml;
lineNumber: 1; columnNumber: 1; Content is not allowed in prolog.
	at org.apache.xerces.parsers.DOMParser.parse(Unknown Source)
	at org.apache.xerces.jaxp.DocumentBuilderImpl.parse(Unknown Source)
	at javax.xml.parsers.DocumentBuilder.parse(DocumentBuilder.java:150)
	at org.apache.hadoop.conf.Configuration.parse(Configuration.java:2546)
	at org.apache.hadoop.conf.Configuration.parse(Configuration.java:2534)
	at org.apache.hadoop.conf.Configuration.loadResource(Configuration.java:2605)
	at org.apache.hadoop.conf.Configuration.loadResources(Configuration.java:2558)
	at org.apache.hadoop.conf.Configuration.getProps(Configuration.java:2469)
	at org.apache.hadoop.conf.Configuration.get(Configuration.java:1043)
	at org.apache.hadoop.conf.Configuration.getTrimmed(Configuration.java:1093)
	at org.apache.hadoop.conf.Configuration.getClass(Configuration.java:2253)
	at org.apache.hadoop.conf.Configuration.getClass(Configuration.java:2283)
	at org.apache.hadoop.yarn.conf.ConfigurationProviderFactory.getConfigurationProvider(ConfigurationProviderFactory.java:52)
	at org.apache.hadoop.yarn.server.resourcemanager.ResourceManager.serviceInit(ResourceManager.java:194)
	at org.apache.hadoop.service.AbstractService.init(AbstractService.java:163)
	at org.apache.hadoop.yarn.server.resourcemanager.MockRM.<init>(MockRM.java:120)
	at org.apache.hadoop.yarn.server.resourcemanager.MockRM.<init>(MockRM.java:113)
	at org.apache.hadoop.yarn.server.resourcemanager.MockRM.<init>(MockRM.java:109)
	at org.apache.hadoop.yarn.server.resourcemanager.MockRMWithCustomAMLauncher.<init>(MockRMWithCustomAMLauncher.java:45)
	at org.apache.hadoop.yarn.server.resourcemanager.TestAMAuthorization$MockRMWithAMS.<init>(TestAMAuthorization.java:138)
	at org.apache.hadoop.yarn.server.resourcemanager.security.TestAMRMTokens.testTokenExpiry(TestAMRMTokens.java:118)

Running org.apache.hadoop.yarn.server.resourcemanager.security.TestClientToAMTokens
Tests run: 4, Failures: 0, Errors: 0, Skipped: 0, Time elapsed: 13.8 sec - in org.apache.hadoop.yarn.server.resourcemanager.security.TestClientToAMTokens
Running org.apache.hadoop.yarn.server.resourcemanager.security.TestDelegationTokenRenewer
Tests run: 14, Failures: 0, Errors: 0, Skipped: 0, Time elapsed: 87.956 sec - in org.apache.hadoop.yarn.server.resourcemanager.security.TestDelegationTokenRenewer
Running org.apache.hadoop.yarn.server.resourcemanager.security.TestRMDelegationTokens
Tests run: 2, Failures: 0, Errors: 0, Skipped: 0, Time elapsed: 5.962 sec - in org.apache.hadoop.yarn.server.resourcemanager.security.TestRMDelegationTokens
Running org.apache.hadoop.yarn.server.resourcemanager.TestWorkPreservingRMRestart
Tests run: 28, Failures: 0, Errors: 0, Skipped: 0, Time elapsed: 284.784 sec - in org.apache.hadoop.yarn.server.resourcemanager.TestWorkPreservingRMRestart
Running org.apache.hadoop.yarn.server.resourcemanager.resource.TestResourceWeights
Tests run: 1, Failures: 0, Errors: 0, Skipped: 0, Time elapsed: 0.076 sec - in org.apache.hadoop.yarn.server.resourcemanager.resource.TestResourceWeights
Running org.apache.hadoop.yarn.server.resourcemanager.resource.TestResources
Tests run: 2, Failures: 0, Errors: 0, Skipped: 0, Time elapsed: 0.509 sec - in org.apache.hadoop.yarn.server.resourcemanager.resource.TestResources
Running org.apache.hadoop.yarn.server.resourcemanager.monitor.TestSchedulingMonitor
Tests run: 1, Failures: 0, Errors: 0, Skipped: 0, Time elapsed: 1.785 sec - in org.apache.hadoop.yarn.server.resourcemanager.monitor.TestSchedulingMonitor
Running org.apache.hadoop.yarn.server.resourcemanager.monitor.capacity.TestProportionalCapacityPreemptionPolicy
Tests run: 27, Failures: 0, Errors: 0, Skipped: 0, Time elapsed: 15.807 sec - in org.apache.hadoop.yarn.server.resourcemanager.monitor.capacity.TestProportionalCapacityPreemptionPolicy
Running org.apache.hadoop.yarn.server.resourcemanager.monitor.capacity.TestProportionalCapacityPreemptionPolicyForNodePartitions
Tests run: 11, Failures: 0, Errors: 0, Skipped: 0, Time elapsed: 6.167 sec - in org.apache.hadoop.yarn.server.resourcemanager.monitor.capacity.TestProportionalCapacityPreemptionPolicyForNodePartitions
Running org.apache.hadoop.yarn.server.resourcemanager.resourcetracker.TestRMNMRPCResponseId
Tests run: 1, Failures: 0, Errors: 0, Skipped: 0, Time elapsed: 1.442 sec - in org.apache.hadoop.yarn.server.resourcemanager.resourcetracker.TestRMNMRPCResponseId
Running org.apache.hadoop.yarn.server.resourcemanager.resourcetracker.TestNMExpiry
Tests run: 1, Failures: 0, Errors: 0, Skipped: 0, Time elapsed: 2.96 sec - in org.apache.hadoop.yarn.server.resourcemanager.resourcetracker.TestNMExpiry
Running org.apache.hadoop.yarn.server.resourcemanager.resourcetracker.TestNMReconnect
Tests run: 3, Failures: 0, Errors: 0, Skipped: 0, Time elapsed: 2.285 sec - in org.apache.hadoop.yarn.server.resourcemanager.resourcetracker.TestNMReconnect
Running org.apache.hadoop.yarn.server.resourcemanager.applicationsmanager.TestAMRestart
Tests run: 6, Failures: 0, Errors: 0, Skipped: 0, Time elapsed: 135.863 sec - in org.apache.hadoop.yarn.server.resourcemanager.applicationsmanager.TestAMRestart
Running org.apache.hadoop.yarn.server.resourcemanager.applicationsmanager.TestAMRMRPCNodeUpdates
Tests run: 1, Failures: 0, Errors: 0, Skipped: 0, Time elapsed: 9.141 sec - in org.apache.hadoop.yarn.server.resourcemanager.applicationsmanager.TestAMRMRPCNodeUpdates
Running org.apache.hadoop.yarn.server.resourcemanager.applicationsmanager.TestAMRMRPCResponseId
Tests run: 1, Failures: 0, Errors: 0, Skipped: 0, Time elapsed: 5.657 sec - in org.apache.hadoop.yarn.server.resourcemanager.applicationsmanager.TestAMRMRPCResponseId
Running org.apache.hadoop.yarn.server.resourcemanager.TestRMAdminService
Tests run: 20, Failures: 0, Errors: 0, Skipped: 0, Time elapsed: 11.754 sec - in org.apache.hadoop.yarn.server.resourcemanager.TestRMAdminService
Running org.apache.hadoop.yarn.server.resourcemanager.TestRM
Tests run: 22, Failures: 0, Errors: 0, Skipped: 0, Time elapsed: 187.09 sec - in org.apache.hadoop.yarn.server.resourcemanager.TestRM
Running org.apache.hadoop.yarn.server.resourcemanager.rmapp.TestNodesListManager
Tests run: 1, Failures: 0, Errors: 0, Skipped: 0, Time elapsed: 12.303 sec - in org.apache.hadoop.yarn.server.resourcemanager.rmapp.TestNodesListManager
Running org.apache.hadoop.yarn.server.resourcemanager.rmapp.attempt.TestAMLivelinessMonitor
Tests run: 1, Failures: 0, Errors: 0, Skipped: 0, Time elapsed: 1.834 sec - in org.apache.hadoop.yarn.server.resourcemanager.rmapp.attempt.TestAMLivelinessMonitor
Running org.apache.hadoop.yarn.server.resourcemanager.rmapp.attempt.TestRMAppAttemptTransitions
Tests run: 72, Failures: 0, Errors: 0, Skipped: 1, Time elapsed: 5.75 sec - in org.apache.hadoop.yarn.server.resourcemanager.rmapp.attempt.TestRMAppAttemptTransitions
Running org.apache.hadoop.yarn.server.resourcemanager.rmapp.TestRMAppTransitions
Tests run: 44, Failures: 0, Errors: 0, Skipped: 0, Time elapsed: 3.401 sec - in org.apache.hadoop.yarn.server.resourcemanager.rmapp.TestRMAppTransitions
Running org.apache.hadoop.yarn.server.resourcemanager.TestResourceManager
Tests run: 5, Failures: 0, Errors: 0, Skipped: 0, Time elapsed: 3.686 sec - in org.apache.hadoop.yarn.server.resourcemanager.TestResourceManager
Running org.apache.hadoop.yarn.server.resourcemanager.TestApplicationCleanup
Tests run: 7, Failures: 0, Errors: 0, Skipped: 0, Time elapsed: 41.961 sec - in org.apache.hadoop.yarn.server.resourcemanager.TestApplicationCleanup
Running org.apache.hadoop.yarn.server.resourcemanager.TestApplicationMasterLauncher
Tests run: 3, Failures: 0, Errors: 0, Skipped: 0, Time elapsed: 18.182 sec - in org.apache.hadoop.yarn.server.resourcemanager.TestApplicationMasterLauncher
Running org.apache.hadoop.yarn.server.resourcemanager.TestRMDispatcher
Tests run: 1, Failures: 0, Errors: 0, Skipped: 0, Time elapsed: 1.909 sec - in org.apache.hadoop.yarn.server.resourcemanager.TestRMDispatcher
Running org.apache.hadoop.yarn.server.resourcemanager.TestRMHAForNodeLabels
Tests run: 1, Failures: 0, Errors: 0, Skipped: 0, Time elapsed: 4.089 sec - in org.apache.hadoop.yarn.server.resourcemanager.TestRMHAForNodeLabels
Running org.apache.hadoop.yarn.server.resourcemanager.recovery.TestZKRMStateStore
Tests run: 5, Failures: 0, Errors: 0, Skipped: 0, Time elapsed: 13.009 sec - in org.apache.hadoop.yarn.server.resourcemanager.recovery.TestZKRMStateStore
Running org.apache.hadoop.yarn.server.resourcemanager.recovery.TestProtos
Tests run: 1, Failures: 0, Errors: 0, Skipped: 0, Time elapsed: 0.224 sec - in org.apache.hadoop.yarn.server.resourcemanager.recovery.TestProtos
Running org.apache.hadoop.yarn.server.resourcemanager.recovery.TestLeveldbRMStateStore
Tests run: 9, Failures: 0, Errors: 0, Skipped: 0, Time elapsed: 5.054 sec - in org.apache.hadoop.yarn.server.resourcemanager.recovery.TestLeveldbRMStateStore
Running org.apache.hadoop.yarn.server.resourcemanager.recovery.TestFSRMStateStore
Tests run: 4, Failures: 0, Errors: 0, Skipped: 0, Time elapsed: 30.7 sec - in org.apache.hadoop.yarn.server.resourcemanager.recovery.TestFSRMStateStore
Running org.apache.hadoop.yarn.server.resourcemanager.recovery.TestZKRMStateStoreZKClientConnections
Tests run: 5, Failures: 0, Errors: 0, Skipped: 0, Time elapsed: 9.719 sec - in org.apache.hadoop.yarn.server.resourcemanager.recovery.TestZKRMStateStoreZKClientConnections
Running org.apache.hadoop.yarn.server.resourcemanager.recovery.TestZKRMStateStorePerf
Tests run: 1, Failures: 0, Errors: 0, Skipped: 0, Time elapsed: 56.087 sec - in org.apache.hadoop.yarn.server.resourcemanager.recovery.TestZKRMStateStorePerf
Running org.apache.hadoop.yarn.server.resourcemanager.TestRMRestart
Tests run: 48, Failures: 0, Errors: 0, Skipped: 0, Time elapsed: 371.588 sec - in org.apache.hadoop.yarn.server.resourcemanager.TestRMRestart
Running org.apache.hadoop.yarn.server.resourcemanager.TestMoveApplication
Tests run: 4, Failures: 0, Errors: 0, Skipped: 0, Time elapsed: 4.042 sec - in org.apache.hadoop.yarn.server.resourcemanager.TestMoveApplication
Running org.apache.hadoop.yarn.server.resourcemanager.TestRMHA
Tests run: 8, Failures: 0, Errors: 0, Skipped: 0, Time elapsed: 35.686 sec - in org.apache.hadoop.yarn.server.resourcemanager.TestRMHA
Running org.apache.hadoop.yarn.server.resourcemanager.TestRMProxyUsersConf
Tests run: 3, Failures: 0, Errors: 0, Skipped: 0, Time elapsed: 32.302 sec - in org.apache.hadoop.yarn.server.resourcemanager.TestRMProxyUsersConf
Running org.apache.hadoop.yarn.server.resourcemanager.nodelabels.TestRMNodeLabelsManager
Tests run: 10, Failures: 0, Errors: 0, Skipped: 0, Time elapsed: 2.372 sec - in org.apache.hadoop.yarn.server.resourcemanager.nodelabels.TestRMNodeLabelsManager
Running org.apache.hadoop.yarn.server.resourcemanager.logaggregationstatus.TestRMAppLogAggregationStatus
Tests run: 2, Failures: 0, Errors: 0, Skipped: 0, Time elapsed: 3.023 sec - in org.apache.hadoop.yarn.server.resourcemanager.logaggregationstatus.TestRMAppLogAggregationStatus
Running org.apache.hadoop.yarn.server.resourcemanager.TestApplicationACLs
Tests run: 1, Failures: 0, Errors: 0, Skipped: 0, Time elapsed: 8.562 sec - in org.apache.hadoop.yarn.server.resourcemanager.TestApplicationACLs
Running org.apache.hadoop.yarn.server.resourcemanager.metrics.TestSystemMetricsPublisher
Tests run: 3, Failures: 0, Errors: 0, Skipped: 0, Time elapsed: 5.681 sec - in org.apache.hadoop.yarn.server.resourcemanager.metrics.TestSystemMetricsPublisher
Running org.apache.hadoop.yarn.server.resourcemanager.TestKillApplicationWithRMHA
Tests run: 4, Failures: 0, Errors: 0, Skipped: 0, Time elapsed: 25.701 sec - in org.apache.hadoop.yarn.server.resourcemanager.TestKillApplicationWithRMHA

Results :

Tests in error: 
  TestAMRMTokens.testTokenExpiry:118 » Runtime java.lang.RuntimeException: org.x...
  TestAMRMTokens.<init>:98 » Runtime org.xml.sax.SAXParseException; systemId: ja...
  TestAMRMTokens.testAMRMMasterKeysUpdate:355 » Runtime java.lang.RuntimeExcepti...
  TestAMRMTokens.testTokenExpiry:118 » Runtime java.lang.RuntimeException: org.x...

Tests run: 1160, Failures: 0, Errors: 4, Skipped: 1

[INFO] ------------------------------------------------------------------------
[INFO] Reactor Summary:
[INFO] 
[INFO] Apache Hadoop YARN ................................ SUCCESS [  3.159 s]
[INFO] Apache Hadoop YARN API ............................ SUCCESS [03:46 min]
[INFO] Apache Hadoop YARN Common ......................... SUCCESS [02:54 min]
[INFO] Apache Hadoop YARN Server ......................... SUCCESS [  0.091 s]
[INFO] Apache Hadoop YARN Server Common .................. SUCCESS [ 44.952 s]
[INFO] Apache Hadoop YARN NodeManager .................... SUCCESS [07:59 min]
[INFO] Apache Hadoop YARN Web Proxy ...................... SUCCESS [ 25.284 s]
[INFO] Apache Hadoop YARN ApplicationHistoryService ...... SUCCESS [03:21 min]
[INFO] Apache Hadoop YARN ResourceManager ................ FAILURE [53:16 min]
[INFO] Apache Hadoop YARN Server Tests ................... SKIPPED
[INFO] Apache Hadoop YARN Client ......................... SKIPPED
[INFO] Apache Hadoop YARN SharedCacheManager ............. SKIPPED
[INFO] Apache Hadoop YARN Applications ................... SKIPPED
[INFO] Apache Hadoop YARN DistributedShell ............... SKIPPED
[INFO] Apache Hadoop YARN Unmanaged Am Launcher .......... SKIPPED
[INFO] Apache Hadoop YARN Site ........................... SKIPPED
[INFO] Apache Hadoop YARN Registry ....................... SKIPPED
[INFO] Apache Hadoop YARN Project ........................ SKIPPED
[INFO] ------------------------------------------------------------------------
[INFO] BUILD FAILURE
[INFO] ------------------------------------------------------------------------
[INFO] Total time: 01:12 h
[INFO] Finished at: 2015-08-28T15:11:55+00:00
[INFO] Final Memory: 60M/502M
[INFO] ------------------------------------------------------------------------
[ERROR] Failed to execute goal org.apache.maven.plugins:maven-surefire-plugin:2.17:test (default-test)
on project hadoop-yarn-server-resourcemanager: There are test failures.
[ERROR] 
[ERROR] Please refer to <https://builds.apache.org/job/Hadoop-Yarn-trunk/ws/hadoop-yarn-project/hadoop-yarn/hadoop-yarn-server/hadoop-yarn-server-resourcemanager/target/surefire-reports>
for the individual test results.
[ERROR] -> [Help 1]
[ERROR] 
[ERROR] To see the full stack trace of the errors, re-run Maven with the -e switch.
[ERROR] Re-run Maven using the -X switch to enable full debug logging.
[ERROR] 
[ERROR] For more information about the errors and possible solutions, please read the following
articles:
[ERROR] [Help 1] http://cwiki.apache.org/confluence/display/MAVEN/MojoFailureException
[ERROR] 
[ERROR] After correcting the problems, you can resume the build with the command
[ERROR]   mvn <goals> -rf :hadoop-yarn-server-resourcemanager
Build step 'Execute shell' marked build as failure
Archiving artifacts
Recording test results
Updating YARN-1556

Mime
View raw message