hadoop-yarn-dev mailing list archives

Site index · List index
Message view « Date » · « Thread »
Top « Date » · « Thread »
From Apache Jenkins Server <jenk...@builds.apache.org>
Subject Failed: YARN-4023 PreCommit Build #8792
Date Fri, 07 Aug 2015 21:26:11 GMT
Jira: https://issues.apache.org/jira/browse/YARN-4023
Build: https://builds.apache.org/job/PreCommit-YARN-Build/8792/

###################################################################################
########################## LAST 60 LINES OF THE CONSOLE ###########################
[...truncated 429 lines...]
|      |                     |            | hadoop-yarn-server-resourcemanager.
|      |                     |  125m 39s  | 


             Reason | Tests
 Failed unit tests  |  hadoop.yarn.util.TestRackResolver 
                    |  hadoop.yarn.server.resourcemanager.TestRMAdminService 
                    |  hadoop.yarn.server.resourcemanager.scheduler.capacity.TestContainerAllocation

   Timed out tests  |  org.apache.hadoop.yarn.server.resourcemanager.TestRMRestart 


|| Subsystem || Report/Notes ||
============================================================================
| Patch URL | http://issues.apache.org/jira/secure/attachment/12749303/0001-YARN-4023.patch
|
| Optional Tests | javadoc javac unit findbugs checkstyle site |
| git revision | trunk / 8f73bdd |
| Pre-patch Findbugs warnings | /home/jenkins/jenkins-slave/workspace/PreCommit-YARN-Build/patchprocess/trunkFindbugsWarningshadoop-yarn-server-common.html
|
| checkstyle |  /home/jenkins/jenkins-slave/workspace/PreCommit-YARN-Build/patchprocess/diffcheckstylehadoop-yarn-api.txt
|
| hadoop-yarn-api test log | /home/jenkins/jenkins-slave/workspace/PreCommit-YARN-Build/patchprocess/testrun_hadoop-yarn-api.txt
|
| hadoop-yarn-client test log | /home/jenkins/jenkins-slave/workspace/PreCommit-YARN-Build/patchprocess/testrun_hadoop-yarn-client.txt
|
| hadoop-yarn-common test log | /home/jenkins/jenkins-slave/workspace/PreCommit-YARN-Build/patchprocess/testrun_hadoop-yarn-common.txt
|
| hadoop-yarn-server-applicationhistoryservice test log | /home/jenkins/jenkins-slave/workspace/PreCommit-YARN-Build/patchprocess/testrun_hadoop-yarn-server-applicationhistoryservice.txt
|
| hadoop-yarn-server-common test log | /home/jenkins/jenkins-slave/workspace/PreCommit-YARN-Build/patchprocess/testrun_hadoop-yarn-server-common.txt
|
| hadoop-yarn-server-resourcemanager test log | /home/jenkins/jenkins-slave/workspace/PreCommit-YARN-Build/patchprocess/testrun_hadoop-yarn-server-resourcemanager.txt
|
| Test Results | https://builds.apache.org/job/PreCommit-YARN-Build/8792/testReport/ |
| Java | 1.7.0_55 |
| uname | Linux asf904.gq1.ygridcore.net 3.13.0-36-lowlatency #63-Ubuntu SMP PREEMPT Wed Sep
3 21:56:12 UTC 2014 x86_64 x86_64 x86_64 GNU/Linux |


============================================================================
============================================================================
                          Adding comment to JIRA
============================================================================
============================================================================


Comment added.
35ccaffb69e1e4bf0f8cbbe5e0d813095e8e1961 logged out


============================================================================
============================================================================
                              Finished build.
============================================================================
============================================================================


Build step 'Execute shell' marked build as failure
Archiving artifacts
Sending artifact delta relative to PreCommit-YARN-Build #8782
Archived 102 artifacts
Archive block size is 32768
Received 232 blocks and 28908798 bytes
Compression is 20.8%
Took 6.5 sec
[description-setter] Could not determine description.
Recording test results
Email was triggered for: Failure
Sending email for trigger: Failure



###################################################################################
############################## FAILED TESTS (if any) ##############################
5 tests failed.
FAILED:  org.apache.hadoop.yarn.util.TestRackResolver.testCaching

Error Message:
expected:</[default-rack]> but was:</[rack1]>

Stack Trace:
org.junit.ComparisonFailure: expected:</[default-rack]> but was:</[rack1]>
	at org.junit.Assert.assertEquals(Assert.java:115)
	at org.junit.Assert.assertEquals(Assert.java:144)
	at org.apache.hadoop.yarn.util.TestRackResolver.testCaching(TestRackResolver.java:102)


FAILED:  org.apache.hadoop.yarn.server.resourcemanager.TestRMAdminService.testModifyLabelsOnNodesWithDistributedConfigurationDisabled

Error Message:
null

Stack Trace:
java.lang.NullPointerException: null
	at org.apache.hadoop.util.JvmPauseMonitor.stop(JvmPauseMonitor.java:86)
	at org.apache.hadoop.yarn.server.resourcemanager.ResourceManager$RMActiveServices.serviceStop(ResourceManager.java:601)
	at org.apache.hadoop.service.AbstractService.stop(AbstractService.java:221)
	at org.apache.hadoop.yarn.server.resourcemanager.ResourceManager.stopActiveServices(ResourceManager.java:983)
	at org.apache.hadoop.yarn.server.resourcemanager.ResourceManager.transitionToStandby(ResourceManager.java:1038)
	at org.apache.hadoop.yarn.server.resourcemanager.ResourceManager.serviceStop(ResourceManager.java:1085)
	at org.apache.hadoop.service.AbstractService.stop(AbstractService.java:221)
	at org.apache.hadoop.service.AbstractService.close(AbstractService.java:250)
	at org.apache.hadoop.yarn.server.resourcemanager.TestRMAdminService.testModifyLabelsOnNodesWithDistributedConfigurationDisabled(TestRMAdminService.java:824)


FAILED:  org.apache.hadoop.yarn.server.resourcemanager.TestRMAdminService.testRemoveClusterNodeLabelsWithDistributedConfigurationEnabled

Error Message:
null

Stack Trace:
java.lang.NullPointerException: null
	at org.apache.hadoop.util.JvmPauseMonitor.stop(JvmPauseMonitor.java:86)
	at org.apache.hadoop.yarn.server.resourcemanager.ResourceManager$RMActiveServices.serviceStop(ResourceManager.java:601)
	at org.apache.hadoop.service.AbstractService.stop(AbstractService.java:221)
	at org.apache.hadoop.yarn.server.resourcemanager.ResourceManager.stopActiveServices(ResourceManager.java:983)
	at org.apache.hadoop.yarn.server.resourcemanager.ResourceManager.transitionToStandby(ResourceManager.java:1038)
	at org.apache.hadoop.yarn.server.resourcemanager.ResourceManager.serviceStop(ResourceManager.java:1085)
	at org.apache.hadoop.service.AbstractService.stop(AbstractService.java:221)
	at org.apache.hadoop.service.AbstractService.close(AbstractService.java:250)
	at org.apache.hadoop.yarn.server.resourcemanager.TestRMAdminService.testRemoveClusterNodeLabelsWithDistributedConfigurationEnabled(TestRMAdminService.java:867)


FAILED:  org.apache.hadoop.yarn.server.resourcemanager.scheduler.capacity.TestContainerAllocation.testAMContainerAllocationWhenDNSUnavailable

Error Message:
expected:<SCHEDULED> but was:<ALLOCATED>

Stack Trace:
java.lang.AssertionError: expected:<SCHEDULED> but was:<ALLOCATED>
	at org.junit.Assert.fail(Assert.java:88)
	at org.junit.Assert.failNotEquals(Assert.java:743)
	at org.junit.Assert.assertEquals(Assert.java:118)
	at org.junit.Assert.assertEquals(Assert.java:144)
	at org.apache.hadoop.yarn.server.resourcemanager.scheduler.capacity.TestContainerAllocation.testAMContainerAllocationWhenDNSUnavailable(TestContainerAllocation.java:321)


FAILED:  org.apache.hadoop.yarn.server.resourcemanager.scheduler.capacity.TestContainerAllocation.testNormalContainerAllocationWhenDNSUnavailable

Error Message:
expected:<0> but was:<1>

Stack Trace:
java.lang.AssertionError: expected:<0> but was:<1>
	at org.junit.Assert.fail(Assert.java:88)
	at org.junit.Assert.failNotEquals(Assert.java:743)
	at org.junit.Assert.assertEquals(Assert.java:118)
	at org.junit.Assert.assertEquals(Assert.java:555)
	at org.junit.Assert.assertEquals(Assert.java:542)
	at org.apache.hadoop.yarn.server.resourcemanager.scheduler.capacity.TestContainerAllocation.testNormalContainerAllocationWhenDNSUnavailable(TestContainerAllocation.java:206)



Mime
  • Unnamed multipart/mixed (inline, None, 0 bytes)
View raw message