hadoop-yarn-dev mailing list archives

Site index · List index
Message view « Date » · « Thread »
Top « Date » · « Thread »
From Apache Jenkins Server <jenk...@builds.apache.org>
Subject Hadoop-Yarn-trunk-Java8 - Build # 302 - Failure
Date Mon, 24 Aug 2015 05:48:40 GMT
See https://builds.apache.org/job/Hadoop-Yarn-trunk-Java8/302/

###################################################################################
########################## LAST 60 LINES OF THE CONSOLE ###########################
[...truncated 4690 lines...]
  TestContainerManager.<init>:94->BaseContainerManagerTest.<init>:91 » UnsupportedFileSystem
  TestContainerManager.<init>:94->BaseContainerManagerTest.<init>:91 » UnsupportedFileSystem
  TestContainerManager.<init>:94->BaseContainerManagerTest.<init>:91 » UnsupportedFileSystem
  TestContainerManager.<init>:94->BaseContainerManagerTest.<init>:91 » UnsupportedFileSystem
  TestContainerManager.<init>:94->BaseContainerManagerTest.<init>:91 » UnsupportedFileSystem
  TestContainerManager.<init>:94->BaseContainerManagerTest.<init>:91 » UnsupportedFileSystem
  TestContainerManager.<init>:94->BaseContainerManagerTest.<init>:91 » UnsupportedFileSystem
  TestContainerManager.<init>:94->BaseContainerManagerTest.<init>:91 » UnsupportedFileSystem

Tests run: 349, Failures: 0, Errors: 12, Skipped: 17

[INFO] ------------------------------------------------------------------------
[INFO] Reactor Summary:
[INFO] 
[INFO] Apache Hadoop YARN ................................ SUCCESS [  3.220 s]
[INFO] Apache Hadoop YARN API ............................ SUCCESS [01:14 min]
[INFO] Apache Hadoop YARN Common ......................... SUCCESS [02:16 min]
[INFO] Apache Hadoop YARN Server ......................... SUCCESS [  0.065 s]
[INFO] Apache Hadoop YARN Server Common .................. SUCCESS [ 36.701 s]
[INFO] Apache Hadoop YARN NodeManager .................... FAILURE [07:00 min]
[INFO] Apache Hadoop YARN Web Proxy ...................... SKIPPED
[INFO] Apache Hadoop YARN ApplicationHistoryService ...... SKIPPED
[INFO] Apache Hadoop YARN ResourceManager ................ SKIPPED
[INFO] Apache Hadoop YARN Server Tests ................... SKIPPED
[INFO] Apache Hadoop YARN Client ......................... SKIPPED
[INFO] Apache Hadoop YARN SharedCacheManager ............. SKIPPED
[INFO] Apache Hadoop YARN Applications ................... SKIPPED
[INFO] Apache Hadoop YARN DistributedShell ............... SKIPPED
[INFO] Apache Hadoop YARN Unmanaged Am Launcher .......... SKIPPED
[INFO] Apache Hadoop YARN Site ........................... SKIPPED
[INFO] Apache Hadoop YARN Registry ....................... SKIPPED
[INFO] Apache Hadoop YARN Project ........................ SKIPPED
[INFO] ------------------------------------------------------------------------
[INFO] BUILD FAILURE
[INFO] ------------------------------------------------------------------------
[INFO] Total time: 11:12 min
[INFO] Finished at: 2015-08-24T05:49:40+00:00
[INFO] Final Memory: 86M/1048M
[INFO] ------------------------------------------------------------------------
[ERROR] Failed to execute goal org.apache.maven.plugins:maven-surefire-plugin:2.17:test (default-test)
on project hadoop-yarn-server-nodemanager: There are test failures.
[ERROR] 
[ERROR] Please refer to /home/jenkins/jenkins-slave/workspace/Hadoop-Yarn-trunk-Java8/hadoop-yarn-project/hadoop-yarn/hadoop-yarn-server/hadoop-yarn-server-nodemanager/target/surefire-reports
for the individual test results.
[ERROR] -> [Help 1]
[ERROR] 
[ERROR] To see the full stack trace of the errors, re-run Maven with the -e switch.
[ERROR] Re-run Maven using the -X switch to enable full debug logging.
[ERROR] 
[ERROR] For more information about the errors and possible solutions, please read the following
articles:
[ERROR] [Help 1] http://cwiki.apache.org/confluence/display/MAVEN/MojoFailureException
[ERROR] 
[ERROR] After correcting the problems, you can resume the build with the command
[ERROR]   mvn <goals> -rf :hadoop-yarn-server-nodemanager
Build step 'Execute shell' marked build as failure
Archiving artifacts
Recording test results
Updating HDFS-8942
Sending e-mails to: yarn-dev@hadoop.apache.org
Email was triggered for: Failure
Sending email for trigger: Failure



###################################################################################
############################## FAILED TESTS (if any) ##############################
12 tests failed.
REGRESSION:  org.apache.hadoop.yarn.server.nodemanager.containermanager.TestContainerManager.testContainerLaunchAndExitFailure

Error Message:
org/apache/hadoop/security/proto/SecurityProtos$TokenProtoOrBuilder

Stack Trace:
java.lang.NoClassDefFoundError: org/apache/hadoop/security/proto/SecurityProtos$TokenProtoOrBuilder
	at java.net.URLClassLoader$1.run(URLClassLoader.java:372)
	at java.net.URLClassLoader$1.run(URLClassLoader.java:361)
	at java.security.AccessController.doPrivileged(Native Method)
	at java.net.URLClassLoader.findClass(URLClassLoader.java:360)
	at java.lang.ClassLoader.loadClass(ClassLoader.java:424)
	at sun.misc.Launcher$AppClassLoader.loadClass(Launcher.java:308)
	at java.lang.ClassLoader.loadClass(ClassLoader.java:357)
	at java.lang.Class.forName0(Native Method)
	at java.lang.Class.forName(Class.java:340)
	at org.apache.hadoop.conf.Configuration.getClassByNameOrNull(Configuration.java:2201)
	at org.apache.hadoop.conf.Configuration.getClassByName(Configuration.java:2166)
	at org.apache.hadoop.yarn.factories.impl.pb.RecordFactoryPBImpl.newRecordInstance(RecordFactoryPBImpl.java:56)
	at org.apache.hadoop.yarn.server.utils.BuilderUtils.newToken(BuilderUtils.java:228)
	at org.apache.hadoop.yarn.server.utils.BuilderUtils.newContainerToken(BuilderUtils.java:259)
	at org.apache.hadoop.yarn.server.nodemanager.containermanager.TestContainerManager.createContainerToken(TestContainerManager.java:902)
	at org.apache.hadoop.yarn.server.nodemanager.containermanager.TestContainerManager.createContainerToken(TestContainerManager.java:886)
	at org.apache.hadoop.yarn.server.nodemanager.containermanager.TestContainerManager.testContainerLaunchAndExit(TestContainerManager.java:417)
	at org.apache.hadoop.yarn.server.nodemanager.containermanager.TestContainerManager.testContainerLaunchAndExitFailure(TestContainerManager.java:459)


REGRESSION:  org.apache.hadoop.yarn.server.nodemanager.containermanager.TestContainerManager.testContainerLaunchAndExitFailure

Error Message:
org/apache/hadoop/service/ServiceOperations

Stack Trace:
java.lang.NoClassDefFoundError: org/apache/hadoop/service/ServiceOperations
	at org.apache.hadoop.service.CompositeService.stop(CompositeService.java:157)
	at org.apache.hadoop.service.CompositeService.serviceStop(CompositeService.java:131)
	at org.apache.hadoop.yarn.server.nodemanager.containermanager.ContainerManagerImpl.serviceStop(ContainerManagerImpl.java:520)
	at org.apache.hadoop.service.AbstractService.stop(AbstractService.java:221)
	at org.apache.hadoop.yarn.server.nodemanager.containermanager.BaseContainerManagerTest.tearDown(BaseContainerManagerTest.java:257)
	at sun.reflect.NativeMethodAccessorImpl.invoke0(Native Method)
	at sun.reflect.NativeMethodAccessorImpl.invoke(NativeMethodAccessorImpl.java:62)
	at sun.reflect.DelegatingMethodAccessorImpl.invoke(DelegatingMethodAccessorImpl.java:43)
	at java.lang.reflect.Method.invoke(Method.java:483)
	at org.junit.runners.model.FrameworkMethod$1.runReflectiveCall(FrameworkMethod.java:47)
	at org.junit.internal.runners.model.ReflectiveCallable.run(ReflectiveCallable.java:12)
	at org.junit.runners.model.FrameworkMethod.invokeExplosively(FrameworkMethod.java:44)
	at org.junit.internal.runners.statements.RunAfters.evaluate(RunAfters.java:33)
	at org.junit.runners.ParentRunner.runLeaf(ParentRunner.java:271)
	at org.junit.runners.BlockJUnit4ClassRunner.runChild(BlockJUnit4ClassRunner.java:70)
	at org.junit.runners.BlockJUnit4ClassRunner.runChild(BlockJUnit4ClassRunner.java:50)
	at org.junit.runners.ParentRunner$3.run(ParentRunner.java:238)
	at org.junit.runners.ParentRunner$1.schedule(ParentRunner.java:63)
	at org.junit.runners.ParentRunner.runChildren(ParentRunner.java:236)
	at org.junit.runners.ParentRunner.access$000(ParentRunner.java:53)
	at org.junit.runners.ParentRunner$2.evaluate(ParentRunner.java:229)
	at org.junit.runners.ParentRunner.run(ParentRunner.java:309)
	at org.apache.maven.surefire.junit4.JUnit4Provider.execute(JUnit4Provider.java:264)
	at org.apache.maven.surefire.junit4.JUnit4Provider.executeTestSet(JUnit4Provider.java:153)
	at org.apache.maven.surefire.junit4.JUnit4Provider.invoke(JUnit4Provider.java:124)
	at org.apache.maven.surefire.booter.ForkedBooter.invokeProviderInSameClassLoader(ForkedBooter.java:200)
	at org.apache.maven.surefire.booter.ForkedBooter.runSuitesInProcess(ForkedBooter.java:153)
	at org.apache.maven.surefire.booter.ForkedBooter.main(ForkedBooter.java:103)
Caused by: java.lang.ClassNotFoundException: org.apache.hadoop.service.ServiceOperations
	at java.net.URLClassLoader$1.run(URLClassLoader.java:372)
	at java.net.URLClassLoader$1.run(URLClassLoader.java:361)
	at java.security.AccessController.doPrivileged(Native Method)
	at java.net.URLClassLoader.findClass(URLClassLoader.java:360)
	at java.lang.ClassLoader.loadClass(ClassLoader.java:424)
	at sun.misc.Launcher$AppClassLoader.loadClass(Launcher.java:308)
	at java.lang.ClassLoader.loadClass(ClassLoader.java:357)
	at org.apache.hadoop.service.CompositeService.stop(CompositeService.java:157)
	at org.apache.hadoop.service.CompositeService.serviceStop(CompositeService.java:131)
	at org.apache.hadoop.yarn.server.nodemanager.containermanager.ContainerManagerImpl.serviceStop(ContainerManagerImpl.java:520)
	at org.apache.hadoop.service.AbstractService.stop(AbstractService.java:221)
	at org.apache.hadoop.yarn.server.nodemanager.containermanager.BaseContainerManagerTest.tearDown(BaseContainerManagerTest.java:257)
	at sun.reflect.NativeMethodAccessorImpl.invoke0(Native Method)
	at sun.reflect.NativeMethodAccessorImpl.invoke(NativeMethodAccessorImpl.java:62)
	at sun.reflect.DelegatingMethodAccessorImpl.invoke(DelegatingMethodAccessorImpl.java:43)
	at java.lang.reflect.Method.invoke(Method.java:483)
	at org.junit.runners.model.FrameworkMethod$1.runReflectiveCall(FrameworkMethod.java:47)
	at org.junit.internal.runners.model.ReflectiveCallable.run(ReflectiveCallable.java:12)
	at org.junit.runners.model.FrameworkMethod.invokeExplosively(FrameworkMethod.java:44)
	at org.junit.internal.runners.statements.RunAfters.evaluate(RunAfters.java:33)
	at org.junit.runners.ParentRunner.runLeaf(ParentRunner.java:271)
	at org.junit.runners.BlockJUnit4ClassRunner.runChild(BlockJUnit4ClassRunner.java:70)
	at org.junit.runners.BlockJUnit4ClassRunner.runChild(BlockJUnit4ClassRunner.java:50)
	at org.junit.runners.ParentRunner$3.run(ParentRunner.java:238)
	at org.junit.runners.ParentRunner$1.schedule(ParentRunner.java:63)
	at org.junit.runners.ParentRunner.runChildren(ParentRunner.java:236)
	at org.junit.runners.ParentRunner.access$000(ParentRunner.java:53)
	at org.junit.runners.ParentRunner$2.evaluate(ParentRunner.java:229)
	at org.junit.runners.ParentRunner.run(ParentRunner.java:309)
	at org.apache.maven.surefire.junit4.JUnit4Provider.execute(JUnit4Provider.java:264)
	at org.apache.maven.surefire.junit4.JUnit4Provider.executeTestSet(JUnit4Provider.java:153)
	at org.apache.maven.surefire.junit4.JUnit4Provider.invoke(JUnit4Provider.java:124)
	at org.apache.maven.surefire.booter.ForkedBooter.invokeProviderInSameClassLoader(ForkedBooter.java:200)
	at org.apache.maven.surefire.booter.ForkedBooter.runSuitesInProcess(ForkedBooter.java:153)
	at org.apache.maven.surefire.booter.ForkedBooter.main(ForkedBooter.java:103)


REGRESSION:  org.apache.hadoop.yarn.server.nodemanager.containermanager.TestContainerManager.testContainerSetup

Error Message:
fs.AbstractFileSystem.file.impl=null: No AbstractFileSystem configured for scheme: file

Stack Trace:
org.apache.hadoop.fs.UnsupportedFileSystemException: fs.AbstractFileSystem.file.impl=null:
No AbstractFileSystem configured for scheme: file
	at org.apache.hadoop.fs.AbstractFileSystem.createFileSystem(AbstractFileSystem.java:161)
	at org.apache.hadoop.fs.AbstractFileSystem.get(AbstractFileSystem.java:250)
	at org.apache.hadoop.fs.FileContext$2.run(FileContext.java:329)
	at org.apache.hadoop.fs.FileContext$2.run(FileContext.java:326)
	at java.security.AccessController.doPrivileged(Native Method)
	at javax.security.auth.Subject.doAs(Subject.java:422)
	at org.apache.hadoop.security.UserGroupInformation.doAs(UserGroupInformation.java:1667)
	at org.apache.hadoop.fs.FileContext.getAbstractFileSystem(FileContext.java:326)
	at org.apache.hadoop.fs.FileContext.getFileContext(FileContext.java:443)
	at org.apache.hadoop.fs.FileContext.getFileContext(FileContext.java:420)
	at org.apache.hadoop.fs.FileContext.getLocalFSFileContext(FileContext.java:406)
	at org.apache.hadoop.yarn.server.nodemanager.containermanager.BaseContainerManagerTest.<init>(BaseContainerManagerTest.java:91)
	at org.apache.hadoop.yarn.server.nodemanager.containermanager.TestContainerManager.<init>(TestContainerManager.java:94)


REGRESSION:  org.apache.hadoop.yarn.server.nodemanager.containermanager.TestContainerManager.testContainerManagerInitialization

Error Message:
fs.AbstractFileSystem.file.impl=null: No AbstractFileSystem configured for scheme: file

Stack Trace:
org.apache.hadoop.fs.UnsupportedFileSystemException: fs.AbstractFileSystem.file.impl=null:
No AbstractFileSystem configured for scheme: file
	at org.apache.hadoop.fs.AbstractFileSystem.createFileSystem(AbstractFileSystem.java:161)
	at org.apache.hadoop.fs.AbstractFileSystem.get(AbstractFileSystem.java:250)
	at org.apache.hadoop.fs.FileContext$2.run(FileContext.java:329)
	at org.apache.hadoop.fs.FileContext$2.run(FileContext.java:326)
	at java.security.AccessController.doPrivileged(Native Method)
	at javax.security.auth.Subject.doAs(Subject.java:422)
	at org.apache.hadoop.security.UserGroupInformation.doAs(UserGroupInformation.java:1667)
	at org.apache.hadoop.fs.FileContext.getAbstractFileSystem(FileContext.java:326)
	at org.apache.hadoop.fs.FileContext.getFileContext(FileContext.java:443)
	at org.apache.hadoop.fs.FileContext.getFileContext(FileContext.java:420)
	at org.apache.hadoop.fs.FileContext.getLocalFSFileContext(FileContext.java:406)
	at org.apache.hadoop.yarn.server.nodemanager.containermanager.BaseContainerManagerTest.<init>(BaseContainerManagerTest.java:91)
	at org.apache.hadoop.yarn.server.nodemanager.containermanager.TestContainerManager.<init>(TestContainerManager.java:94)


REGRESSION:  org.apache.hadoop.yarn.server.nodemanager.containermanager.TestContainerManager.testStartContainerFailureWithUnknownAuxService

Error Message:
fs.AbstractFileSystem.file.impl=null: No AbstractFileSystem configured for scheme: file

Stack Trace:
org.apache.hadoop.fs.UnsupportedFileSystemException: fs.AbstractFileSystem.file.impl=null:
No AbstractFileSystem configured for scheme: file
	at org.apache.hadoop.fs.AbstractFileSystem.createFileSystem(AbstractFileSystem.java:161)
	at org.apache.hadoop.fs.AbstractFileSystem.get(AbstractFileSystem.java:250)
	at org.apache.hadoop.fs.FileContext$2.run(FileContext.java:329)
	at org.apache.hadoop.fs.FileContext$2.run(FileContext.java:326)
	at java.security.AccessController.doPrivileged(Native Method)
	at javax.security.auth.Subject.doAs(Subject.java:422)
	at org.apache.hadoop.security.UserGroupInformation.doAs(UserGroupInformation.java:1667)
	at org.apache.hadoop.fs.FileContext.getAbstractFileSystem(FileContext.java:326)
	at org.apache.hadoop.fs.FileContext.getFileContext(FileContext.java:443)
	at org.apache.hadoop.fs.FileContext.getFileContext(FileContext.java:420)
	at org.apache.hadoop.fs.FileContext.getLocalFSFileContext(FileContext.java:406)
	at org.apache.hadoop.yarn.server.nodemanager.containermanager.BaseContainerManagerTest.<init>(BaseContainerManagerTest.java:91)
	at org.apache.hadoop.yarn.server.nodemanager.containermanager.TestContainerManager.<init>(TestContainerManager.java:94)


REGRESSION:  org.apache.hadoop.yarn.server.nodemanager.containermanager.TestContainerManager.testContainerLaunchAndStop

Error Message:
fs.AbstractFileSystem.file.impl=null: No AbstractFileSystem configured for scheme: file

Stack Trace:
org.apache.hadoop.fs.UnsupportedFileSystemException: fs.AbstractFileSystem.file.impl=null:
No AbstractFileSystem configured for scheme: file
	at org.apache.hadoop.fs.AbstractFileSystem.createFileSystem(AbstractFileSystem.java:161)
	at org.apache.hadoop.fs.AbstractFileSystem.get(AbstractFileSystem.java:250)
	at org.apache.hadoop.fs.FileContext$2.run(FileContext.java:329)
	at org.apache.hadoop.fs.FileContext$2.run(FileContext.java:326)
	at java.security.AccessController.doPrivileged(Native Method)
	at javax.security.auth.Subject.doAs(Subject.java:422)
	at org.apache.hadoop.security.UserGroupInformation.doAs(UserGroupInformation.java:1667)
	at org.apache.hadoop.fs.FileContext.getAbstractFileSystem(FileContext.java:326)
	at org.apache.hadoop.fs.FileContext.getFileContext(FileContext.java:443)
	at org.apache.hadoop.fs.FileContext.getFileContext(FileContext.java:420)
	at org.apache.hadoop.fs.FileContext.getLocalFSFileContext(FileContext.java:406)
	at org.apache.hadoop.yarn.server.nodemanager.containermanager.BaseContainerManagerTest.<init>(BaseContainerManagerTest.java:91)
	at org.apache.hadoop.yarn.server.nodemanager.containermanager.TestContainerManager.<init>(TestContainerManager.java:94)


REGRESSION:  org.apache.hadoop.yarn.server.nodemanager.containermanager.TestContainerManager.testLocalFilesCleanup

Error Message:
fs.AbstractFileSystem.file.impl=null: No AbstractFileSystem configured for scheme: file

Stack Trace:
org.apache.hadoop.fs.UnsupportedFileSystemException: fs.AbstractFileSystem.file.impl=null:
No AbstractFileSystem configured for scheme: file
	at org.apache.hadoop.fs.AbstractFileSystem.createFileSystem(AbstractFileSystem.java:161)
	at org.apache.hadoop.fs.AbstractFileSystem.get(AbstractFileSystem.java:250)
	at org.apache.hadoop.fs.FileContext$2.run(FileContext.java:329)
	at org.apache.hadoop.fs.FileContext$2.run(FileContext.java:326)
	at java.security.AccessController.doPrivileged(Native Method)
	at javax.security.auth.Subject.doAs(Subject.java:422)
	at org.apache.hadoop.security.UserGroupInformation.doAs(UserGroupInformation.java:1667)
	at org.apache.hadoop.fs.FileContext.getAbstractFileSystem(FileContext.java:326)
	at org.apache.hadoop.fs.FileContext.getFileContext(FileContext.java:443)
	at org.apache.hadoop.fs.FileContext.getFileContext(FileContext.java:420)
	at org.apache.hadoop.fs.FileContext.getLocalFSFileContext(FileContext.java:406)
	at org.apache.hadoop.yarn.server.nodemanager.containermanager.BaseContainerManagerTest.<init>(BaseContainerManagerTest.java:91)
	at org.apache.hadoop.yarn.server.nodemanager.containermanager.TestContainerManager.<init>(TestContainerManager.java:94)


REGRESSION:  org.apache.hadoop.yarn.server.nodemanager.containermanager.TestContainerManager.testContainerLaunchFromPreviousRM

Error Message:
fs.AbstractFileSystem.file.impl=null: No AbstractFileSystem configured for scheme: file

Stack Trace:
org.apache.hadoop.fs.UnsupportedFileSystemException: fs.AbstractFileSystem.file.impl=null:
No AbstractFileSystem configured for scheme: file
	at org.apache.hadoop.fs.AbstractFileSystem.createFileSystem(AbstractFileSystem.java:161)
	at org.apache.hadoop.fs.AbstractFileSystem.get(AbstractFileSystem.java:250)
	at org.apache.hadoop.fs.FileContext$2.run(FileContext.java:329)
	at org.apache.hadoop.fs.FileContext$2.run(FileContext.java:326)
	at java.security.AccessController.doPrivileged(Native Method)
	at javax.security.auth.Subject.doAs(Subject.java:422)
	at org.apache.hadoop.security.UserGroupInformation.doAs(UserGroupInformation.java:1667)
	at org.apache.hadoop.fs.FileContext.getAbstractFileSystem(FileContext.java:326)
	at org.apache.hadoop.fs.FileContext.getFileContext(FileContext.java:443)
	at org.apache.hadoop.fs.FileContext.getFileContext(FileContext.java:420)
	at org.apache.hadoop.fs.FileContext.getLocalFSFileContext(FileContext.java:406)
	at org.apache.hadoop.yarn.server.nodemanager.containermanager.BaseContainerManagerTest.<init>(BaseContainerManagerTest.java:91)
	at org.apache.hadoop.yarn.server.nodemanager.containermanager.TestContainerManager.<init>(TestContainerManager.java:94)


REGRESSION:  org.apache.hadoop.yarn.server.nodemanager.containermanager.TestContainerManager.testNullTokens

Error Message:
fs.AbstractFileSystem.file.impl=null: No AbstractFileSystem configured for scheme: file

Stack Trace:
org.apache.hadoop.fs.UnsupportedFileSystemException: fs.AbstractFileSystem.file.impl=null:
No AbstractFileSystem configured for scheme: file
	at org.apache.hadoop.fs.AbstractFileSystem.createFileSystem(AbstractFileSystem.java:161)
	at org.apache.hadoop.fs.AbstractFileSystem.get(AbstractFileSystem.java:250)
	at org.apache.hadoop.fs.FileContext$2.run(FileContext.java:329)
	at org.apache.hadoop.fs.FileContext$2.run(FileContext.java:326)
	at java.security.AccessController.doPrivileged(Native Method)
	at javax.security.auth.Subject.doAs(Subject.java:422)
	at org.apache.hadoop.security.UserGroupInformation.doAs(UserGroupInformation.java:1667)
	at org.apache.hadoop.fs.FileContext.getAbstractFileSystem(FileContext.java:326)
	at org.apache.hadoop.fs.FileContext.getFileContext(FileContext.java:443)
	at org.apache.hadoop.fs.FileContext.getFileContext(FileContext.java:420)
	at org.apache.hadoop.fs.FileContext.getLocalFSFileContext(FileContext.java:406)
	at org.apache.hadoop.yarn.server.nodemanager.containermanager.BaseContainerManagerTest.<init>(BaseContainerManagerTest.java:91)
	at org.apache.hadoop.yarn.server.nodemanager.containermanager.TestContainerManager.<init>(TestContainerManager.java:94)


REGRESSION:  org.apache.hadoop.yarn.server.nodemanager.containermanager.TestContainerManager.testContainerLaunchAndExitSuccess

Error Message:
fs.AbstractFileSystem.file.impl=null: No AbstractFileSystem configured for scheme: file

Stack Trace:
org.apache.hadoop.fs.UnsupportedFileSystemException: fs.AbstractFileSystem.file.impl=null:
No AbstractFileSystem configured for scheme: file
	at org.apache.hadoop.fs.AbstractFileSystem.createFileSystem(AbstractFileSystem.java:161)
	at org.apache.hadoop.fs.AbstractFileSystem.get(AbstractFileSystem.java:250)
	at org.apache.hadoop.fs.FileContext$2.run(FileContext.java:329)
	at org.apache.hadoop.fs.FileContext$2.run(FileContext.java:326)
	at java.security.AccessController.doPrivileged(Native Method)
	at javax.security.auth.Subject.doAs(Subject.java:422)
	at org.apache.hadoop.security.UserGroupInformation.doAs(UserGroupInformation.java:1667)
	at org.apache.hadoop.fs.FileContext.getAbstractFileSystem(FileContext.java:326)
	at org.apache.hadoop.fs.FileContext.getFileContext(FileContext.java:443)
	at org.apache.hadoop.fs.FileContext.getFileContext(FileContext.java:420)
	at org.apache.hadoop.fs.FileContext.getLocalFSFileContext(FileContext.java:406)
	at org.apache.hadoop.yarn.server.nodemanager.containermanager.BaseContainerManagerTest.<init>(BaseContainerManagerTest.java:91)
	at org.apache.hadoop.yarn.server.nodemanager.containermanager.TestContainerManager.<init>(TestContainerManager.java:94)


REGRESSION:  org.apache.hadoop.yarn.server.nodemanager.containermanager.TestContainerManager.testMultipleContainersLaunch

Error Message:
fs.AbstractFileSystem.file.impl=null: No AbstractFileSystem configured for scheme: file

Stack Trace:
org.apache.hadoop.fs.UnsupportedFileSystemException: fs.AbstractFileSystem.file.impl=null:
No AbstractFileSystem configured for scheme: file
	at org.apache.hadoop.fs.AbstractFileSystem.createFileSystem(AbstractFileSystem.java:161)
	at org.apache.hadoop.fs.AbstractFileSystem.get(AbstractFileSystem.java:250)
	at org.apache.hadoop.fs.FileContext$2.run(FileContext.java:329)
	at org.apache.hadoop.fs.FileContext$2.run(FileContext.java:326)
	at java.security.AccessController.doPrivileged(Native Method)
	at javax.security.auth.Subject.doAs(Subject.java:422)
	at org.apache.hadoop.security.UserGroupInformation.doAs(UserGroupInformation.java:1667)
	at org.apache.hadoop.fs.FileContext.getAbstractFileSystem(FileContext.java:326)
	at org.apache.hadoop.fs.FileContext.getFileContext(FileContext.java:443)
	at org.apache.hadoop.fs.FileContext.getFileContext(FileContext.java:420)
	at org.apache.hadoop.fs.FileContext.getLocalFSFileContext(FileContext.java:406)
	at org.apache.hadoop.yarn.server.nodemanager.containermanager.BaseContainerManagerTest.<init>(BaseContainerManagerTest.java:91)
	at org.apache.hadoop.yarn.server.nodemanager.containermanager.TestContainerManager.<init>(TestContainerManager.java:94)


REGRESSION:  org.apache.hadoop.yarn.server.nodemanager.containermanager.TestContainerManager.testMultipleContainersStopAndGetStatus

Error Message:
fs.AbstractFileSystem.file.impl=null: No AbstractFileSystem configured for scheme: file

Stack Trace:
org.apache.hadoop.fs.UnsupportedFileSystemException: fs.AbstractFileSystem.file.impl=null:
No AbstractFileSystem configured for scheme: file
	at org.apache.hadoop.fs.AbstractFileSystem.createFileSystem(AbstractFileSystem.java:161)
	at org.apache.hadoop.fs.AbstractFileSystem.get(AbstractFileSystem.java:250)
	at org.apache.hadoop.fs.FileContext$2.run(FileContext.java:329)
	at org.apache.hadoop.fs.FileContext$2.run(FileContext.java:326)
	at java.security.AccessController.doPrivileged(Native Method)
	at javax.security.auth.Subject.doAs(Subject.java:422)
	at org.apache.hadoop.security.UserGroupInformation.doAs(UserGroupInformation.java:1667)
	at org.apache.hadoop.fs.FileContext.getAbstractFileSystem(FileContext.java:326)
	at org.apache.hadoop.fs.FileContext.getFileContext(FileContext.java:443)
	at org.apache.hadoop.fs.FileContext.getFileContext(FileContext.java:420)
	at org.apache.hadoop.fs.FileContext.getLocalFSFileContext(FileContext.java:406)
	at org.apache.hadoop.yarn.server.nodemanager.containermanager.BaseContainerManagerTest.<init>(BaseContainerManagerTest.java:91)
	at org.apache.hadoop.yarn.server.nodemanager.containermanager.TestContainerManager.<init>(TestContainerManager.java:94)



Mime
  • Unnamed multipart/mixed (inline, None, 0 bytes)
View raw message