hadoop-yarn-dev mailing list archives

Site index · List index
Message view « Date » · « Thread »
Top « Date » · « Thread »
From Apache Jenkins Server <jenk...@builds.apache.org>
Subject Failed: YARN-4026 PreCommit Build #8829
Date Wed, 12 Aug 2015 06:47:50 GMT
Jira: https://issues.apache.org/jira/browse/YARN-4026
Build: https://builds.apache.org/job/PreCommit-YARN-Build/8829/

###################################################################################
########################## LAST 60 LINES OF THE CONSOLE ###########################
[...truncated 315 lines...]
|      |                     |            | --whitespace=fix.
|  +1  |            install  |  1m 20s    | mvn install still works. 
|  +1  |    eclipse:eclipse  |  0m 33s    | The patch built with 
|      |                     |            | eclipse:eclipse.
|  +1  |           findbugs  |  1m 29s    | The patch does not introduce any 
|      |                     |            | new Findbugs (version 3.0.0)
|      |                     |            | warnings.
|  -1  |         yarn tests  |  53m 24s   | Tests failed in 
|      |                     |            | hadoop-yarn-server-resourcemanager.
|      |                     |  91m 53s   | 


             Reason | Tests
 Failed unit tests  |  hadoop.yarn.server.resourcemanager.scheduler.capacity.TestContainerAllocation



|| Subsystem || Report/Notes ||
============================================================================
| Patch URL | http://issues.apache.org/jira/secure/attachment/12750004/YARN-4026.3.patch |
| Optional Tests | javadoc javac unit findbugs checkstyle |
| git revision | trunk / 3ae716f |
| checkstyle |  /home/jenkins/jenkins-slave/workspace/PreCommit-YARN-Build/patchprocess/diffcheckstylehadoop-yarn-server-resourcemanager.txt
|
| whitespace | /home/jenkins/jenkins-slave/workspace/PreCommit-YARN-Build/patchprocess/whitespace.txt
|
| hadoop-yarn-server-resourcemanager test log | /home/jenkins/jenkins-slave/workspace/PreCommit-YARN-Build/patchprocess/testrun_hadoop-yarn-server-resourcemanager.txt
|
| Test Results | https://builds.apache.org/job/PreCommit-YARN-Build/8829/testReport/ |
| Java | 1.7.0_55 |
| uname | Linux asf909.gq1.ygridcore.net 3.13.0-36-lowlatency #63-Ubuntu SMP PREEMPT Wed Sep
3 21:56:12 UTC 2014 x86_64 x86_64 x86_64 GNU/Linux |


============================================================================
============================================================================
                          Adding comment to JIRA
============================================================================
============================================================================


Comment added.
e5b124a5adfc3d9eacf1169fda13e24a1f035791 logged out


============================================================================
============================================================================
                              Finished build.
============================================================================
============================================================================


Build step 'Execute shell' marked build as failure
Archiving artifacts
Sending artifact delta relative to PreCommit-YARN-Build #8782
Archived 30 artifacts
Archive block size is 32768
Received 49 blocks and 11896282 bytes
Compression is 11.9%
Took 2.5 sec
[description-setter] Could not determine description.
Recording test results
Email was triggered for: Failure
Sending email for trigger: Failure



###################################################################################
############################## FAILED TESTS (if any) ##############################
2 tests failed.
FAILED:  org.apache.hadoop.yarn.server.resourcemanager.scheduler.capacity.TestContainerAllocation.testAMContainerAllocationWhenDNSUnavailable

Error Message:
expected:<SCHEDULED> but was:<ALLOCATED>

Stack Trace:
java.lang.AssertionError: expected:<SCHEDULED> but was:<ALLOCATED>
	at org.junit.Assert.fail(Assert.java:88)
	at org.junit.Assert.failNotEquals(Assert.java:743)
	at org.junit.Assert.assertEquals(Assert.java:118)
	at org.junit.Assert.assertEquals(Assert.java:144)
	at org.apache.hadoop.yarn.server.resourcemanager.scheduler.capacity.TestContainerAllocation.testAMContainerAllocationWhenDNSUnavailable(TestContainerAllocation.java:321)


FAILED:  org.apache.hadoop.yarn.server.resourcemanager.scheduler.capacity.TestContainerAllocation.testNormalContainerAllocationWhenDNSUnavailable

Error Message:
expected:<0> but was:<1>

Stack Trace:
java.lang.AssertionError: expected:<0> but was:<1>
	at org.junit.Assert.fail(Assert.java:88)
	at org.junit.Assert.failNotEquals(Assert.java:743)
	at org.junit.Assert.assertEquals(Assert.java:118)
	at org.junit.Assert.assertEquals(Assert.java:555)
	at org.junit.Assert.assertEquals(Assert.java:542)
	at org.apache.hadoop.yarn.server.resourcemanager.scheduler.capacity.TestContainerAllocation.testNormalContainerAllocationWhenDNSUnavailable(TestContainerAllocation.java:206)



Mime
  • Unnamed multipart/mixed (inline, None, 0 bytes)
View raw message