hadoop-yarn-dev mailing list archives

Site index · List index
Message view « Date » · « Thread »
Top « Date » · « Thread »
From Apache Jenkins Server <jenk...@builds.apache.org>
Subject Hadoop-Yarn-trunk-Java8 - Build # 275 - Failure
Date Sun, 02 Aug 2015 10:42:52 GMT
See https://builds.apache.org/job/Hadoop-Yarn-trunk-Java8/275/

###################################################################################
########################## LAST 60 LINES OF THE CONSOLE ###########################
[...truncated 4556 lines...]
Tests run: 11, Failures: 0, Errors: 0, Skipped: 0, Time elapsed: 5.389 sec - in org.apache.hadoop.yarn.server.nodemanager.webapp.TestNMWebServices
Java HotSpot(TM) 64-Bit Server VM warning: ignoring option MaxPermSize=768m; support was removed
in 8.0
Running org.apache.hadoop.yarn.server.nodemanager.webapp.TestNMWebServicesApps
Tests run: 19, Failures: 0, Errors: 0, Skipped: 0, Time elapsed: 7.085 sec - in org.apache.hadoop.yarn.server.nodemanager.webapp.TestNMWebServicesApps

Results :

Tests in error: 
  TestDeletionService.testRelativeDelete:170 ยป NoSuchFile /home/jenkins/jenkins-...

Tests run: 326, Failures: 0, Errors: 1, Skipped: 17

[INFO] ------------------------------------------------------------------------
[INFO] Reactor Summary:
[INFO] 
[INFO] Apache Hadoop YARN ................................ SUCCESS [  3.026 s]
[INFO] Apache Hadoop YARN API ............................ SUCCESS [01:22 min]
[INFO] Apache Hadoop YARN Common ......................... SUCCESS [02:18 min]
[INFO] Apache Hadoop YARN Server ......................... SUCCESS [  0.047 s]
[INFO] Apache Hadoop YARN Server Common .................. SUCCESS [ 36.087 s]
[INFO] Apache Hadoop YARN NodeManager .................... FAILURE [05:51 min]
[INFO] Apache Hadoop YARN Web Proxy ...................... SKIPPED
[INFO] Apache Hadoop YARN ApplicationHistoryService ...... SKIPPED
[INFO] Apache Hadoop YARN ResourceManager ................ SKIPPED
[INFO] Apache Hadoop YARN Server Tests ................... SKIPPED
[INFO] Apache Hadoop YARN Client ......................... SKIPPED
[INFO] Apache Hadoop YARN SharedCacheManager ............. SKIPPED
[INFO] Apache Hadoop YARN Applications ................... SKIPPED
[INFO] Apache Hadoop YARN DistributedShell ............... SKIPPED
[INFO] Apache Hadoop YARN Unmanaged Am Launcher .......... SKIPPED
[INFO] Apache Hadoop YARN Site ........................... SKIPPED
[INFO] Apache Hadoop YARN Registry ....................... SKIPPED
[INFO] Apache Hadoop YARN Project ........................ SKIPPED
[INFO] ------------------------------------------------------------------------
[INFO] BUILD FAILURE
[INFO] ------------------------------------------------------------------------
[INFO] Total time: 10:13 min
[INFO] Finished at: 2015-08-02T10:43:24+00:00
[INFO] Final Memory: 85M/1061M
[INFO] ------------------------------------------------------------------------
[ERROR] Failed to execute goal org.apache.maven.plugins:maven-surefire-plugin:2.17:test (default-test)
on project hadoop-yarn-server-nodemanager: There are test failures.
[ERROR] 
[ERROR] Please refer to /home/jenkins/jenkins-slave/workspace/Hadoop-Yarn-trunk-Java8/hadoop-yarn-project/hadoop-yarn/hadoop-yarn-server/hadoop-yarn-server-nodemanager/target/surefire-reports
for the individual test results.
[ERROR] -> [Help 1]
[ERROR] 
[ERROR] To see the full stack trace of the errors, re-run Maven with the -e switch.
[ERROR] Re-run Maven using the -X switch to enable full debug logging.
[ERROR] 
[ERROR] For more information about the errors and possible solutions, please read the following
articles:
[ERROR] [Help 1] http://cwiki.apache.org/confluence/display/MAVEN/MojoFailureException
[ERROR] 
[ERROR] After correcting the problems, you can resume the build with the command
[ERROR]   mvn <goals> -rf :hadoop-yarn-server-nodemanager
Build step 'Execute shell' marked build as failure
Archiving artifacts
Recording test results
Sending e-mails to: yarn-dev@hadoop.apache.org
Email was triggered for: Failure
Sending email for trigger: Failure



###################################################################################
############################## FAILED TESTS (if any) ##############################
1 tests failed.
REGRESSION:  org.apache.hadoop.yarn.server.nodemanager.TestDeletionService.testRelativeDelete

Error Message:
/home/jenkins/jenkins-slave/workspace/Hadoop-Yarn-trunk-Java8/hadoop-yarn-project/hadoop-yarn/hadoop-yarn-server/hadoop-yarn-server-nodemanager/target/org.apache.hadoop.yarn.server.nodemanager.TestDeletionService/5756452024587205252/-7235353235146728411/-2728745436306863994

Stack Trace:
java.nio.file.NoSuchFileException: /home/jenkins/jenkins-slave/workspace/Hadoop-Yarn-trunk-Java8/hadoop-yarn-project/hadoop-yarn/hadoop-yarn-server/hadoop-yarn-server-nodemanager/target/org.apache.hadoop.yarn.server.nodemanager.TestDeletionService/5756452024587205252/-7235353235146728411/-2728745436306863994
	at sun.nio.fs.UnixException.translateToIOException(UnixException.java:86)
	at sun.nio.fs.UnixException.rethrowAsIOException(UnixException.java:102)
	at sun.nio.fs.UnixException.rethrowAsIOException(UnixException.java:107)
	at sun.nio.fs.UnixFileAttributeViews$Basic.readAttributes(UnixFileAttributeViews.java:55)
	at sun.nio.fs.UnixFileSystemProvider.readAttributes(UnixFileSystemProvider.java:144)
	at sun.nio.fs.LinuxFileSystemProvider.readAttributes(LinuxFileSystemProvider.java:99)
	at java.nio.file.Files.readAttributes(Files.java:1734)
	at org.apache.hadoop.fs.RawLocalFileSystem$DeprecatedRawLocalFileStatus.<init>(RawLocalFileSystem.java:658)
	at org.apache.hadoop.fs.RawLocalFileSystem.deprecatedGetFileStatus(RawLocalFileSystem.java:638)
	at org.apache.hadoop.fs.RawLocalFileSystem.getFileLinkStatusInternal(RawLocalFileSystem.java:853)
	at org.apache.hadoop.fs.RawLocalFileSystem.getFileStatus(RawLocalFileSystem.java:630)
	at org.apache.hadoop.fs.DelegateToFileSystem.getFileStatus(DelegateToFileSystem.java:110)
	at org.apache.hadoop.fs.FilterFs.getFileStatus(FilterFs.java:121)
	at org.apache.hadoop.fs.FileContext$15.next(FileContext.java:1164)
	at org.apache.hadoop.fs.FileContext$15.next(FileContext.java:1160)
	at org.apache.hadoop.fs.FSLinkResolver.resolve(FSLinkResolver.java:90)
	at org.apache.hadoop.fs.FileContext.getFileStatus(FileContext.java:1166)
	at org.apache.hadoop.fs.FileContext$Util.exists(FileContext.java:1625)
	at org.apache.hadoop.yarn.server.nodemanager.TestDeletionService.testRelativeDelete(TestDeletionService.java:170)



Mime
  • Unnamed multipart/mixed (inline, None, 0 bytes)
View raw message