hadoop-yarn-dev mailing list archives

Site index · List index
Message view « Date » · « Thread »
Top « Date » · « Thread »
From Apache Jenkins Server <jenk...@builds.apache.org>
Subject Failed: YARN-4024 PreCommit Build #8875
Date Tue, 18 Aug 2015 13:55:53 GMT
Jira: https://issues.apache.org/jira/browse/YARN-4024
Build: https://builds.apache.org/job/PreCommit-YARN-Build/8875/

###################################################################################
########################## LAST 60 LINES OF THE CONSOLE ###########################
[...truncated 331 lines...]
|      |                     |            | warnings.
|  +1  |         yarn tests  |  0m 24s    | Tests passed in hadoop-yarn-api. 
|  -1  |         yarn tests  |  1m 55s    | Tests failed in hadoop-yarn-common. 
|  -1  |         yarn tests  |  57m 27s   | Tests failed in 
|      |                     |            | hadoop-yarn-server-resourcemanager.
|      |                     |  105m 51s  | 


             Reason | Tests
          FindBugs  |  module:hadoop-yarn-server-resourcemanager 
 Failed unit tests  |  hadoop.yarn.util.TestRackResolver 
                    |  hadoop.yarn.server.resourcemanager.scheduler.capacity.TestContainerAllocation



|| Subsystem || Report/Notes ||
============================================================================
| Patch URL | http://issues.apache.org/jira/secure/attachment/12751009/YARN-4024-draft-v3.patch
|
| Optional Tests | javadoc javac unit findbugs checkstyle |
| git revision | trunk / 71566e2 |
| checkstyle |  /home/jenkins/jenkins-slave/workspace/PreCommit-YARN-Build/patchprocess/diffcheckstylehadoop-yarn-api.txt
|
| Findbugs warnings | /home/jenkins/jenkins-slave/workspace/PreCommit-YARN-Build/patchprocess/newPatchFindbugsWarningshadoop-yarn-server-resourcemanager.html
|
| hadoop-yarn-api test log | /home/jenkins/jenkins-slave/workspace/PreCommit-YARN-Build/patchprocess/testrun_hadoop-yarn-api.txt
|
| hadoop-yarn-common test log | /home/jenkins/jenkins-slave/workspace/PreCommit-YARN-Build/patchprocess/testrun_hadoop-yarn-common.txt
|
| hadoop-yarn-server-resourcemanager test log | /home/jenkins/jenkins-slave/workspace/PreCommit-YARN-Build/patchprocess/testrun_hadoop-yarn-server-resourcemanager.txt
|
| Test Results | https://builds.apache.org/job/PreCommit-YARN-Build/8875/testReport/ |
| Java | 1.7.0_55 |
| uname | Linux asf909.gq1.ygridcore.net 3.13.0-36-lowlatency #63-Ubuntu SMP PREEMPT Wed Sep
3 21:56:12 UTC 2014 x86_64 x86_64 x86_64 GNU/Linux |


============================================================================
============================================================================
                          Adding comment to JIRA
============================================================================
============================================================================


Comment added.
2d813545634dad416a606c25bb7c520402df7eca logged out


============================================================================
============================================================================
                              Finished build.
============================================================================
============================================================================


Build step 'Execute shell' marked build as failure
Archiving artifacts
Sending artifact delta relative to PreCommit-YARN-Build #8867
Archived 58 artifacts
Archive block size is 32768
Received 41 blocks and 31381828 bytes
Compression is 4.1%
Took 6.3 sec
[description-setter] Could not determine description.
Recording test results
Email was triggered for: Failure
Sending email for trigger: Failure



###################################################################################
############################## FAILED TESTS (if any) ##############################
3 tests failed.
FAILED:  org.apache.hadoop.yarn.util.TestRackResolver.testCaching

Error Message:
expected:</[default-rack]> but was:</[rack1]>

Stack Trace:
org.junit.ComparisonFailure: expected:</[default-rack]> but was:</[rack1]>
	at org.junit.Assert.assertEquals(Assert.java:115)
	at org.junit.Assert.assertEquals(Assert.java:144)
	at org.apache.hadoop.yarn.util.TestRackResolver.testCaching(TestRackResolver.java:102)


FAILED:  org.apache.hadoop.yarn.server.resourcemanager.scheduler.capacity.TestContainerAllocation.testAMContainerAllocationWhenDNSUnavailable

Error Message:
expected:<SCHEDULED> but was:<ALLOCATED>

Stack Trace:
java.lang.AssertionError: expected:<SCHEDULED> but was:<ALLOCATED>
	at org.junit.Assert.fail(Assert.java:88)
	at org.junit.Assert.failNotEquals(Assert.java:743)
	at org.junit.Assert.assertEquals(Assert.java:118)
	at org.junit.Assert.assertEquals(Assert.java:144)
	at org.apache.hadoop.yarn.server.resourcemanager.scheduler.capacity.TestContainerAllocation.testAMContainerAllocationWhenDNSUnavailable(TestContainerAllocation.java:321)


FAILED:  org.apache.hadoop.yarn.server.resourcemanager.scheduler.capacity.TestContainerAllocation.testNormalContainerAllocationWhenDNSUnavailable

Error Message:
expected:<0> but was:<1>

Stack Trace:
java.lang.AssertionError: expected:<0> but was:<1>
	at org.junit.Assert.fail(Assert.java:88)
	at org.junit.Assert.failNotEquals(Assert.java:743)
	at org.junit.Assert.assertEquals(Assert.java:118)
	at org.junit.Assert.assertEquals(Assert.java:555)
	at org.junit.Assert.assertEquals(Assert.java:542)
	at org.apache.hadoop.yarn.server.resourcemanager.scheduler.capacity.TestContainerAllocation.testNormalContainerAllocationWhenDNSUnavailable(TestContainerAllocation.java:206)



Mime
  • Unnamed multipart/mixed (inline, None, 0 bytes)
View raw message